/home/esolis/Documents/personal/proyectos/nowina/nexu/nexu-public-object-model/src/test/java/lu/nowina/nexu/object/model/FromAPIToPublicObjectModelTestMapper.java
/home/esolis/Documents/personal/proyectos/nowina/nexu/nexu-public-object-model/src/test/java/lu/nowina/nexu/object/model/UtilMappers.java
/home/esolis/Documents/personal/proyectos/nowina/nexu/nexu-public-object-model/src/test/java/lu/nowina/nexu/object/model/TestMarshallUnmarshallJSON.java
/home/esolis/Documents/personal/proyectos/nowina/nexu/nexu-public-object-model/src/test/java/lu/nowina/nexu/object/model/FromPublicObjectModelToAPITestMapper.java
