{
    "config": {
        "beamline": "ip6",
        "build_prefix": "/home/name/.local/share/g4e/g4e-dev/cmake-build-debug",
        "detector": "refdet",
        "executable": "/home/name/.local/share/g4e/g4e-dev/bin/g4e",
        "g4e_home": "/home/name/.local/share/g4e/g4e-dev",
        "is_batch": true,
        "output": "work/calib_gam_1GeV_100000evt",
        "run_context_file": "work/calib_gam_1GeV_100000evt.run.json",
        "run_mac_file": "work/calib_gam_1GeV_100000evt.run.mac",
        "thread_count": 1,
        "work_dir": "/home/name/Desktop/Physics/Research/JLabs/Simulations/calorimetry_studies"
    },
    "user_commands": [
        "/generator/select coneParticleGun",
        "/generator/coneParticleGun/particle gamma",
        "/generator/coneParticleGun/direction 0 0 -1",
        "/generator/coneParticleGun/energy 1 GeV",
        "/generator/coneParticleGun/energyStdDev 0 GeV",
        "/generator/coneParticleGun/coneAngleStdDev 0.4 rad",
        "/generator/coneParticleGun/number 1",
        "/rootOutput/saveSecondaryLevel 0",
        "/run/initialize",
        "/run/beamOn 100000"
    ]
}