      -1  .77724E-04  .19002E+00  .24455E+04  .10000E+01  .61120E+00  .29016E+00  .17157E+04  .57271E-03  .12758E+00  0.003  0.1
1   1    1         2212        0        0           2.49974   0.    99.96875      100.0      0.938272        0.0        0.00        0.000000

