-------------------------------------------------------------------------------
Test set: altunity.alttrashcatj.MainMenuTest
-------------------------------------------------------------------------------
Tests run: 1, Failures: 0, Errors: 0, Skipped: 0, Time elapsed: 1.75 s - in altunity.alttrashcatj.MainMenuTest
