-40 55 0 -132588 -717539 -563519
-40 55 180 -112879 724883 613652
-80 100 0 82843.9 13611.4 2902.53
-80 105 0 24390.4 16172.9 8501.64
-80 20 0 1.06115e+07 -63482.9 -372776
-80 25 0 4.85441e+06 -4592.31 -170897
-80 30 0 2.13549e+06 -35800 -120554
-80 35 0 433369 -165658 -214781
-80 40 0 -693261 -537424 -465476
-80 45 0 -1.00494e+06 -992833 -808472
-80 50 0 -739856 -1.33724e+06 -1.02357e+06
-80 55 0 -303888 -1.44717e+06 -1.13337e+06
-80 60 0 107676 -1.4762e+06 -1.03654e+06
-80 65 0 453700 -1.29309e+06 -1.01985e+06
-80 70 0 727719 -1.10172e+06 -876768
-80 75 0 931774 -879478 -669460
-80 80 0 1.01934e+06 -600151 -432309
-80 85 0 892808 -297096 -238491
-80 90 0 547293 -85952.3 -83158.5
-80 95 0 238875 -5233.91 -17033.3
-80 100 180 83123.6 22399.5 9762.67
-80 105 180 23748.3 20527 4282.37
-80 20 180 1.05107e+07 -82661.2 288987
-80 25 180 4.85694e+06 -39611.6 141888
-80 30 180 2.05452e+06 42402.8 116085
-80 35 180 431980 206386 220726
-80 40 180 -680032 590208 490515
-80 45 180 -978653 1.00471e+06 884116
-80 50 180 -709882 1.36954e+06 1.05832e+06
-80 55 180 -264262 1.42591e+06 1.22112e+06
-80 60 180 149865 1.41161e+06 1.16529e+06
-80 65 180 489281 1.29497e+06 1.04744e+06
-80 70 180 751345 1.1192e+06 888374
-80 75 180 951123 895677 670609
-80 80 180 1.03141e+06 573297 501018
-80 85 180 897740 302191 257711
-80 90 180 545204 110765 93409.4
-80 95 180 241386 39410 28613.3
0 100 0 -15007.6 17315.4 8072.11
0 35 0 1.27725e+06 22740.4 -28879.7
0 55 0 39037.1 12478.9 6590.7
0 80 0 -11287.2 18037.5 6206.64
0 100 180 -15155.2 20063.6 4944.87
0 35 180 1.27191e+06 -8047.03 31564.2
0 55 180 38594.5 24077.8 6383.12
0 80 180 -11334.5 19564.5 6664.77
40 55 0 210324 742004 576317
40 55 180 189996 -677150 -601214
80 100 0 -112883 21007.8 13317
80 105 0 -54029.6 17341.3 10903.6
80 20 0 1.07927e+07 -58684.8 -361851
80 25 0 5.21572e+06 15989 -138800
80 30 0 2.93304e+06 58675.2 -18224.5
80 35 0 2.12067e+06 210915 156806
80 40 0 1.82142e+06 578565 449508
80 45 0 1.44878e+06 1.02317e+06 814196
80 50 0 920393 1.36308e+06 1.03669e+06
80 55 0 381799 1.47222e+06 1.14668e+06
80 60 0 -76173.5 1.50165e+06 1.04849e+06
80 65 0 -446851 1.32016e+06 1.02998e+06
80 70 0 -735371 1.13149e+06 886819
80 75 0 -948170 912014 680197
80 80 0 -1.04225e+06 636266 444800
80 85 0 -920023 335473 251873
80 90 0 -577996 123456 96489.4
80 95 0 -269806 40804 30614
80 100 180 -113423 17749.2 168.633
80 105 180 -53805.2 20576.5 2207.98
80 20 180 1.06922e+07 -93657.4 278343
80 25 180 5.21589e+06 -72916.8 109985
80 30 180 2.87494e+06 -84616.5 6501.9
80 35 180 2.11121e+06 -222199 -157325
80 40 180 1.80203e+06 -575787 -459121
80 45 180 1.41897e+06 -967961 -867299
80 50 180 890590 -1.3239e+06 -1.04644e+06
80 55 180 341319 -1.37779e+06 -1.20838e+06
80 60 180 -119239 -1.36363e+06 -1.15117e+06
80 65 180 -483014 -1.24794e+06 -1.03212e+06
80 70 180 -759097 -1.07429e+06 -873227
80 75 180 -967905 -853306 -656029
80 80 180 -1.05381e+06 -534048 -487551
80 85 180 -925218 -265447 -245541
80 90 180 -575990 -73447.2 -81082.6
80 95 180 -272420 -176.398 -16462.8
