-100 10 0 1.4827e+07 -1.74628e+06 -1.07587e+06
-100 15 0 9.41725e+06 -765975 -463038
-100 20 0 4.63795e+06 -283309 -150198
-100 25 0 2.16473e+06 -92361 -52725.5
-100 30 0 1.09402e+06 -25383.4 -20373.9
-100 35 0 554697 4220.82 -6304.42
-100 40 0 241438 14636.6 -2410.27
-100 45 0 88690.5 14794.5 -2973.33
-100 50 0 30801.5 13200.2 -3510.42
-100 5 0 1.81456e+07 -2.99032e+06 -1.93527e+06
-100 10 180 1.48683e+07 1.3957e+06 1.03738e+06
-100 15 180 9.40774e+06 618234 358100
-100 20 180 4.58438e+06 207888 103791
-100 25 180 2.18467e+06 70868 33954.5
-100 30 180 1.10335e+06 24139.7 7947.59
-100 35 180 555173 6021.14 -3099.81
-100 40 180 238328 1327.75 -4811.95
-100 45 180 89640.3 3138.29 -2676.82
-100 50 180 30286.4 5505.14 -2071.78
-100 5 180 1.81315e+07 2.41666e+06 1.85111e+06
-1500 20 0 1.74539e+07 -526440 -125001
-1500 20 180 1.71474e+07 229971 -42283.2
-3000 20 0 3.11841e+07 -786450 -97778.3
-3000 20 180 3.05606e+07 253589 -198954
0 20 0 3.71656e+06 -265711 -151417
0 20 180 3.70944e+06 206601 113958
100 10 0 8.99267e+06 -1.73816e+06 -1.12096e+06
100 15 0 5.73584e+06 -718271 -480775
100 20 0 2.81133e+06 -248981 -153992
100 25 0 1.30914e+06 -75565.7 -52961.2
100 30 0 659580 -18577.2 -21127.7
100 35 0 332291 5394.64 -8230.4
100 40 0 140743 13926.5 -4062.76
100 45 0 47207.9 14367.8 -3715.48
100 50 0 12066 13044.2 -3810.67
100 5 0 1.11459e+07 -3.07005e+06 -2.05714e+06
100 10 180 9.03181e+06 1.50676e+06 1.13565e+06
100 15 180 5.73601e+06 637479 412169
100 20 180 2.80815e+06 204991 125091
100 25 180 1.32318e+06 69305.3 42025.3
100 30 180 665828 25496 12522.8
100 35 180 332406 8694.06 915.009
100 40 180 138180 3503.83 -2103.53
100 45 180 47854.4 4235.66 -1485.2
100 50 180 11579.5 5977.28 -1588.25
100 5 180 1.11566e+07 2.65795e+06 2.05269e+06
1500 20 0 -1.00187e+07 -5099.28 -179337
1500 20 180 -9.71781e+06 183195 271510
3000 20 0 -2.37377e+07 254231 -206410
3000 20 180 -2.31467e+07 159522 430027
