{
  "$schema": "../../node_modules/ng-packagr/ng-package.schema.json",
  "dest": "../../dist/nr-select",
  "lib": {
    "entryFile": "src/public-api.ts"
  },
  "whitelistedNonPeerDependencies": [
    "."
  ],
  "assets": [
    "./assets/css/nr-select.scss"
  ]
}
