%!PS-Adobe-3.0 EPSF-3.0
%%Title: figures/nekbone-12-node-new-governor/nekbone_150_balanced_epoch_iteration_frequency_socket_0.eps
%%Creator: matplotlib version 2.0.0, http://matplotlib.org/
%%CreationDate: Tue Mar 21 13:48:54 2017
%%Orientation: portrait
%%BoundingBox: 54 180 558 612
%%EndComments
%%BeginProlog
/mpldict 8 dict def
mpldict begin
/m { moveto } bind def
/l { lineto } bind def
/r { rlineto } bind def
/c { curveto } bind def
/cl { closepath } bind def
/box {
m
1 index 0 r
0 exch r
neg 0 r
cl
} bind def
/clipbox {
box
clip
newpath
} bind def
%!PS-Adobe-3.0 Resource-Font
%%Title: DejaVu Sans
%%Copyright: Copyright (c) 2003 by Bitstream, Inc. All Rights Reserved. Copyright (c) 2006 by Tavmjong Bah. All Rights Reserved. DejaVu changes are in public domain 
%%Creator: Converted from TrueType to type 3 by PPR
25 dict begin
/_d{bind def}bind def
/_m{moveto}_d
/_l{lineto}_d
/_cl{closepath eofill}_d
/_c{curveto}_d
/_sc{7 -1 roll{setcachedevice}{pop pop pop pop pop pop}ifelse}_d
/_e{exec}_d
/FontName /DejaVuSans def
/PaintType 0 def
/FontMatrix[.001 0 0 .001 0 0]def
/FontBBox[-1021 -463 1793 1232]def
/FontType 3 def
/Encoding [ /space /numbersign /parenleft /parenright /hyphen /period /zero /one /two /three /four /five /six /seven /eight /nine /at /F /I /K /L /M /N /W /a /b /c /d /e /g /h /i /k /l /m /n /o /p /q /r /s /t /u /y /z ] def
/FontInfo 10 dict dup begin
/FamilyName (DejaVu Sans) def
/FullName (DejaVu Sans) def
/Notice (Copyright (c) 2003 by Bitstream, Inc. All Rights Reserved. Copyright (c) 2006 by Tavmjong Bah. All Rights Reserved. DejaVu changes are in public domain ) def
/Weight (Book) def
/Version (Version 2.35) def
/ItalicAngle 0.0 def
/isFixedPitch false def
/UnderlinePosition -130 def
/UnderlineThickness 90 def
end readonly def
/CharStrings 45 dict dup begin
/space{318 0 0 0 0 0 _sc
}_d
/numbersign{{838 0 77 0 761 718 _sc
511 440 _m
369 440 _l
328 277 _l
471 277 _l
511 440 _l
438 718 _m
387 515 _l
530 515 _l
581 718 _l
659 718 _l
609 515 _l
761 515 _l
761 440 _l
590 440 _l
550 277 _l
705 277 _l
705 202 _l
531 202 _l
480 0 _l
402 0 _l
452 202 _l
309 202 _l
259 0 _l
180 0 _l
231 202 _l
77 202 _l
77 277 _l
249 277 _l
290 440 _l
133 440 _l
}_e{133 515 _l
309 515 _l
359 718 _l
438 718 _l
_cl}_e}_d
/parenleft{390 0 86 -131 310 759 _sc
310 759 _m
266 683 234 609 213 536 _c
191 463 181 389 181 314 _c
181 238 191 164 213 91 _c
234 17 266 -56 310 -131 _c
232 -131 _l
183 -54 146 20 122 94 _c
98 168 86 241 86 314 _c
86 386 98 459 122 533 _c
146 607 182 682 232 759 _c
310 759 _l
_cl}_d
/parenright{390 0 80 -131 304 759 _sc
80 759 _m
158 759 _l
206 682 243 607 267 533 _c
291 459 304 386 304 314 _c
304 241 291 168 267 94 _c
243 20 206 -54 158 -131 _c
80 -131 _l
123 -56 155 17 177 91 _c
198 164 209 238 209 314 _c
209 389 198 463 177 536 _c
155 609 123 683 80 759 _c
_cl}_d
/hyphen{361 0 49 234 312 314 _sc
49 314 _m
312 314 _l
312 234 _l
49 234 _l
49 314 _l
_cl}_d
/period{318 0 107 0 210 124 _sc
107 124 _m
210 124 _l
210 0 _l
107 0 _l
107 124 _l
_cl}_d
/zero{636 0 66 -13 570 742 _sc
318 664 _m
267 664 229 639 203 589 _c
177 539 165 464 165 364 _c
165 264 177 189 203 139 _c
229 89 267 64 318 64 _c
369 64 407 89 433 139 _c
458 189 471 264 471 364 _c
471 464 458 539 433 589 _c
407 639 369 664 318 664 _c
318 742 _m
399 742 461 709 505 645 _c
548 580 570 486 570 364 _c
570 241 548 147 505 83 _c
461 19 399 -13 318 -13 _c
236 -13 173 19 130 83 _c
87 147 66 241 66 364 _c
66 486 87 580 130 645 _c
173 709 236 742 318 742 _c
_cl}_d
/one{636 0 110 0 544 729 _sc
124 83 _m
285 83 _l
285 639 _l
110 604 _l
110 694 _l
284 729 _l
383 729 _l
383 83 _l
544 83 _l
544 0 _l
124 0 _l
124 83 _l
_cl}_d
/two{{636 0 73 0 536 742 _sc
192 83 _m
536 83 _l
536 0 _l
73 0 _l
73 83 _l
110 121 161 173 226 239 _c
290 304 331 346 348 365 _c
380 400 402 430 414 455 _c
426 479 433 504 433 528 _c
433 566 419 598 392 622 _c
365 646 330 659 286 659 _c
255 659 222 653 188 643 _c
154 632 117 616 78 594 _c
78 694 _l
118 710 155 722 189 730 _c
223 738 255 742 284 742 _c
}_e{359 742 419 723 464 685 _c
509 647 532 597 532 534 _c
532 504 526 475 515 449 _c
504 422 484 390 454 354 _c
446 344 420 317 376 272 _c
332 227 271 164 192 83 _c
_cl}_e}_d
/three{{636 0 76 -13 556 742 _sc
406 393 _m
453 383 490 362 516 330 _c
542 298 556 258 556 212 _c
556 140 531 84 482 45 _c
432 6 362 -13 271 -13 _c
240 -13 208 -10 176 -4 _c
144 1 110 10 76 22 _c
76 117 _l
103 101 133 89 166 81 _c
198 73 232 69 268 69 _c
330 69 377 81 409 105 _c
441 129 458 165 458 212 _c
458 254 443 288 413 312 _c
383 336 341 349 287 349 _c
}_e{202 349 _l
202 430 _l
291 430 _l
339 430 376 439 402 459 _c
428 478 441 506 441 543 _c
441 580 427 609 401 629 _c
374 649 336 659 287 659 _c
260 659 231 656 200 650 _c
169 644 135 635 98 623 _c
98 711 _l
135 721 170 729 203 734 _c
235 739 266 742 296 742 _c
370 742 429 725 473 691 _c
517 657 539 611 539 553 _c
539 513 527 479 504 451 _c
481 423 448 403 406 393 _c
_cl}_e}_d
/four{636 0 49 0 580 729 _sc
378 643 _m
129 254 _l
378 254 _l
378 643 _l
352 729 _m
476 729 _l
476 254 _l
580 254 _l
580 172 _l
476 172 _l
476 0 _l
378 0 _l
378 172 _l
49 172 _l
49 267 _l
352 729 _l
_cl}_d
/five{{636 0 77 -13 549 729 _sc
108 729 _m
495 729 _l
495 646 _l
198 646 _l
198 467 _l
212 472 227 476 241 478 _c
255 480 270 482 284 482 _c
365 482 429 459 477 415 _c
525 370 549 310 549 234 _c
549 155 524 94 475 51 _c
426 8 357 -13 269 -13 _c
238 -13 207 -10 175 -6 _c
143 -1 111 6 77 17 _c
77 116 _l
106 100 136 88 168 80 _c
199 72 232 69 267 69 _c
}_e{323 69 368 83 401 113 _c
433 143 450 183 450 234 _c
450 284 433 324 401 354 _c
368 384 323 399 267 399 _c
241 399 214 396 188 390 _c
162 384 135 375 108 363 _c
108 729 _l
_cl}_e}_d
/six{{636 0 70 -13 573 742 _sc
330 404 _m
286 404 251 388 225 358 _c
199 328 186 286 186 234 _c
186 181 199 139 225 109 _c
251 79 286 64 330 64 _c
374 64 409 79 435 109 _c
461 139 474 181 474 234 _c
474 286 461 328 435 358 _c
409 388 374 404 330 404 _c
526 713 _m
526 623 _l
501 635 476 644 451 650 _c
425 656 400 659 376 659 _c
310 659 260 637 226 593 _c
}_e{192 549 172 482 168 394 _c
187 422 211 444 240 459 _c
269 474 301 482 336 482 _c
409 482 467 459 509 415 _c
551 371 573 310 573 234 _c
573 159 550 99 506 54 _c
462 9 403 -13 330 -13 _c
246 -13 181 19 137 83 _c
92 147 70 241 70 364 _c
70 479 97 571 152 639 _c
206 707 280 742 372 742 _c
396 742 421 739 447 735 _c
472 730 498 723 526 713 _c
_cl}_e}_d
/seven{636 0 82 0 551 729 _sc
82 729 _m
551 729 _l
551 687 _l
286 0 _l
183 0 _l
432 646 _l
82 646 _l
82 729 _l
_cl}_d
/eight{{636 0 68 -13 568 742 _sc
318 346 _m
271 346 234 333 207 308 _c
180 283 167 249 167 205 _c
167 161 180 126 207 101 _c
234 76 271 64 318 64 _c
364 64 401 76 428 102 _c
455 127 469 161 469 205 _c
469 249 455 283 429 308 _c
402 333 365 346 318 346 _c
219 388 _m
177 398 144 418 120 447 _c
96 476 85 511 85 553 _c
85 611 105 657 147 691 _c
188 725 245 742 318 742 _c
}_e{390 742 447 725 489 691 _c
530 657 551 611 551 553 _c
551 511 539 476 515 447 _c
491 418 459 398 417 388 _c
464 377 501 355 528 323 _c
554 291 568 251 568 205 _c
568 134 546 80 503 43 _c
459 5 398 -13 318 -13 _c
237 -13 175 5 132 43 _c
89 80 68 134 68 205 _c
68 251 81 291 108 323 _c
134 355 171 377 219 388 _c
183 544 _m
183 506 194 476 218 455 _c
}_e{242 434 275 424 318 424 _c
360 424 393 434 417 455 _c
441 476 453 506 453 544 _c
453 582 441 611 417 632 _c
393 653 360 664 318 664 _c
275 664 242 653 218 632 _c
194 611 183 582 183 544 _c
_cl}_e}_d
/nine{{636 0 63 -13 566 742 _sc
110 15 _m
110 105 _l
134 93 159 84 185 78 _c
210 72 235 69 260 69 _c
324 69 374 90 408 134 _c
442 178 462 244 468 334 _c
448 306 424 284 396 269 _c
367 254 335 247 300 247 _c
226 247 168 269 126 313 _c
84 357 63 417 63 494 _c
63 568 85 628 129 674 _c
173 719 232 742 306 742 _c
390 742 455 709 499 645 _c
543 580 566 486 566 364 _c
}_e{566 248 538 157 484 89 _c
429 21 356 -13 264 -13 _c
239 -13 214 -10 189 -6 _c
163 -2 137 5 110 15 _c
306 324 _m
350 324 385 339 411 369 _c
437 399 450 441 450 494 _c
450 546 437 588 411 618 _c
385 648 350 664 306 664 _c
262 664 227 648 201 618 _c
175 588 162 546 162 494 _c
162 441 175 399 201 369 _c
227 339 262 324 306 324 _c
_cl}_e}_d
/at{{1000 0 66 -173 930 704 _sc
372 262 _m
372 215 383 178 406 152 _c
429 126 461 113 502 113 _c
542 113 573 126 596 153 _c
619 179 631 216 631 262 _c
631 308 619 344 596 371 _c
572 397 541 411 501 411 _c
461 411 430 397 407 371 _c
383 344 372 308 372 262 _c
638 116 _m
618 91 596 73 571 61 _c
545 49 516 43 483 43 _c
427 43 381 63 346 104 _c
311 144 294 197 294 262 _c
}_e{294 327 311 380 346 421 _c
381 461 427 482 483 482 _c
516 482 545 475 571 463 _c
596 451 618 432 638 408 _c
638 472 _l
708 472 _l
708 113 _l
755 120 792 142 819 178 _c
846 214 860 261 860 319 _c
860 353 854 386 844 417 _c
834 447 818 476 798 502 _c
764 544 722 577 674 600 _c
625 622 572 634 515 634 _c
475 634 436 628 400 618 _c
363 607 329 591 298 571 _c
}_e{246 537 206 494 178 440 _c
149 386 135 327 135 265 _c
135 213 144 165 163 120 _c
181 74 208 34 244 0 _c
278 -33 317 -58 362 -76 _c
407 -94 455 -103 507 -103 _c
549 -103 590 -96 630 -82 _c
670 -68 708 -47 742 -21 _c
786 -75 _l
745 -107 701 -131 653 -148 _c
605 -164 556 -173 507 -173 _c
447 -173 390 -162 336 -141 _c
282 -119 235 -88 194 -48 _c
152 -8 120 38 98 92 _c
}_e{76 146 66 203 66 265 _c
66 324 77 380 99 434 _c
121 488 152 535 194 576 _c
236 617 284 649 339 671 _c
394 693 452 704 514 704 _c
583 704 647 689 706 661 _c
765 633 815 593 855 541 _c
879 509 898 474 911 437 _c
923 399 930 361 930 321 _c
930 235 904 167 852 118 _c
800 68 729 43 638 41 _c
638 116 _l
_cl}_e}_d
/F{575 0 98 0 517 729 _sc
98 729 _m
517 729 _l
517 646 _l
197 646 _l
197 431 _l
486 431 _l
486 348 _l
197 348 _l
197 0 _l
98 0 _l
98 729 _l
_cl}_d
/I{295 0 98 0 197 729 _sc
98 729 _m
197 729 _l
197 0 _l
98 0 _l
98 729 _l
_cl}_d
/K{656 0 98 0 677 729 _sc
98 729 _m
197 729 _l
197 421 _l
524 729 _l
651 729 _l
289 389 _l
677 0 _l
547 0 _l
197 351 _l
197 0 _l
98 0 _l
98 729 _l
_cl}_d
/L{557 0 98 0 552 729 _sc
98 729 _m
197 729 _l
197 83 _l
552 83 _l
552 0 _l
98 0 _l
98 729 _l
_cl}_d
/M{863 0 98 0 765 729 _sc
98 729 _m
245 729 _l
431 233 _l
618 729 _l
765 729 _l
765 0 _l
669 0 _l
669 640 _l
481 140 _l
382 140 _l
194 640 _l
194 0 _l
98 0 _l
98 729 _l
_cl}_d
/N{748 0 98 0 650 729 _sc
98 729 _m
231 729 _l
554 119 _l
554 729 _l
650 729 _l
650 0 _l
517 0 _l
194 610 _l
194 0 _l
98 0 _l
98 729 _l
_cl}_d
/W{989 0 33 0 956 729 _sc
33 729 _m
133 729 _l
286 113 _l
439 729 _l
550 729 _l
703 113 _l
856 729 _l
956 729 _l
773 0 _l
649 0 _l
495 633 _l
340 0 _l
216 0 _l
33 729 _l
_cl}_d
/a{{613 0 60 -13 522 560 _sc
343 275 _m
270 275 220 266 192 250 _c
164 233 150 205 150 165 _c
150 133 160 107 181 89 _c
202 70 231 61 267 61 _c
317 61 357 78 387 114 _c
417 149 432 196 432 255 _c
432 275 _l
343 275 _l
522 312 _m
522 0 _l
432 0 _l
432 83 _l
411 49 385 25 355 10 _c
325 -5 287 -13 243 -13 _c
187 -13 142 2 109 33 _c
76 64 60 106 60 159 _c
}_e{60 220 80 266 122 298 _c
163 329 224 345 306 345 _c
432 345 _l
432 354 _l
432 395 418 427 391 450 _c
364 472 326 484 277 484 _c
245 484 215 480 185 472 _c
155 464 127 453 100 439 _c
100 522 _l
132 534 164 544 195 550 _c
226 556 256 560 286 560 _c
365 560 424 539 463 498 _c
502 457 522 395 522 312 _c
_cl}_e}_d
/b{{635 0 91 -13 580 760 _sc
487 273 _m
487 339 473 390 446 428 _c
418 466 381 485 334 485 _c
286 485 249 466 222 428 _c
194 390 181 339 181 273 _c
181 207 194 155 222 117 _c
249 79 286 61 334 61 _c
381 61 418 79 446 117 _c
473 155 487 207 487 273 _c
181 464 _m
199 496 223 520 252 536 _c
281 552 316 560 356 560 _c
422 560 476 533 518 481 _c
559 428 580 359 580 273 _c
}_e{580 187 559 117 518 65 _c
476 13 422 -13 356 -13 _c
316 -13 281 -5 252 10 _c
223 25 199 49 181 82 _c
181 0 _l
91 0 _l
91 760 _l
181 760 _l
181 464 _l
_cl}_e}_d
/c{{550 0 55 -13 488 560 _sc
488 526 _m
488 442 _l
462 456 437 466 411 473 _c
385 480 360 484 334 484 _c
276 484 230 465 198 428 _c
166 391 150 339 150 273 _c
150 206 166 154 198 117 _c
230 80 276 62 334 62 _c
360 62 385 65 411 72 _c
437 79 462 90 488 104 _c
488 21 _l
462 9 436 0 410 -5 _c
383 -10 354 -13 324 -13 _c
242 -13 176 12 128 64 _c
}_e{79 115 55 185 55 273 _c
55 362 79 432 128 483 _c
177 534 244 560 330 560 _c
358 560 385 557 411 551 _c
437 545 463 537 488 526 _c
_cl}_e}_d
/d{{635 0 55 -13 544 760 _sc
454 464 _m
454 760 _l
544 760 _l
544 0 _l
454 0 _l
454 82 _l
435 49 411 25 382 10 _c
353 -5 319 -13 279 -13 _c
213 -13 159 13 117 65 _c
75 117 55 187 55 273 _c
55 359 75 428 117 481 _c
159 533 213 560 279 560 _c
319 560 353 552 382 536 _c
411 520 435 496 454 464 _c
148 273 _m
148 207 161 155 188 117 _c
215 79 253 61 301 61 _c
}_e{348 61 385 79 413 117 _c
440 155 454 207 454 273 _c
454 339 440 390 413 428 _c
385 466 348 485 301 485 _c
253 485 215 466 188 428 _c
161 390 148 339 148 273 _c
_cl}_e}_d
/e{{615 0 55 -13 562 560 _sc
562 296 _m
562 252 _l
149 252 _l
153 190 171 142 205 110 _c
238 78 284 62 344 62 _c
378 62 412 66 444 74 _c
476 82 509 95 541 113 _c
541 28 _l
509 14 476 3 442 -3 _c
408 -9 373 -13 339 -13 _c
251 -13 182 12 131 62 _c
80 112 55 181 55 268 _c
55 357 79 428 127 481 _c
175 533 241 560 323 560 _c
397 560 455 536 498 489 _c
}_e{540 441 562 377 562 296 _c
472 322 _m
471 371 457 410 431 440 _c
404 469 368 484 324 484 _c
274 484 234 469 204 441 _c
174 413 156 373 152 322 _c
472 322 _l
_cl}_e}_d
/g{{635 0 55 -207 544 560 _sc
454 280 _m
454 344 440 395 414 431 _c
387 467 349 485 301 485 _c
253 485 215 467 188 431 _c
161 395 148 344 148 280 _c
148 215 161 165 188 129 _c
215 93 253 75 301 75 _c
349 75 387 93 414 129 _c
440 165 454 215 454 280 _c
544 68 _m
544 -24 523 -93 482 -139 _c
440 -184 377 -207 292 -207 _c
260 -207 231 -204 203 -200 _c
175 -195 147 -188 121 -178 _c
}_e{121 -91 _l
147 -105 173 -115 199 -122 _c
225 -129 251 -133 278 -133 _c
336 -133 380 -117 410 -87 _c
439 -56 454 -10 454 52 _c
454 96 _l
435 64 411 40 382 24 _c
353 8 319 0 279 0 _c
211 0 157 25 116 76 _c
75 127 55 195 55 280 _c
55 364 75 432 116 483 _c
157 534 211 560 279 560 _c
319 560 353 552 382 536 _c
411 520 435 496 454 464 _c
454 547 _l
544 547 _l
}_e{544 68 _l
_cl}_e}_d
/h{634 0 91 0 549 760 _sc
549 330 _m
549 0 _l
459 0 _l
459 327 _l
459 379 448 417 428 443 _c
408 469 378 482 338 482 _c
289 482 251 466 223 435 _c
195 404 181 362 181 309 _c
181 0 _l
91 0 _l
91 760 _l
181 760 _l
181 462 _l
202 494 227 519 257 535 _c
286 551 320 560 358 560 _c
420 560 468 540 500 501 _c
532 462 549 405 549 330 _c
_cl}_d
/i{278 0 94 0 184 760 _sc
94 547 _m
184 547 _l
184 0 _l
94 0 _l
94 547 _l
94 760 _m
184 760 _l
184 646 _l
94 646 _l
94 760 _l
_cl}_d
/k{579 0 91 0 576 760 _sc
91 760 _m
181 760 _l
181 311 _l
449 547 _l
564 547 _l
274 291 _l
576 0 _l
459 0 _l
181 267 _l
181 0 _l
91 0 _l
91 760 _l
_cl}_d
/l{278 0 94 0 184 760 _sc
94 760 _m
184 760 _l
184 0 _l
94 0 _l
94 760 _l
_cl}_d
/m{{974 0 91 0 889 560 _sc
520 442 _m
542 482 569 511 600 531 _c
631 550 668 560 711 560 _c
767 560 811 540 842 500 _c
873 460 889 403 889 330 _c
889 0 _l
799 0 _l
799 327 _l
799 379 789 418 771 444 _c
752 469 724 482 686 482 _c
639 482 602 466 575 435 _c
548 404 535 362 535 309 _c
535 0 _l
445 0 _l
445 327 _l
445 379 435 418 417 444 _c
398 469 369 482 331 482 _c
}_e{285 482 248 466 221 435 _c
194 404 181 362 181 309 _c
181 0 _l
91 0 _l
91 547 _l
181 547 _l
181 462 _l
201 495 226 520 255 536 _c
283 552 317 560 357 560 _c
397 560 430 550 458 530 _c
486 510 506 480 520 442 _c
_cl}_e}_d
/n{634 0 91 0 549 560 _sc
549 330 _m
549 0 _l
459 0 _l
459 327 _l
459 379 448 417 428 443 _c
408 469 378 482 338 482 _c
289 482 251 466 223 435 _c
195 404 181 362 181 309 _c
181 0 _l
91 0 _l
91 547 _l
181 547 _l
181 462 _l
202 494 227 519 257 535 _c
286 551 320 560 358 560 _c
420 560 468 540 500 501 _c
532 462 549 405 549 330 _c
_cl}_d
/o{612 0 55 -13 557 560 _sc
306 484 _m
258 484 220 465 192 427 _c
164 389 150 338 150 273 _c
150 207 163 156 191 118 _c
219 80 257 62 306 62 _c
354 62 392 80 420 118 _c
448 156 462 207 462 273 _c
462 337 448 389 420 427 _c
392 465 354 484 306 484 _c
306 560 _m
384 560 445 534 490 484 _c
534 433 557 363 557 273 _c
557 183 534 113 490 63 _c
445 12 384 -13 306 -13 _c
227 -13 165 12 121 63 _c
77 113 55 183 55 273 _c
55 363 77 433 121 484 _c
165 534 227 560 306 560 _c
_cl}_d
/p{{635 0 91 -207 580 560 _sc
181 82 _m
181 -207 _l
91 -207 _l
91 547 _l
181 547 _l
181 464 _l
199 496 223 520 252 536 _c
281 552 316 560 356 560 _c
422 560 476 533 518 481 _c
559 428 580 359 580 273 _c
580 187 559 117 518 65 _c
476 13 422 -13 356 -13 _c
316 -13 281 -5 252 10 _c
223 25 199 49 181 82 _c
487 273 _m
487 339 473 390 446 428 _c
418 466 381 485 334 485 _c
}_e{286 485 249 466 222 428 _c
194 390 181 339 181 273 _c
181 207 194 155 222 117 _c
249 79 286 61 334 61 _c
381 61 418 79 446 117 _c
473 155 487 207 487 273 _c
_cl}_e}_d
/q{{635 0 55 -207 544 560 _sc
148 273 _m
148 207 161 155 188 117 _c
215 79 253 61 301 61 _c
348 61 385 79 413 117 _c
440 155 454 207 454 273 _c
454 339 440 390 413 428 _c
385 466 348 485 301 485 _c
253 485 215 466 188 428 _c
161 390 148 339 148 273 _c
454 82 _m
435 49 411 25 382 10 _c
353 -5 319 -13 279 -13 _c
213 -13 159 13 117 65 _c
75 117 55 187 55 273 _c
}_e{55 359 75 428 117 481 _c
159 533 213 560 279 560 _c
319 560 353 552 382 536 _c
411 520 435 496 454 464 _c
454 547 _l
544 547 _l
544 -207 _l
454 -207 _l
454 82 _l
_cl}_e}_d
/r{411 0 91 0 411 560 _sc
411 463 _m
401 469 390 473 378 476 _c
366 478 353 480 339 480 _c
288 480 249 463 222 430 _c
194 397 181 350 181 288 _c
181 0 _l
91 0 _l
91 547 _l
181 547 _l
181 462 _l
199 495 224 520 254 536 _c
284 552 321 560 365 560 _c
371 560 378 559 386 559 _c
393 558 401 557 411 555 _c
411 463 _l
_cl}_d
/s{{521 0 54 -13 472 560 _sc
443 531 _m
443 446 _l
417 458 391 468 364 475 _c
336 481 308 485 279 485 _c
234 485 200 478 178 464 _c
156 450 145 430 145 403 _c
145 382 153 366 169 354 _c
185 342 217 330 265 320 _c
296 313 _l
360 299 405 279 432 255 _c
458 230 472 195 472 151 _c
472 100 452 60 412 31 _c
372 1 316 -13 246 -13 _c
216 -13 186 -10 154 -5 _c
}_e{122 0 89 8 54 20 _c
54 113 _l
87 95 120 82 152 74 _c
184 65 216 61 248 61 _c
290 61 323 68 346 82 _c
368 96 380 117 380 144 _c
380 168 371 187 355 200 _c
339 213 303 226 247 238 _c
216 245 _l
160 257 119 275 95 299 _c
70 323 58 356 58 399 _c
58 450 76 490 112 518 _c
148 546 200 560 268 560 _c
301 560 332 557 362 552 _c
391 547 418 540 443 531 _c
}_e{_cl}_e}_d
/t{392 0 27 0 368 702 _sc
183 702 _m
183 547 _l
368 547 _l
368 477 _l
183 477 _l
183 180 _l
183 135 189 106 201 94 _c
213 81 238 75 276 75 _c
368 75 _l
368 0 _l
276 0 _l
206 0 158 13 132 39 _c
106 65 93 112 93 180 _c
93 477 _l
27 477 _l
27 547 _l
93 547 _l
93 702 _l
183 702 _l
_cl}_d
/u{634 0 85 -13 543 560 _sc
85 216 _m
85 547 _l
175 547 _l
175 219 _l
175 167 185 129 205 103 _c
225 77 255 64 296 64 _c
344 64 383 79 411 110 _c
439 141 453 183 453 237 _c
453 547 _l
543 547 _l
543 0 _l
453 0 _l
453 84 _l
431 50 405 26 377 10 _c
348 -5 315 -13 277 -13 _c
214 -13 166 6 134 45 _c
101 83 85 140 85 216 _c
311 560 _m
311 560 _l
_cl}_d
/y{592 0 30 -207 562 547 _sc
322 -50 _m
296 -114 271 -157 247 -177 _c
223 -197 191 -207 151 -207 _c
79 -207 _l
79 -132 _l
132 -132 _l
156 -132 175 -126 189 -114 _c
203 -102 218 -75 235 -31 _c
251 9 _l
30 547 _l
125 547 _l
296 119 _l
467 547 _l
562 547 _l
322 -50 _l
_cl}_d
/z{525 0 43 0 482 547 _sc
55 547 _m
482 547 _l
482 465 _l
144 72 _l
482 72 _l
482 0 _l
43 0 _l
43 82 _l
381 475 _l
55 475 _l
55 547 _l
_cl}_d
end readonly def

/BuildGlyph
 {exch begin
 CharStrings exch
 2 copy known not{pop /.notdef}if
 true 3 1 roll get exec
 end}_d

/BuildChar {
 1 index /Encoding get exch get
 1 index /BuildGlyph get exec
}_d

FontName currentdict end definefont pop
end
%%EndProlog
mpldict begin
54 180 translate
504 432 0 0 clipbox
gsave
0 0 m
504 0 l
504 432 l
0 432 l
cl
1.000 setgray
fill
grestore
gsave
68.0175 58.68 m
471.47625 58.68 l
471.47625 367.528 l
68.0175 367.528 l
cl
1.000 setgray
fill
grestore
1.000 setlinewidth
1 setlinejoin
2 setlinecap
[] 0 setdash
0.050 0.030 0.528 setrgbcolor
gsave
403.5 308.8 68.02 58.68 clipbox
68.0175 335.851394 m
106.733239 335.851511 l
108.770909 284.491574 l
110.80858 269.585204 l
112.84625 269.072505 l
114.88392 269.133048 l
116.921591 268.711244 l
118.959261 269.67583 l
120.996932 269.559356 l
123.034602 269.159912 l
125.072273 269.906637 l
129.147614 268.897482 l
131.185284 271.752646 l
133.222955 270.373472 l
135.260625 264.734694 l
137.298295 267.426602 l
139.335966 272.042984 l
141.373636 272.46845 l
143.411307 272.646745 l
145.448977 271.77379 l
147.486648 271.677839 l
149.524318 271.801088 l
151.561989 272.360694 l
153.599659 271.470495 l
155.63733 272.892135 l
157.675 271.48667 l
159.71267 261.738629 l
161.750341 261.388714 l
163.788011 260.193645 l
165.825682 261.7872 l
167.863352 263.728998 l
169.901023 258.866355 l
171.938693 260.834093 l
173.976364 260.843972 l
176.014034 261.304324 l
178.051705 260.553069 l
180.089375 263.746842 l
182.127045 256.701777 l
184.164716 245.2882 l
186.202386 250.977688 l
188.240057 246.983212 l
190.277727 246.165766 l
192.315398 246.158944 l
194.353068 247.41158 l
196.390739 243.685843 l
198.428409 249.713767 l
200.46608 246.191884 l
202.50375 245.123284 l
204.54142 246.54161 l
206.579091 246.278607 l
208.616761 246.323427 l
210.654432 244.202001 l
212.692102 253.220489 l
214.729773 251.609145 l
216.767443 253.786038 l
218.805114 251.623957 l
220.842784 251.994269 l
224.918125 251.308978 l
226.955795 250.520914 l
228.993466 248.824127 l
231.031136 249.748946 l
233.068807 254.64059 l
235.106477 250.841258 l
237.144148 250.347232 l
239.181818 251.43863 l
241.219489 255.49192 l
243.257159 255.000637 l
245.29483 255.932325 l
247.3325 252.801658 l
249.37017 255.075815 l
251.407841 255.235556 l
253.445511 253.776963 l
255.483182 255.148539 l
257.520852 254.102591 l
259.558523 254.75185 l
261.596193 253.572843 l
263.633864 255.500705 l
265.671534 252.282332 l
267.709205 256.202083 l
269.746875 335.492288 l
271.784545 335.851172 l
298.274261 335.851455 l
300.311932 328.367153 l
302.349602 270.441108 l
304.387273 273.105515 l
306.424943 270.40553 l
308.462614 270.394714 l
310.500284 243.761985 l
312.537955 228.906214 l
314.575625 230.951352 l
316.613295 232.815334 l
318.650966 228.874574 l
320.688636 229.412614 l
322.726307 231.500147 l
324.763977 230.809355 l
326.801648 233.170019 l
328.839318 260.961634 l
330.876989 275.631703 l
332.914659 275.893843 l
334.95233 275.495602 l
336.99 275.28731 l
339.02767 273.897269 l
341.065341 275.954233 l
343.103011 274.022139 l
345.140682 258.859574 l
347.178352 261.083201 l
349.216023 260.766445 l
351.253693 259.139011 l
353.291364 261.346614 l
355.329034 260.832332 l
357.366705 260.836921 l
359.404375 259.698497 l
361.442045 260.481221 l
363.479716 259.742099 l
365.517386 259.564652 l
369.592727 262.395044 l
371.630398 257.485533 l
373.668068 256.351646 l
375.705739 252.970074 l
377.743409 256.36905 l
379.78108 254.830329 l
383.85642 255.090005 l
385.894091 257.330127 l
387.931761 256.060868 l
389.969432 254.472443 l
392.007102 256.079577 l
394.044773 252.207567 l
396.082443 254.671449 l
398.120114 254.931196 l
402.195455 257.622798 l
404.233125 255.012451 l
406.270795 256.967195 l
408.308466 256.523614 l
410.346136 256.623302 l
412.383807 258.598299 l
414.421477 256.046662 l
416.459148 255.494014 l
418.496818 255.991788 l
420.534489 259.843711 l
422.572159 259.305074 l
424.60983 258.068848 l
426.6475 259.3936 l
428.68517 258.730886 l
430.722841 259.790163 l
432.760511 258.966023 l
434.798182 258.850397 l
436.835852 257.038096 l
438.873523 259.666775 l
440.911193 261.611153 l
442.948864 262.052274 l
444.986534 261.986373 l
447.024205 267.485199 l
451.099545 268.246783 l
453.137216 267.115866 l
455.174886 267.353005 l
457.212557 268.184284 l
459.250227 266.120803 l
461.287898 267.18004 l
463.325568 268.05501 l
465.363239 266.397728 l
467.400909 268.610067 l
469.43858 277.007393 l
471.47625 282.121047 l
471.47625 282.121047 l
stroke
grestore
0.228 0.016 0.605 setrgbcolor
gsave
403.5 308.8 68.02 58.68 clipbox
68.0175 335.850797 m
112.62098 335.851327 l
114.648411 308.962558 l
116.675842 289.948531 l
118.703273 290.110015 l
120.730704 290.390269 l
122.758134 290.377355 l
124.785565 290.594088 l
126.812996 289.616409 l
128.840427 289.800336 l
130.867858 290.780479 l
132.895289 290.893707 l
134.92272 276.753271 l
136.950151 283.903521 l
138.977582 285.842844 l
141.005013 285.776044 l
143.032443 286.597298 l
145.059874 285.097148 l
147.087305 287.728865 l
149.114736 286.898137 l
151.142167 285.833388 l
153.169598 286.37265 l
155.197029 285.662747 l
157.22446 285.285547 l
159.251891 275.222316 l
161.279322 277.193494 l
163.306753 273.686522 l
165.334183 276.276381 l
167.361614 277.846572 l
169.389045 273.746987 l
171.416476 274.915345 l
173.443907 275.240322 l
175.471338 276.524625 l
177.498769 274.282275 l
179.5262 277.800138 l
181.553631 265.278598 l
183.581062 256.638193 l
185.608492 261.09317 l
187.635923 258.574281 l
189.663354 259.972625 l
191.690785 258.591488 l
193.718216 258.683977 l
195.745647 257.747575 l
197.773078 259.099424 l
199.800509 258.741437 l
201.82794 256.19442 l
203.855371 258.869159 l
205.882802 258.304721 l
207.910232 258.730776 l
209.937663 250.773626 l
211.965094 260.187416 l
213.992525 257.833246 l
216.019956 258.556505 l
218.047387 257.999683 l
220.074818 258.837911 l
222.102249 256.601375 l
224.12968 257.757049 l
226.157111 256.451605 l
228.184541 256.476422 l
230.211972 257.406724 l
232.239403 260.562488 l
234.266834 255.655068 l
236.294265 249.497887 l
238.321696 247.672484 l
240.349127 250.917792 l
242.376558 251.610379 l
244.403989 254.322014 l
246.43142 251.952412 l
248.458851 252.165819 l
250.486281 253.499446 l
252.513712 250.85201 l
254.541143 252.078076 l
256.568574 250.2901 l
258.596005 252.450349 l
260.623436 252.692468 l
262.650867 252.791 l
264.678298 251.481975 l
266.705729 257.591814 l
268.73316 334.600498 l
270.76059 335.851739 l
299.144623 335.85146 l
301.172054 313.093197 l
303.199485 283.995901 l
305.226916 284.499579 l
307.254347 283.588842 l
309.281778 284.073743 l
311.309209 283.805309 l
313.336639 286.128882 l
315.36407 286.952371 l
317.391501 288.895871 l
319.418932 286.754058 l
321.446363 287.669536 l
323.473794 288.012957 l
325.501225 287.602099 l
327.528656 288.045309 l
329.556087 284.237014 l
331.583518 289.598317 l
333.610948 288.701742 l
335.638379 289.111384 l
337.66581 289.17206 l
339.693241 287.833993 l
341.720672 290.623363 l
343.748103 286.954923 l
345.775534 283.897729 l
347.802965 284.294112 l
349.830396 284.099142 l
351.857827 281.945121 l
353.885258 285.64861 l
355.912688 284.167253 l
357.940119 284.503648 l
359.96755 285.093569 l
361.994981 283.843933 l
364.022412 282.358991 l
366.049843 283.123751 l
368.077274 285.03139 l
370.104705 284.308891 l
372.132136 276.075191 l
374.159567 272.201195 l
376.186997 272.421951 l
378.214428 273.156191 l
380.241859 272.925391 l
382.26929 275.178987 l
384.296721 272.857547 l
386.324152 274.80885 l
388.351583 273.139321 l
390.379014 272.84709 l
392.406445 273.001713 l
394.433876 271.863288 l
396.461307 271.662957 l
398.488737 271.747875 l
400.516168 271.435794 l
402.543599 272.032877 l
404.57103 272.176155 l
406.598461 271.786457 l
408.625892 271.542577 l
410.653323 272.181073 l
412.680754 271.744504 l
414.708185 270.331383 l
416.735616 271.149367 l
418.763046 273.645296 l
420.790477 273.549939 l
422.817908 274.964343 l
424.845339 272.751996 l
426.87277 273.694274 l
428.900201 273.830793 l
430.927632 273.645299 l
432.955063 272.712063 l
434.982494 274.653967 l
437.009925 272.459495 l
439.037356 273.525399 l
441.064786 276.094793 l
443.092217 274.359714 l
445.119648 275.348561 l
447.147079 277.184044 l
449.17451 277.47744 l
451.201941 274.826966 l
455.256803 276.875805 l
457.284234 275.575364 l
459.311665 275.60636 l
461.339095 276.544863 l
463.366526 274.624543 l
465.393957 274.977458 l
467.421388 268.244153 l
469.448819 269.100011 l
471.47625 274.609645 l
471.47625 274.609645 l
stroke
grestore
0.363 0.003 0.649 setrgbcolor
gsave
403.5 308.8 68.02 58.68 clipbox
68.0175 335.851642 m
112.62098 335.851589 l
114.648411 326.098112 l
116.675842 281.732988 l
118.703273 282.515975 l
120.730704 282.449091 l
122.758134 283.073857 l
124.785565 282.648212 l
126.812996 282.725452 l
128.840427 280.752833 l
130.867858 284.987665 l
132.895289 281.92987 l
134.92272 267.641032 l
136.950151 272.988301 l
138.977582 276.915066 l
141.005013 277.022542 l
143.032443 278.322099 l
145.059874 278.049166 l
147.087305 277.921188 l
149.114736 277.367059 l
151.142167 278.541547 l
153.169598 277.813917 l
155.197029 277.829288 l
157.22446 275.475344 l
159.251891 265.772922 l
161.279322 265.444992 l
163.306753 262.969922 l
167.361614 267.178156 l
169.389045 262.831753 l
171.416476 262.937715 l
175.471338 265.14498 l
177.498769 263.440724 l
179.5262 265.29975 l
181.553631 254.532325 l
183.581062 237.502519 l
185.608492 240.786759 l
187.635923 240.609602 l
189.663354 241.661824 l
191.690785 239.743275 l
193.718216 236.861697 l
195.745647 236.433242 l
197.773078 239.29076 l
199.800509 240.966777 l
201.82794 238.029713 l
203.855371 236.092845 l
205.882802 237.259021 l
207.910232 237.261261 l
209.937663 242.353169 l
211.965094 254.979622 l
213.992525 255.503235 l
216.019956 256.982599 l
218.047387 254.627512 l
220.074818 255.795835 l
222.102249 252.262329 l
224.12968 253.537495 l
226.157111 252.931605 l
228.184541 251.651455 l
230.211972 252.868384 l
232.239403 257.734827 l
236.294265 255.437009 l
238.321696 255.830655 l
240.349127 259.361753 l
242.376558 258.990809 l
244.403989 261.663831 l
246.43142 256.134383 l
248.458851 256.982731 l
250.486281 259.712674 l
252.513712 257.363727 l
254.541143 259.341028 l
256.568574 256.262232 l
258.596005 260.046692 l
260.623436 258.276698 l
262.650867 258.541944 l
264.678298 256.553201 l
266.705729 236.201582 l
268.73316 330.940347 l
270.76059 335.851369 l
293.06233 335.85133 l
295.089761 334.994715 l
297.117192 247.705697 l
299.144623 242.228154 l
301.172054 244.260052 l
303.199485 243.255755 l
305.226916 244.311853 l
307.254347 243.892045 l
309.281778 245.698902 l
311.309209 241.597699 l
313.336639 242.980397 l
315.36407 250.542489 l
317.391501 249.748302 l
319.418932 249.461703 l
321.446363 251.711965 l
323.473794 252.720888 l
325.501225 250.775607 l
327.528656 251.12295 l
329.556087 256.881016 l
331.583518 263.355252 l
333.610948 264.765919 l
337.66581 262.930431 l
339.693241 263.029774 l
341.720672 264.336052 l
343.748103 263.25234 l
345.775534 265.569076 l
349.830396 267.0185 l
351.857827 266.163959 l
353.885258 267.722505 l
355.912688 266.949397 l
357.940119 267.205191 l
359.96755 267.160726 l
361.994981 265.876472 l
364.022412 264.304631 l
366.049843 267.022592 l
368.077274 267.472227 l
370.104705 268.915476 l
374.159567 262.288436 l
376.186997 260.624124 l
378.214428 261.374095 l
380.241859 261.517583 l
382.26929 261.289304 l
384.296721 262.814919 l
386.324152 262.558743 l
388.351583 261.816821 l
390.379014 260.619852 l
392.406445 261.305773 l
394.433876 257.251808 l
396.461307 256.323739 l
398.488737 254.637922 l
400.516168 257.281261 l
402.543599 256.364281 l
404.57103 255.321691 l
406.598461 256.374895 l
408.625892 256.860836 l
410.653323 255.452168 l
412.680754 258.820525 l
414.708185 255.693777 l
416.735616 257.531319 l
418.763046 255.046607 l
420.790477 256.338199 l
422.817908 256.435305 l
424.845339 255.960758 l
426.87277 256.767925 l
428.900201 257.848394 l
430.927632 258.063751 l
432.955063 256.90952 l
434.982494 256.153231 l
437.009925 257.805721 l
439.037356 258.097894 l
441.064786 261.080363 l
443.092217 258.149182 l
447.147079 260.07141 l
449.17451 255.73626 l
451.201941 256.037919 l
453.229372 256.945271 l
455.256803 255.846769 l
457.284234 258.945969 l
459.311665 254.290753 l
461.339095 258.692557 l
463.366526 253.851481 l
465.393957 256.571936 l
467.421388 256.366051 l
469.448819 255.051863 l
471.47625 263.890497 l
471.47625 263.890497 l
stroke
grestore
0.495 0.012 0.658 setrgbcolor
gsave
403.5 308.8 68.02 58.68 clipbox
68.0175 335.851491 m
104.511256 335.851526 l
106.538687 274.77508 l
108.566118 265.218727 l
110.593549 265.553958 l
112.62098 266.712749 l
114.648411 265.405811 l
116.675842 265.097641 l
118.703273 265.742799 l
120.730704 266.563201 l
122.758134 265.376998 l
124.785565 265.475828 l
126.812996 267.268122 l
130.867858 266.595522 l
132.895289 266.109313 l
134.92272 270.540121 l
136.950151 272.532208 l
138.977582 278.952984 l
141.005013 278.57537 l
143.032443 279.454805 l
145.059874 277.748469 l
147.087305 279.048168 l
149.114736 279.305138 l
151.142167 278.173165 l
157.22446 277.413504 l
159.251891 260.117485 l
161.279322 261.859948 l
163.306753 259.255851 l
165.334183 260.70066 l
167.361614 263.792269 l
169.389045 260.04837 l
171.416476 258.777355 l
173.443907 259.749155 l
175.471338 262.635842 l
177.498769 259.782215 l
179.5262 262.885232 l
181.553631 258.961556 l
183.581062 246.866862 l
185.608492 250.179614 l
187.635923 250.232946 l
189.663354 251.606553 l
191.690785 248.552519 l
193.718216 248.918583 l
195.745647 246.957041 l
197.773078 252.503812 l
199.800509 248.020392 l
201.82794 246.705432 l
203.855371 246.337757 l
205.882802 245.011171 l
207.910232 249.807301 l
209.937663 256.381393 l
211.965094 279.424587 l
213.992525 276.427864 l
216.019956 278.335842 l
220.074818 277.130885 l
222.102249 276.772624 l
224.12968 277.640847 l
226.157111 275.922196 l
228.184541 275.591329 l
230.211972 277.564227 l
232.239403 277.404425 l
234.266834 275.648977 l
236.294265 272.04856 l
238.321696 265.786069 l
240.349127 267.254945 l
242.376558 267.346064 l
244.403989 269.034381 l
246.43142 265.62866 l
248.458851 267.752766 l
250.486281 268.881608 l
252.513712 263.474126 l
254.541143 269.17259 l
256.568574 267.068387 l
258.596005 269.918612 l
260.623436 267.029272 l
262.650867 269.172877 l
264.678298 267.989917 l
266.705729 264.744704 l
268.73316 334.830988 l
270.76059 335.851134 l
297.117192 335.851445 l
299.144623 334.594147 l
301.172054 272.890581 l
303.199485 270.74236 l
305.226916 272.007851 l
307.254347 270.82875 l
309.281778 270.246065 l
311.309209 272.31712 l
313.336639 285.021757 l
315.36407 291.177503 l
317.391501 292.610007 l
319.418932 291.600424 l
321.446363 291.339066 l
323.473794 291.618489 l
325.501225 290.697251 l
327.528656 291.439171 l
329.556087 288.58543 l
331.583518 291.654348 l
333.610948 293.336977 l
335.638379 291.16324 l
337.66581 291.915366 l
339.693241 291.522424 l
341.720672 292.402019 l
343.748103 286.553958 l
345.775534 278.678503 l
347.802965 280.181343 l
349.830396 278.484124 l
351.857827 280.64811 l
353.885258 279.609619 l
355.912688 280.56425 l
357.940119 279.999517 l
359.96755 279.200294 l
361.994981 280.522058 l
364.022412 279.505093 l
366.049843 279.188647 l
368.077274 280.530204 l
370.104705 279.720322 l
372.132136 267.078013 l
374.159567 265.494722 l
376.186997 264.544767 l
378.214428 265.501458 l
380.241859 265.508286 l
382.26929 264.846295 l
384.296721 265.860516 l
386.324152 265.444953 l
388.351583 265.617719 l
390.379014 264.987954 l
392.406445 263.761124 l
394.433876 259.260585 l
396.461307 259.300906 l
398.488737 259.138069 l
400.516168 260.259538 l
402.543599 259.190701 l
406.598461 258.920434 l
408.625892 259.003825 l
410.653323 260.254487 l
412.680754 260.263417 l
414.708185 258.22089 l
416.735616 259.103261 l
418.763046 260.132467 l
420.790477 259.968073 l
422.817908 263.059417 l
424.845339 259.970053 l
426.87277 262.139693 l
428.900201 260.585987 l
430.927632 261.922473 l
432.955063 260.549114 l
434.982494 261.60731 l
437.009925 261.077528 l
439.037356 260.319348 l
441.064786 263.689342 l
443.092217 260.80672 l
445.119648 261.532438 l
447.147079 264.189653 l
449.17451 262.881957 l
451.201941 263.888871 l
453.229372 260.957429 l
455.256803 261.808546 l
457.284234 263.269279 l
459.311665 260.263746 l
461.339095 262.894897 l
463.366526 262.056807 l
465.393957 264.142058 l
467.421388 262.76458 l
469.448819 264.707866 l
471.47625 270.968963 l
471.47625 270.968963 l
stroke
grestore
0.611 0.090 0.620 setrgbcolor
gsave
403.5 308.8 68.02 58.68 clipbox
68.0175 335.851198 m
106.538687 335.851266 l
108.566118 303.055457 l
110.593549 268.338488 l
112.62098 269.247308 l
114.648411 268.739102 l
116.675842 267.158059 l
118.703273 269.024373 l
120.730704 267.991436 l
122.758134 267.567445 l
124.785565 268.520701 l
126.812996 269.028347 l
128.840427 267.956438 l
130.867858 268.612588 l
132.895289 268.664057 l
134.92272 258.66672 l
136.950151 262.562977 l
138.977582 269.313041 l
141.005013 270.338432 l
143.032443 269.879398 l
145.059874 270.660681 l
147.087305 270.960728 l
149.114736 269.399384 l
151.142167 270.459286 l
153.169598 269.861917 l
155.197029 269.402281 l
157.22446 270.422167 l
159.251891 267.745009 l
161.279322 267.253899 l
163.306753 268.051385 l
165.334183 268.57969 l
167.361614 270.78803 l
169.389045 267.138397 l
171.416476 267.17236 l
173.443907 267.696148 l
175.471338 268.761938 l
177.498769 267.803692 l
179.5262 269.982099 l
181.553631 272.700817 l
183.581062 269.223306 l
185.608492 272.414761 l
187.635923 271.320625 l
189.663354 272.063386 l
191.690785 270.286642 l
193.718216 271.246084 l
195.745647 270.372774 l
197.773078 271.969765 l
199.800509 270.062263 l
201.82794 270.666813 l
203.855371 270.791026 l
205.882802 269.816893 l
207.910232 271.01905 l
209.937663 249.631919 l
211.965094 253.493113 l
213.992525 251.522132 l
216.019956 252.975943 l
218.047387 249.871127 l
220.074818 250.524373 l
222.102249 249.893579 l
224.12968 251.18661 l
226.157111 249.014537 l
228.184541 247.742684 l
230.211972 250.419772 l
232.239403 253.757717 l
234.266834 251.106852 l
236.294265 243.421361 l
238.321696 240.323642 l
240.349127 243.924796 l
242.376558 245.740983 l
244.403989 248.379318 l
246.43142 241.720281 l
248.458851 242.454537 l
250.486281 242.974723 l
252.513712 243.98887 l
254.541143 245.443961 l
256.568574 242.595184 l
258.596005 245.126886 l
260.623436 242.592634 l
262.650867 246.114401 l
264.678298 241.257889 l
266.705729 252.515127 l
268.73316 329.18414 l
270.76059 335.851171 l
301.172054 335.851245 l
303.199485 297.364386 l
305.226916 275.879788 l
307.254347 273.593999 l
309.281778 275.796423 l
311.309209 273.379154 l
313.336639 277.323248 l
315.36407 278.721584 l
317.391501 278.266523 l
319.418932 278.380245 l
321.446363 277.936396 l
325.501225 278.475124 l
327.528656 277.248159 l
329.556087 269.301498 l
331.583518 274.079721 l
333.610948 275.064185 l
335.638379 274.211765 l
337.66581 274.132294 l
339.693241 273.506586 l
341.720672 275.748231 l
343.748103 271.936126 l
345.775534 258.497671 l
347.802965 259.555854 l
349.830396 260.025782 l
351.857827 259.477489 l
353.885258 261.555628 l
355.912688 260.681099 l
357.940119 260.448611 l
359.96755 259.152494 l
361.994981 258.865777 l
364.022412 258.873538 l
366.049843 258.294287 l
368.077274 261.702596 l
370.104705 263.578407 l
372.132136 271.893177 l
374.159567 267.3244 l
376.186997 266.951139 l
378.214428 268.509678 l
380.241859 267.989852 l
382.26929 267.673822 l
384.296721 267.815713 l
386.324152 268.604458 l
388.351583 266.9521 l
390.379014 265.868452 l
392.406445 267.206585 l
394.433876 265.813737 l
396.461307 266.418709 l
398.488737 263.990073 l
400.516168 266.383953 l
402.543599 264.547707 l
404.57103 265.345921 l
406.598461 264.674139 l
408.625892 265.65006 l
410.653323 265.648036 l
412.680754 265.480704 l
414.708185 265.005584 l
416.735616 266.11214 l
418.763046 265.779496 l
420.790477 265.68676 l
422.817908 263.685664 l
424.845339 264.508765 l
426.87277 265.164213 l
428.900201 264.808198 l
430.927632 265.354523 l
432.955063 264.006638 l
434.982494 265.28851 l
437.009925 264.944672 l
439.037356 265.638143 l
441.064786 267.575465 l
443.092217 265.650883 l
445.119648 263.485364 l
447.147079 259.616388 l
449.17451 257.583705 l
451.201941 257.492822 l
453.229372 255.345054 l
455.256803 257.535259 l
457.284234 259.194599 l
459.311665 255.739304 l
461.339095 257.453668 l
463.366526 257.241743 l
465.393957 258.203615 l
467.421388 258.652659 l
471.47625 270.514116 l
471.47625 270.514116 l
stroke
grestore
0.711 0.183 0.550 setrgbcolor
gsave
403.5 308.8 68.02 58.68 clipbox
68.0175 335.851342 m
106.538687 335.850529 l
108.566118 284.201122 l
110.593549 268.417041 l
112.62098 268.667584 l
114.648411 268.805856 l
118.703273 269.437689 l
120.730704 269.363313 l
122.758134 269.004974 l
124.785565 270.399716 l
126.812996 268.664177 l
128.840427 270.082823 l
130.867858 268.234383 l
132.895289 267.948416 l
134.92272 254.847695 l
136.950151 256.275884 l
138.977582 265.645059 l
141.005013 265.405934 l
143.032443 266.165765 l
145.059874 266.083814 l
147.087305 266.785173 l
149.114736 264.913399 l
151.142167 265.131917 l
153.169598 265.231181 l
155.197029 264.863741 l
157.22446 263.481001 l
159.251891 261.716097 l
161.279322 263.729337 l
163.306753 261.791206 l
167.361614 265.933175 l
169.389045 261.20491 l
171.416476 261.649869 l
173.443907 261.73116 l
175.471338 262.562858 l
177.498769 262.249094 l
179.5262 263.293053 l
181.553631 251.384643 l
183.581062 232.359337 l
185.608492 232.358409 l
187.635923 228.19889 l
189.663354 231.942062 l
191.690785 228.616459 l
193.718216 230.118606 l
195.745647 230.065842 l
197.773078 232.897121 l
199.800509 231.275889 l
201.82794 229.391011 l
203.855371 232.538979 l
205.882802 230.910218 l
207.910232 233.039308 l
209.937663 245.568654 l
211.965094 267.779506 l
213.992525 265.193834 l
216.019956 265.736932 l
218.047387 265.554587 l
220.074818 264.521545 l
222.102249 264.515492 l
224.12968 265.384106 l
226.157111 263.202336 l
228.184541 263.325377 l
230.211972 264.202443 l
232.239403 266.402735 l
234.266834 263.708167 l
236.294265 246.95879 l
238.321696 240.137623 l
240.349127 242.278002 l
242.376558 245.803857 l
244.403989 248.794764 l
246.43142 242.296642 l
248.458851 244.968799 l
250.486281 247.058293 l
252.513712 246.214084 l
254.541143 245.820782 l
256.568574 244.061329 l
258.596005 248.458917 l
260.623436 245.822597 l
262.650867 247.963098 l
264.678298 242.353522 l
266.705729 242.396672 l
268.73316 333.681558 l
270.76059 335.851777 l
295.089761 335.851868 l
297.117192 258.407422 l
299.144623 245.702867 l
301.172054 245.05428 l
303.199485 246.484722 l
305.226916 248.33676 l
307.254347 249.422813 l
309.281778 251.727092 l
311.309209 248.684654 l
313.336639 256.023479 l
315.36407 259.192147 l
317.391501 259.795151 l
319.418932 259.397434 l
321.446363 260.08151 l
325.501225 260.322601 l
327.528656 259.946131 l
329.556087 255.817944 l
331.583518 261.135707 l
333.610948 261.54078 l
335.638379 260.501676 l
337.66581 261.567994 l
339.693241 259.516899 l
341.720672 262.599639 l
343.748103 261.021885 l
345.775534 260.027455 l
347.802965 260.428124 l
349.830396 261.303238 l
351.857827 260.212432 l
353.885258 261.591909 l
355.912688 260.863525 l
357.940119 260.915995 l
359.96755 261.381716 l
361.994981 260.582548 l
364.022412 260.444061 l
366.049843 260.669614 l
368.077274 262.464922 l
370.104705 263.291591 l
372.132136 261.862193 l
374.159567 257.445004 l
376.186997 256.940042 l
378.214428 258.921495 l
380.241859 256.959509 l
382.26929 257.859911 l
386.324152 258.214417 l
388.351583 257.792868 l
390.379014 256.02543 l
392.406445 258.447962 l
394.433876 256.877404 l
396.461307 257.887349 l
398.488737 257.77952 l
400.516168 256.435505 l
402.543599 256.260271 l
404.57103 254.4236 l
406.598461 257.238686 l
408.625892 256.849907 l
410.653323 258.481109 l
412.680754 259.121553 l
414.708185 254.979396 l
416.735616 257.08394 l
418.763046 255.203256 l
420.790477 259.196784 l
422.817908 259.958007 l
424.845339 258.238578 l
426.87277 258.973326 l
428.900201 261.675243 l
430.927632 258.178605 l
432.955063 258.710241 l
434.982494 260.042344 l
437.009925 259.744842 l
439.037356 259.826013 l
441.064786 262.594047 l
443.092217 261.507042 l
445.119648 261.370766 l
447.147079 257.656479 l
449.17451 256.099961 l
451.201941 251.392427 l
453.229372 252.485364 l
455.256803 253.792729 l
457.284234 256.096581 l
459.311665 252.228076 l
461.339095 256.047637 l
463.366526 252.643245 l
465.393957 254.102664 l
467.421388 255.051095 l
469.448819 253.605473 l
471.47625 261.447352 l
471.47625 261.447352 l
stroke
grestore
0.798 0.280 0.470 setrgbcolor
gsave
403.5 308.8 68.02 58.68 clipbox
68.0175 335.851283 m
104.511256 335.851634 l
106.538687 323.65646 l
108.566118 268.815531 l
110.593549 268.704412 l
112.62098 269.252462 l
114.648411 268.296458 l
116.675842 269.744388 l
118.703273 268.819855 l
120.730704 268.036973 l
122.758134 269.284713 l
124.785565 268.735134 l
126.812996 269.112037 l
128.840427 268.148947 l
130.867858 270.390569 l
132.895289 269.001938 l
134.92272 264.979819 l
136.950151 266.415742 l
138.977582 274.309814 l
141.005013 273.561551 l
143.032443 274.32841 l
145.059874 273.125009 l
147.087305 274.013438 l
149.114736 273.871875 l
151.142167 273.911172 l
153.169598 273.168545 l
155.197029 273.91968 l
157.22446 275.023243 l
159.251891 255.427755 l
161.279322 253.110465 l
163.306753 252.014787 l
165.334183 255.28364 l
167.361614 258.884125 l
169.389045 251.898511 l
171.416476 253.451255 l
173.443907 253.450106 l
175.471338 255.052156 l
177.498769 253.743055 l
179.5262 256.952062 l
181.553631 249.448106 l
183.581062 231.129646 l
185.608492 233.432603 l
187.635923 228.981931 l
189.663354 231.30662 l
191.690785 228.26692 l
193.718216 230.276145 l
195.745647 227.229012 l
197.773078 231.534626 l
199.800509 230.340965 l
201.82794 227.304548 l
203.855371 228.73879 l
205.882802 226.211571 l
207.910232 227.246228 l
209.937663 247.55885 l
211.965094 264.161145 l
213.992525 262.099772 l
216.019956 263.170207 l
218.047387 262.970259 l
220.074818 261.62601 l
224.12968 261.56378 l
226.157111 260.758349 l
228.184541 260.876745 l
232.239403 263.087593 l
234.266834 261.312112 l
236.294265 250.242003 l
238.321696 232.113222 l
240.349127 229.902945 l
242.376558 231.191197 l
244.403989 230.933145 l
246.43142 226.993107 l
248.458851 227.486343 l
250.486281 230.342364 l
252.513712 230.402001 l
254.541143 228.480141 l
256.568574 230.537982 l
258.596005 231.606262 l
260.623436 227.469369 l
262.650867 230.588095 l
264.678298 225.984129 l
266.705729 230.799321 l
268.73316 333.067707 l
270.76059 335.851771 l
297.117192 335.851098 l
299.144623 317.926032 l
301.172054 275.680967 l
303.199485 274.968299 l
305.226916 276.126718 l
307.254347 275.016626 l
309.281778 276.37924 l
311.309209 283.013975 l
313.336639 304.927663 l
315.36407 305.660607 l
317.391501 306.084666 l
319.418932 305.888584 l
321.446363 306.590421 l
323.473794 306.305277 l
325.501225 305.616041 l
327.528656 304.230617 l
329.556087 298.752711 l
331.583518 301.189613 l
333.610948 301.770615 l
335.638379 300.855672 l
337.66581 300.950146 l
339.693241 300.730391 l
341.720672 301.212178 l
343.748103 298.835157 l
345.775534 290.191024 l
347.802965 290.845394 l
349.830396 290.838534 l
351.857827 290.334444 l
353.885258 291.515234 l
355.912688 290.835418 l
357.940119 291.669394 l
359.96755 291.437809 l
364.022412 289.93453 l
366.049843 290.171272 l
368.077274 291.071667 l
370.104705 292.188012 l
372.132136 284.569708 l
374.159567 277.620517 l
376.186997 275.712813 l
378.214428 277.935139 l
380.241859 276.488262 l
382.26929 277.444426 l
384.296721 276.781738 l
386.324152 278.175512 l
388.351583 277.021802 l
390.379014 276.741401 l
392.406445 275.861471 l
394.433876 271.279618 l
396.461307 266.0334 l
400.516168 264.707781 l
402.543599 267.112154 l
404.57103 266.257884 l
406.598461 266.016451 l
408.625892 265.948194 l
410.653323 266.848242 l
412.680754 267.023236 l
414.708185 265.522666 l
416.735616 265.800479 l
418.763046 260.157912 l
420.790477 259.300329 l
422.817908 260.923375 l
424.845339 261.497618 l
426.87277 259.972043 l
428.900201 260.727818 l
430.927632 261.285734 l
432.955063 259.312918 l
434.982494 261.219116 l
437.009925 257.765494 l
439.037356 261.920042 l
441.064786 262.52819 l
443.092217 260.855192 l
445.119648 260.535734 l
447.147079 258.095437 l
449.17451 255.048954 l
451.201941 253.801209 l
453.229372 253.16406 l
457.284234 256.85135 l
459.311665 252.552394 l
461.339095 255.728827 l
463.366526 254.095012 l
465.393957 255.94774 l
467.421388 256.271496 l
469.448819 264.185141 l
471.47625 269.024852 l
471.47625 269.024852 l
stroke
grestore
0.869 0.374 0.397 setrgbcolor
gsave
403.5 308.8 68.02 58.68 clipbox
68.0175 335.851577 m
100.456394 335.851243 l
102.483825 335.711128 l
104.511256 252.091493 l
106.538687 227.236187 l
108.566118 226.088486 l
110.593549 224.631073 l
112.62098 230.36823 l
114.648411 226.428647 l
116.675842 228.017372 l
118.703273 227.673046 l
120.730704 229.599682 l
122.758134 226.935622 l
124.785565 229.698522 l
126.812996 228.838177 l
128.840427 225.565225 l
130.867858 229.789899 l
132.895289 228.088006 l
134.92272 224.177291 l
136.950151 197.512791 l
138.977582 195.709921 l
141.005013 194.513598 l
143.032443 196.371413 l
145.059874 197.147164 l
147.087305 195.353117 l
149.114736 194.534899 l
151.142167 196.265104 l
153.169598 196.137851 l
155.197029 196.549482 l
157.22446 196.264592 l
161.279322 269.530883 l
163.306753 270.135181 l
165.334183 270.037374 l
167.361614 271.783909 l
169.389045 268.453787 l
171.416476 268.566605 l
173.443907 268.982206 l
175.471338 270.857682 l
177.498769 267.838014 l
179.5262 269.948259 l
181.553631 256.080741 l
183.581062 229.492168 l
185.608492 230.525644 l
187.635923 227.186701 l
189.663354 228.563046 l
191.690785 228.053958 l
193.718216 227.940028 l
195.745647 222.475503 l
197.773078 229.430868 l
199.800509 226.857392 l
201.82794 225.329679 l
203.855371 228.413431 l
205.882802 226.849752 l
207.910232 226.750719 l
209.937663 232.698669 l
211.965094 256.338397 l
213.992525 255.070899 l
216.019956 257.805975 l
218.047387 255.754609 l
220.074818 255.879102 l
222.102249 253.923242 l
224.12968 255.109529 l
226.157111 253.285346 l
228.184541 253.281529 l
230.211972 253.085515 l
232.239403 259.153463 l
234.266834 254.63763 l
236.294265 236.376599 l
238.321696 221.108533 l
240.349127 225.327995 l
242.376558 224.579373 l
244.403989 228.923345 l
246.43142 222.012298 l
248.458851 221.3529 l
250.486281 224.955524 l
252.513712 223.722584 l
254.541143 223.364121 l
256.568574 225.326661 l
258.596005 225.786699 l
260.623436 224.1466 l
262.650867 227.658873 l
264.678298 223.48953 l
266.705729 225.271268 l
268.73316 334.668276 l
270.76059 335.850936 l
299.144623 335.851165 l
301.172054 292.517212 l
303.199485 260.581512 l
305.226916 262.041565 l
307.254347 259.751131 l
309.281778 262.822308 l
311.309209 259.792583 l
313.336639 253.593751 l
315.36407 255.536239 l
317.391501 255.602714 l
319.418932 256.642784 l
321.446363 256.605987 l
323.473794 257.454054 l
325.501225 256.902396 l
327.528656 257.184268 l
329.556087 240.973434 l
331.583518 243.981842 l
333.610948 248.697907 l
335.638379 245.554296 l
337.66581 247.907239 l
339.693241 246.676743 l
341.720672 247.933573 l
343.748103 245.373529 l
345.775534 237.675889 l
349.830396 241.606067 l
351.857827 239.241008 l
353.885258 242.502897 l
355.912688 240.757659 l
357.940119 242.461941 l
359.96755 240.518537 l
361.994981 241.136631 l
364.022412 238.595296 l
366.049843 238.789181 l
368.077274 243.363878 l
370.104705 243.629429 l
372.132136 253.690963 l
374.159567 249.860089 l
376.186997 246.90847 l
378.214428 248.981817 l
380.241859 250.597378 l
384.296721 250.984825 l
386.324152 249.716203 l
388.351583 249.018724 l
390.379014 248.508693 l
392.406445 249.269201 l
394.433876 247.782154 l
396.461307 251.517771 l
398.488737 250.992111 l
400.516168 250.96652 l
402.543599 251.346588 l
404.57103 250.395226 l
406.598461 250.580778 l
408.625892 251.493443 l
410.653323 250.607731 l
412.680754 251.246862 l
414.708185 248.838806 l
416.735616 248.645543 l
418.763046 248.127588 l
420.790477 245.589757 l
422.817908 245.248892 l
424.845339 245.759928 l
426.87277 244.750569 l
428.900201 247.063234 l
432.955063 244.530276 l
434.982494 245.888664 l
437.009925 245.91688 l
439.037356 245.384713 l
441.064786 249.793349 l
443.092217 246.807713 l
445.119648 247.698382 l
449.17451 255.622912 l
451.201941 253.221236 l
453.229372 252.991684 l
455.256803 256.938046 l
457.284234 257.955777 l
459.311665 252.903239 l
461.339095 256.612019 l
463.366526 253.764952 l
465.393957 256.540627 l
467.421388 254.497391 l
469.448819 255.520245 l
471.47625 263.186194 l
471.47625 263.186194 l
stroke
grestore
0.928 0.473 0.326 setrgbcolor
gsave
403.5 308.8 68.02 58.68 clipbox
68.0175 335.852094 m
104.511256 335.85016 l
106.538687 284.566644 l
108.566118 239.772854 l
110.593549 239.796008 l
112.62098 242.119744 l
114.648411 241.216456 l
116.675842 241.099721 l
118.703273 239.864144 l
120.730704 240.632682 l
122.758134 239.394683 l
124.785565 237.892867 l
126.812996 240.454875 l
128.840427 240.611571 l
130.867858 239.033149 l
132.895289 238.675162 l
134.92272 250.861625 l
136.950151 289.098814 l
138.977582 291.910369 l
141.005013 293.016092 l
143.032443 293.648256 l
145.059874 292.52582 l
147.087305 294.157114 l
149.114736 292.583239 l
151.142167 292.90474 l
153.169598 293.407697 l
155.197029 292.676959 l
157.22446 292.670364 l
159.251891 264.821933 l
161.279322 260.183926 l
163.306753 259.758144 l
165.334183 261.036932 l
167.361614 264.474449 l
169.389045 258.231439 l
171.416476 257.799986 l
173.443907 260.346368 l
175.471338 261.825443 l
177.498769 259.498606 l
179.5262 261.080081 l
181.553631 256.075394 l
183.581062 235.60237 l
185.608492 235.321717 l
187.635923 233.80569 l
189.663354 232.992719 l
193.718216 233.574857 l
195.745647 232.862566 l
197.773078 235.241967 l
199.800509 235.017846 l
201.82794 229.861181 l
203.855371 235.286716 l
205.882802 232.245949 l
207.910232 235.173677 l
209.937663 237.174927 l
211.965094 259.066588 l
213.992525 258.186642 l
216.019956 260.924301 l
218.047387 258.597708 l
220.074818 258.968314 l
222.102249 255.999989 l
224.12968 259.435757 l
226.157111 257.018998 l
228.184541 257.423717 l
230.211972 256.609925 l
232.239403 260.578104 l
234.266834 257.539553 l
236.294265 245.916598 l
238.321696 224.831607 l
240.349127 227.849563 l
242.376558 226.32599 l
244.403989 231.081762 l
246.43142 224.700074 l
248.458851 225.405404 l
250.486281 225.625037 l
252.513712 228.846595 l
254.541143 227.321097 l
256.568574 227.166878 l
258.596005 227.460986 l
260.623436 225.843708 l
262.650867 228.618343 l
264.678298 223.850825 l
266.705729 227.434609 l
268.73316 333.01046 l
270.76059 335.851685 l
299.144623 335.851187 l
303.199485 263.64731 l
305.226916 265.939975 l
307.254347 264.425842 l
309.281778 265.307457 l
311.309209 261.623482 l
313.336639 251.761069 l
315.36407 255.666838 l
317.391501 254.780669 l
319.418932 253.074119 l
321.446363 255.044191 l
323.473794 254.733876 l
325.501225 255.125531 l
329.556087 256.676617 l
331.583518 263.106988 l
333.610948 263.928089 l
335.638379 263.12944 l
339.693241 262.168488 l
341.720672 263.661473 l
343.748103 262.612749 l
345.775534 260.250589 l
347.802965 262.258447 l
349.830396 262.762657 l
351.857827 261.518316 l
353.885258 262.903316 l
355.912688 261.968655 l
357.940119 261.282454 l
359.96755 262.206819 l
361.994981 262.24507 l
364.022412 260.36195 l
368.077274 262.313061 l
370.104705 263.816696 l
372.132136 254.805435 l
374.159567 247.822604 l
376.186997 244.815775 l
378.214428 248.112555 l
380.241859 245.346301 l
382.26929 245.407357 l
384.296721 247.461198 l
386.324152 246.745948 l
388.351583 246.446247 l
390.379014 244.520135 l
392.406445 245.365755 l
394.433876 247.488863 l
396.461307 258.238777 l
398.488737 257.496569 l
400.516168 259.486236 l
402.543599 258.748069 l
404.57103 257.551332 l
406.598461 259.281269 l
408.625892 256.972155 l
410.653323 257.493503 l
412.680754 259.315029 l
414.708185 255.556988 l
416.735616 257.307594 l
420.790477 253.953898 l
422.817908 254.090307 l
424.845339 253.292072 l
426.87277 254.584404 l
428.900201 254.484111 l
430.927632 255.248771 l
432.955063 253.634224 l
434.982494 255.660079 l
437.009925 253.672572 l
439.037356 255.226751 l
441.064786 259.273389 l
443.092217 255.372821 l
445.119648 256.711939 l
447.147079 252.461633 l
449.17451 248.734284 l
451.201941 247.829737 l
453.229372 246.17315 l
455.256803 248.350452 l
457.284234 249.36725 l
459.311665 245.655252 l
461.339095 246.748758 l
463.366526 245.217875 l
465.393957 246.935233 l
467.421388 248.307369 l
471.47625 267.867326 l
471.47625 267.867326 l
stroke
grestore
0.973 0.586 0.252 setrgbcolor
gsave
403.5 308.8 68.02 58.68 clipbox
68.0175 335.852305 m
104.511256 335.851579 l
106.538687 273.482836 l
108.566118 252.478622 l
110.593549 253.545615 l
112.62098 256.747292 l
114.648411 253.763453 l
116.675842 253.529944 l
118.703273 255.50129 l
120.730704 256.820478 l
122.758134 252.890123 l
124.785565 253.813603 l
126.812996 255.381276 l
130.867858 252.793444 l
132.895289 254.43277 l
134.92272 252.074399 l
136.950151 260.129148 l
138.977582 270.30584 l
141.005013 269.273467 l
143.032443 269.369121 l
145.059874 269.606523 l
147.087305 269.641284 l
149.114736 268.98004 l
151.142167 269.143842 l
153.169598 269.12046 l
155.197029 268.253544 l
157.22446 268.957302 l
159.251891 237.077349 l
161.279322 217.044073 l
163.306753 215.95748 l
165.334183 216.342027 l
167.361614 217.456643 l
169.389045 220.86533 l
171.416476 214.072647 l
175.471338 217.773596 l
177.498769 217.101002 l
179.5262 217.782219 l
181.553631 230.396142 l
183.581062 266.17835 l
185.608492 272.118819 l
187.635923 268.421076 l
189.663354 270.448907 l
191.690785 270.075195 l
193.718216 268.830584 l
197.773078 269.842965 l
199.800509 268.070401 l
201.82794 269.011582 l
203.855371 269.631511 l
205.882802 267.515482 l
207.910232 270.009471 l
209.937663 246.419364 l
211.965094 236.105521 l
213.992525 232.846789 l
216.019956 237.582495 l
218.047387 235.276702 l
220.074818 235.36797 l
222.102249 231.130316 l
224.12968 232.915698 l
226.157111 235.28032 l
228.184541 232.343071 l
230.211972 232.137808 l
232.239403 238.981782 l
234.266834 237.311851 l
236.294265 232.706165 l
238.321696 248.147433 l
240.349127 256.166226 l
242.376558 257.012113 l
244.403989 258.564343 l
246.43142 254.205121 l
248.458851 253.919796 l
250.486281 256.274112 l
252.513712 254.083946 l
254.541143 255.423941 l
256.568574 253.89708 l
258.596005 256.200599 l
260.623436 253.551301 l
262.650867 255.424179 l
264.678298 253.67964 l
266.705729 253.877341 l
268.73316 332.203695 l
270.76059 335.851714 l
295.089761 335.851756 l
297.117192 326.787721 l
299.144623 253.575665 l
301.172054 246.476219 l
303.199485 245.307895 l
305.226916 248.212939 l
307.254347 247.073582 l
309.281778 248.981339 l
311.309209 247.674655 l
313.336639 258.967369 l
315.36407 261.112677 l
317.391501 260.681659 l
319.418932 260.00575 l
321.446363 259.762532 l
323.473794 260.351152 l
325.501225 259.851934 l
327.528656 260.958235 l
329.556087 243.550376 l
331.583518 228.267321 l
333.610948 229.665738 l
335.638379 227.316705 l
337.66581 228.903106 l
339.693241 227.857536 l
341.720672 231.151138 l
343.748103 228.54085 l
345.775534 269.752413 l
347.802965 276.908841 l
349.830396 277.47142 l
351.857827 276.46421 l
353.885258 277.835833 l
355.912688 276.958281 l
357.940119 277.474026 l
359.96755 277.615423 l
361.994981 277.520099 l
364.022412 276.701098 l
366.049843 276.129466 l
368.077274 277.810645 l
370.104705 278.934361 l
372.132136 262.346277 l
374.159567 254.586558 l
376.186997 251.507388 l
378.214428 254.975836 l
380.241859 255.228237 l
382.26929 254.941878 l
384.296721 255.024874 l
386.324152 256.315382 l
388.351583 255.242639 l
390.379014 253.528024 l
392.406445 254.672889 l
394.433876 250.59999 l
396.461307 252.254929 l
398.488737 250.66635 l
400.516168 251.966385 l
404.57103 250.187457 l
406.598461 252.918776 l
408.625892 250.7098 l
410.653323 251.448838 l
412.680754 250.948911 l
414.708185 250.27403 l
416.735616 250.323411 l
418.763046 253.507752 l
420.790477 258.50121 l
422.817908 259.696567 l
424.845339 258.42645 l
426.87277 256.930374 l
428.900201 259.255382 l
430.927632 257.202637 l
432.955063 258.004757 l
434.982494 257.563202 l
437.009925 258.370171 l
439.037356 258.193769 l
441.064786 262.311793 l
443.092217 259.405192 l
445.119648 258.134604 l
447.147079 264.30424 l
449.17451 266.407652 l
451.201941 264.887724 l
453.229372 264.774109 l
455.256803 265.508453 l
457.284234 266.778836 l
459.311665 263.931183 l
461.339095 265.481761 l
463.366526 264.04144 l
465.393957 265.905158 l
467.421388 263.582023 l
469.448819 257.857905 l
471.47625 265.326045 l
471.47625 265.326045 l
stroke
grestore
0.994 0.705 0.183 setrgbcolor
gsave
403.5 308.8 68.02 58.68 clipbox
68.0175 335.851086 m
100.456394 335.851155 l
102.483825 307.807792 l
104.511256 204.113923 l
108.566118 204.767784 l
110.593549 205.985121 l
112.62098 209.165061 l
114.648411 205.970029 l
118.703273 206.090453 l
120.730704 207.972511 l
122.758134 207.020119 l
124.785565 206.568692 l
126.812996 208.815441 l
128.840427 209.038579 l
130.867858 207.162398 l
132.895289 206.71747 l
134.92272 213.014892 l
136.950151 260.250941 l
138.977582 274.680166 l
141.005013 275.280597 l
143.032443 274.792736 l
145.059874 274.582145 l
147.087305 275.421211 l
149.114736 273.961465 l
151.142167 274.178312 l
153.169598 274.594168 l
155.197029 273.660493 l
157.22446 273.974778 l
159.251891 254.916431 l
161.279322 240.748289 l
163.306753 238.380408 l
165.334183 240.058528 l
169.389045 242.284554 l
171.416476 238.360001 l
173.443907 237.604929 l
175.471338 239.322572 l
177.498769 239.724668 l
179.5262 240.357023 l
181.553631 248.102945 l
183.581062 240.622235 l
185.608492 245.457972 l
187.635923 243.870358 l
189.663354 243.9224 l
191.690785 242.979435 l
193.718216 241.547707 l
197.773078 242.459395 l
199.800509 242.675219 l
201.82794 239.695999 l
203.855371 241.105584 l
205.882802 241.010366 l
207.910232 240.115051 l
209.937663 236.118001 l
211.965094 234.499679 l
213.992525 230.91574 l
216.019956 232.984762 l
218.047387 231.734358 l
220.074818 230.835664 l
222.102249 230.562794 l
224.12968 232.119213 l
226.157111 229.378917 l
228.184541 227.880822 l
230.211972 231.393384 l
232.239403 235.28301 l
234.266834 232.173505 l
236.294265 227.576819 l
238.321696 235.590297 l
240.349127 246.616152 l
242.376558 250.291638 l
244.403989 254.31537 l
246.43142 247.451358 l
248.458851 249.187146 l
250.486281 248.413606 l
252.513712 247.186873 l
254.541143 247.588306 l
256.568574 249.378422 l
258.596005 248.38696 l
260.623436 248.043945 l
262.650867 249.087374 l
264.678298 245.233089 l
266.705729 245.449036 l
268.73316 334.440415 l
270.76059 335.851603 l
297.117192 335.794466 l
299.144623 253.008453 l
301.172054 240.317348 l
303.199485 237.606694 l
305.226916 240.735578 l
307.254347 240.492727 l
309.281778 241.636902 l
311.309209 244.919569 l
313.336639 263.104238 l
315.36407 266.161338 l
317.391501 266.508793 l
319.418932 265.099548 l
323.473794 266.539516 l
325.501225 265.509572 l
327.528656 265.539476 l
329.556087 262.278619 l
331.583518 266.006339 l
333.610948 266.883632 l
335.638379 265.411166 l
337.66581 267.360577 l
339.693241 265.039477 l
341.720672 267.647436 l
343.748103 264.001743 l
345.775534 237.923739 l
347.802965 232.933371 l
349.830396 235.459357 l
351.857827 234.22684 l
353.885258 236.063447 l
355.912688 236.020444 l
357.940119 237.582005 l
359.96755 234.059234 l
361.994981 237.357313 l
364.022412 233.137775 l
366.049843 232.919882 l
368.077274 235.725861 l
370.104705 236.707631 l
372.132136 251.340506 l
374.159567 256.557835 l
376.186997 255.759824 l
378.214428 258.175878 l
380.241859 255.130359 l
382.26929 257.510644 l
384.296721 256.866952 l
386.324152 255.581641 l
388.351583 256.971213 l
390.379014 255.040921 l
392.406445 255.488044 l
396.461307 248.173139 l
398.488737 246.559981 l
400.516168 246.938685 l
402.543599 248.108478 l
404.57103 248.248119 l
406.598461 247.522396 l
408.625892 247.951147 l
410.653323 247.62111 l
412.680754 247.670474 l
414.708185 246.206399 l
416.735616 248.069039 l
418.763046 255.019567 l
420.790477 257.891908 l
422.817908 260.032034 l
424.845339 257.765899 l
426.87277 258.802357 l
428.900201 260.959448 l
430.927632 258.723807 l
432.955063 256.709516 l
434.982494 259.72063 l
437.009925 258.312766 l
439.037356 257.54024 l
441.064786 262.717252 l
443.092217 259.677039 l
445.119648 259.490594 l
447.147079 258.669626 l
449.17451 252.057367 l
451.201941 248.769426 l
453.229372 246.84712 l
457.284234 251.525907 l
459.311665 247.274086 l
461.339095 250.730713 l
463.366526 249.294958 l
465.393957 249.48204 l
467.421388 248.475229 l
469.448819 244.162846 l
471.47625 249.120201 l
471.47625 249.120201 l
stroke
grestore
0 setlinejoin
[] 0 setdash
0.000 setgray
gsave
68.0175 58.68 m
68.0175 367.528 l
stroke
grestore
gsave
471.47625 58.68 m
471.47625 367.528 l
stroke
grestore
gsave
68.0175 58.68 m
471.47625 58.68 l
stroke
grestore
gsave
68.0175 367.528 m
471.47625 367.528 l
stroke
grestore
0.500 setlinewidth
1 setlinejoin
0 setlinecap
[] 0 setdash
gsave
/o {
gsave
newpath
translate
0.5 setlinewidth
1 setlinejoin
0 setlinecap
0 0 m
0 4 l

gsave
0.000 setgray
fill
grestore
stroke
grestore
} bind def
68.0175 58.68 o
grestore
gsave
/o {
gsave
newpath
translate
0.5 setlinewidth
1 setlinejoin
0 setlinecap
0 0 m
0 -4 l

gsave
0.000 setgray
fill
grestore
stroke
grestore
} bind def
68.0175 367.528 o
grestore
/DejaVuSans findfont
16.000 scalefont
setfont
gsave
62.923750 42.523750 translate
0.000000 rotate
0.000000 0.000000 m /zero glyphshow
grestore
gsave
/o {
gsave
newpath
translate
0.5 setlinewidth
1 setlinejoin
0 setlinecap
0 0 m
0 4 l

gsave
0.000 setgray
fill
grestore
stroke
grestore
} bind def
148.709 58.68 o
grestore
gsave
/o {
gsave
newpath
translate
0.5 setlinewidth
1 setlinejoin
0 setlinecap
0 0 m
0 -4 l

gsave
0.000 setgray
fill
grestore
stroke
grestore
} bind def
148.709 367.528 o
grestore
gsave
138.521750 42.523750 translate
0.000000 rotate
0.000000 0.000000 m /two glyphshow
10.179688 0.000000 m /zero glyphshow
grestore
gsave
/o {
gsave
newpath
translate
0.5 setlinewidth
1 setlinejoin
0 setlinecap
0 0 m
0 4 l

gsave
0.000 setgray
fill
grestore
stroke
grestore
} bind def
229.401 58.68 o
grestore
gsave
/o {
gsave
newpath
translate
0.5 setlinewidth
1 setlinejoin
0 setlinecap
0 0 m
0 -4 l

gsave
0.000 setgray
fill
grestore
stroke
grestore
} bind def
229.401 367.528 o
grestore
gsave
219.213500 42.523750 translate
0.000000 rotate
0.000000 0.000000 m /four glyphshow
10.179688 0.000000 m /zero glyphshow
grestore
gsave
/o {
gsave
newpath
translate
0.5 setlinewidth
1 setlinejoin
0 setlinecap
0 0 m
0 4 l

gsave
0.000 setgray
fill
grestore
stroke
grestore
} bind def
310.093 58.68 o
grestore
gsave
/o {
gsave
newpath
translate
0.5 setlinewidth
1 setlinejoin
0 setlinecap
0 0 m
0 -4 l

gsave
0.000 setgray
fill
grestore
stroke
grestore
} bind def
310.093 367.528 o
grestore
gsave
299.905250 42.523750 translate
0.000000 rotate
0.000000 0.000000 m /six glyphshow
10.179688 0.000000 m /zero glyphshow
grestore
gsave
/o {
gsave
newpath
translate
0.5 setlinewidth
1 setlinejoin
0 setlinecap
0 0 m
0 4 l

gsave
0.000 setgray
fill
grestore
stroke
grestore
} bind def
390.784 58.68 o
grestore
gsave
/o {
gsave
newpath
translate
0.5 setlinewidth
1 setlinejoin
0 setlinecap
0 0 m
0 -4 l

gsave
0.000 setgray
fill
grestore
stroke
grestore
} bind def
390.784 367.528 o
grestore
gsave
380.597000 42.523750 translate
0.000000 rotate
0.000000 0.000000 m /eight glyphshow
10.179688 0.000000 m /zero glyphshow
grestore
gsave
/o {
gsave
newpath
translate
0.5 setlinewidth
1 setlinejoin
0 setlinecap
0 0 m
0 4 l

gsave
0.000 setgray
fill
grestore
stroke
grestore
} bind def
471.476 58.68 o
grestore
gsave
/o {
gsave
newpath
translate
0.5 setlinewidth
1 setlinejoin
0 setlinecap
0 0 m
0 -4 l

gsave
0.000 setgray
fill
grestore
stroke
grestore
} bind def
471.476 367.528 o
grestore
gsave
456.195000 42.523750 translate
0.000000 rotate
0.000000 0.000000 m /one glyphshow
10.179688 0.000000 m /zero glyphshow
20.359375 0.000000 m /zero glyphshow
grestore
gsave
172.215625 22.039375 translate
0.000000 rotate
0.000000 0.000000 m /I glyphshow
4.718750 0.000000 m /t glyphshow
10.992188 0.000000 m /e glyphshow
20.835938 0.000000 m /r glyphshow
27.414062 0.000000 m /a glyphshow
37.218750 0.000000 m /t glyphshow
43.492188 0.000000 m /i glyphshow
47.937500 0.000000 m /o glyphshow
57.726562 0.000000 m /n glyphshow
67.867188 0.000000 m /space glyphshow
72.953125 0.000000 m /numbersign glyphshow
86.359375 0.000000 m /space glyphshow
91.445312 0.000000 m /parenleft glyphshow
97.687500 0.000000 m /N glyphshow
109.656250 0.000000 m /o glyphshow
119.445312 0.000000 m /r glyphshow
126.023438 0.000000 m /m glyphshow
141.609375 0.000000 m /a glyphshow
151.414062 0.000000 m /l glyphshow
155.859375 0.000000 m /i glyphshow
160.304688 0.000000 m /z glyphshow
168.703125 0.000000 m /e glyphshow
178.546875 0.000000 m /d glyphshow
188.703125 0.000000 m /parenright glyphshow
grestore
gsave
/o {
gsave
newpath
translate
0.5 setlinewidth
1 setlinejoin
0 setlinecap
0 0 m
4 0 l

gsave
0.000 setgray
fill
grestore
stroke
grestore
} bind def
68.0175 58.68 o
grestore
gsave
/o {
gsave
newpath
translate
0.5 setlinewidth
1 setlinejoin
0 setlinecap
0 0 m
-4 0 l

gsave
0.000 setgray
fill
grestore
stroke
grestore
} bind def
471.476 58.68 o
grestore
gsave
38.548750 52.601875 translate
0.000000 rotate
0.000000 0.000000 m /zero glyphshow
10.179688 0.000000 m /period glyphshow
15.265625 0.000000 m /zero glyphshow
grestore
gsave
/o {
gsave
newpath
translate
0.5 setlinewidth
1 setlinejoin
0 setlinecap
0 0 m
4 0 l

gsave
0.000 setgray
fill
grestore
stroke
grestore
} bind def
68.0175 110.155 o
grestore
gsave
/o {
gsave
newpath
translate
0.5 setlinewidth
1 setlinejoin
0 setlinecap
0 0 m
-4 0 l

gsave
0.000 setgray
fill
grestore
stroke
grestore
} bind def
471.476 110.155 o
grestore
gsave
38.548750 104.076542 translate
0.000000 rotate
0.000000 0.000000 m /zero glyphshow
10.179688 0.000000 m /period glyphshow
15.265625 0.000000 m /two glyphshow
grestore
gsave
/o {
gsave
newpath
translate
0.5 setlinewidth
1 setlinejoin
0 setlinecap
0 0 m
4 0 l

gsave
0.000 setgray
fill
grestore
stroke
grestore
} bind def
68.0175 161.629 o
grestore
gsave
/o {
gsave
newpath
translate
0.5 setlinewidth
1 setlinejoin
0 setlinecap
0 0 m
-4 0 l

gsave
0.000 setgray
fill
grestore
stroke
grestore
} bind def
471.476 161.629 o
grestore
gsave
38.548750 155.551208 translate
0.000000 rotate
0.000000 0.000000 m /zero glyphshow
10.179688 0.000000 m /period glyphshow
15.265625 0.000000 m /four glyphshow
grestore
gsave
/o {
gsave
newpath
translate
0.5 setlinewidth
1 setlinejoin
0 setlinecap
0 0 m
4 0 l

gsave
0.000 setgray
fill
grestore
stroke
grestore
} bind def
68.0175 213.104 o
grestore
gsave
/o {
gsave
newpath
translate
0.5 setlinewidth
1 setlinejoin
0 setlinecap
0 0 m
-4 0 l

gsave
0.000 setgray
fill
grestore
stroke
grestore
} bind def
471.476 213.104 o
grestore
gsave
38.548750 207.025875 translate
0.000000 rotate
0.000000 0.000000 m /zero glyphshow
10.179688 0.000000 m /period glyphshow
15.265625 0.000000 m /six glyphshow
grestore
gsave
/o {
gsave
newpath
translate
0.5 setlinewidth
1 setlinejoin
0 setlinecap
0 0 m
4 0 l

gsave
0.000 setgray
fill
grestore
stroke
grestore
} bind def
68.0175 264.579 o
grestore
gsave
/o {
gsave
newpath
translate
0.5 setlinewidth
1 setlinejoin
0 setlinecap
0 0 m
-4 0 l

gsave
0.000 setgray
fill
grestore
stroke
grestore
} bind def
471.476 264.579 o
grestore
gsave
38.548750 258.500542 translate
0.000000 rotate
0.000000 0.000000 m /zero glyphshow
10.179688 0.000000 m /period glyphshow
15.265625 0.000000 m /eight glyphshow
grestore
gsave
/o {
gsave
newpath
translate
0.5 setlinewidth
1 setlinejoin
0 setlinecap
0 0 m
4 0 l

gsave
0.000 setgray
fill
grestore
stroke
grestore
} bind def
68.0175 316.053 o
grestore
gsave
/o {
gsave
newpath
translate
0.5 setlinewidth
1 setlinejoin
0 setlinecap
0 0 m
-4 0 l

gsave
0.000 setgray
fill
grestore
stroke
grestore
} bind def
471.476 316.053 o
grestore
gsave
38.548750 309.975208 translate
0.000000 rotate
0.000000 0.000000 m /one glyphshow
10.179688 0.000000 m /period glyphshow
15.265625 0.000000 m /zero glyphshow
grestore
gsave
/o {
gsave
newpath
translate
0.5 setlinewidth
1 setlinejoin
0 setlinecap
0 0 m
4 0 l

gsave
0.000 setgray
fill
grestore
stroke
grestore
} bind def
68.0175 367.528 o
grestore
gsave
/o {
gsave
newpath
translate
0.5 setlinewidth
1 setlinejoin
0 setlinecap
0 0 m
-4 0 l

gsave
0.000 setgray
fill
grestore
stroke
grestore
} bind def
471.476 367.528 o
grestore
gsave
38.548750 361.449875 translate
0.000000 rotate
0.000000 0.000000 m /one glyphshow
10.179688 0.000000 m /period glyphshow
15.265625 0.000000 m /two glyphshow
grestore
gsave
30.220625 122.947750 translate
90.000000 rotate
0.000000 0.000000 m /N glyphshow
11.968750 0.000000 m /o glyphshow
21.757812 0.000000 m /r glyphshow
28.335938 0.000000 m /m glyphshow
43.921875 0.000000 m /a glyphshow
53.726562 0.000000 m /l glyphshow
58.171875 0.000000 m /i glyphshow
62.617188 0.000000 m /z glyphshow
71.015625 0.000000 m /e glyphshow
80.859375 0.000000 m /d glyphshow
91.015625 0.000000 m /space glyphshow
96.101562 0.000000 m /F glyphshow
105.289062 0.000000 m /r glyphshow
111.867188 0.000000 m /e glyphshow
121.710938 0.000000 m /q glyphshow
131.867188 0.000000 m /u glyphshow
142.007812 0.000000 m /e glyphshow
151.851562 0.000000 m /n glyphshow
161.992188 0.000000 m /c glyphshow
170.789062 0.000000 m /y glyphshow
grestore
/DejaVuSans findfont
19.200 scalefont
setfont
gsave
73.832813 399.983085 translate
0.000000 rotate
0.000000 0.000000 m /N glyphshow
14.399902 0.000000 m /e glyphshow
26.243164 0.000000 m /k glyphshow
37.390869 0.000000 m /b glyphshow
49.610107 0.000000 m /o glyphshow
61.387573 0.000000 m /n glyphshow
73.588013 0.000000 m /e glyphshow
85.431274 0.000000 m /space glyphshow
91.550293 0.000000 m /I glyphshow
97.227539 0.000000 m /t glyphshow
104.775269 0.000000 m /e glyphshow
116.618530 0.000000 m /r glyphshow
124.532837 0.000000 m /a glyphshow
136.329102 0.000000 m /t glyphshow
143.876831 0.000000 m /i glyphshow
149.225098 0.000000 m /o glyphshow
161.002563 0.000000 m /n glyphshow
173.203003 0.000000 m /space glyphshow
179.322021 0.000000 m /L glyphshow
190.046753 0.000000 m /o glyphshow
201.824219 0.000000 m /o glyphshow
213.601685 0.000000 m /p glyphshow
225.820923 0.000000 m /space glyphshow
231.939941 0.000000 m /M glyphshow
248.548706 0.000000 m /e glyphshow
260.391968 0.000000 m /a glyphshow
272.188232 0.000000 m /n glyphshow
284.388672 0.000000 m /space glyphshow
290.507690 0.000000 m /F glyphshow
301.564575 0.000000 m /r glyphshow
309.478882 0.000000 m /e glyphshow
321.322144 0.000000 m /q glyphshow
333.541382 0.000000 m /u glyphshow
345.741821 0.000000 m /e glyphshow
357.585083 0.000000 m /n glyphshow
369.785522 0.000000 m /c glyphshow
380.369263 0.000000 m /y glyphshow
grestore
gsave
139.004688 378.704960 translate
0.000000 rotate
0.000000 0.000000 m /at glyphshow
19.250000 0.000000 m /space glyphshow
25.369019 0.000000 m /one glyphshow
37.616455 0.000000 m /five glyphshow
49.863892 0.000000 m /zero glyphshow
62.111328 0.000000 m /space glyphshow
68.230347 0.000000 m /W glyphshow
87.264160 0.000000 m /space glyphshow
93.383179 0.000000 m /hyphen glyphshow
100.329346 0.000000 m /space glyphshow
106.448364 0.000000 m /K glyphshow
119.071777 0.000000 m /n glyphshow
131.272217 0.000000 m /i glyphshow
136.620483 0.000000 m /g glyphshow
148.839722 0.000000 m /h glyphshow
161.040161 0.000000 m /t glyphshow
168.587891 0.000000 m /s glyphshow
178.617065 0.000000 m /space glyphshow
184.736084 0.000000 m /L glyphshow
195.460815 0.000000 m /a glyphshow
207.257080 0.000000 m /n glyphshow
219.457520 0.000000 m /d glyphshow
231.676758 0.000000 m /i glyphshow
237.025024 0.000000 m /n glyphshow
249.225464 0.000000 m /g glyphshow
grestore
3.000 setlinewidth
2 setlinecap
gsave
403.5 308.8 68.02 58.68 clipbox
68.0175 335.850786 m
88.291809 335.851313 l
90.31924 224.757166 l
92.346671 175.258377 l
94.374102 175.723967 l
96.401533 177.202067 l
98.428964 177.304225 l
100.456394 258.807078 l
102.483825 277.919091 l
104.511256 300.803037 l
106.538687 303.778849 l
108.566118 302.179522 l
110.593549 304.013934 l
112.62098 302.151304 l
114.648411 303.495646 l
116.675842 300.85491 l
118.703273 302.231525 l
120.730704 300.930637 l
122.758134 300.07591 l
124.785565 300.280425 l
126.812996 300.745731 l
128.840427 299.814513 l
130.867858 299.940304 l
132.895289 299.650897 l
134.92272 284.664323 l
136.950151 283.651704 l
138.977582 288.763689 l
141.005013 289.089315 l
143.032443 287.261063 l
145.059874 289.069115 l
147.087305 289.111487 l
149.114736 288.322255 l
151.142167 288.503494 l
153.169598 286.367366 l
155.197029 288.658431 l
157.22446 288.027797 l
159.251891 269.194864 l
161.279322 268.443361 l
163.306753 269.098153 l
165.334183 269.408981 l
167.361614 272.137847 l
169.389045 266.37326 l
171.416476 268.80993 l
173.443907 269.241535 l
175.471338 270.001044 l
177.498769 268.182777 l
179.5262 269.772063 l
181.553631 264.003779 l
183.581062 257.486034 l
185.608492 260.634883 l
187.635923 259.283367 l
189.663354 260.532789 l
191.690785 257.334295 l
193.718216 258.605484 l
195.745647 258.595834 l
197.773078 259.831675 l
199.800509 259.15371 l
201.82794 258.207204 l
203.855371 258.554854 l
205.882802 257.947331 l
207.910232 259.079544 l
209.937663 237.129991 l
211.965094 225.120416 l
213.992525 222.067415 l
216.019956 225.401771 l
218.047387 224.152739 l
220.074818 223.720305 l
222.102249 221.339917 l
224.12968 223.360341 l
226.157111 222.710011 l
228.184541 221.624431 l
230.211972 221.750046 l
232.239403 227.354732 l
234.266834 225.536299 l
236.294265 257.963838 l
238.321696 265.3491 l
240.349127 266.884833 l
242.376558 267.316432 l
244.403989 267.308738 l
246.43142 265.055708 l
248.458851 265.534007 l
250.486281 266.673276 l
252.513712 264.492814 l
254.541143 266.901114 l
256.568574 265.422525 l
258.596005 265.994269 l
260.623436 264.689191 l
262.650867 266.461238 l
264.678298 264.613899 l
266.705729 264.560806 l
268.73316 334.006207 l
270.76059 335.852458 l
297.117192 335.851423 l
299.144623 323.868887 l
301.172054 262.054798 l
303.199485 261.176395 l
305.226916 262.589769 l
307.254347 262.488874 l
309.281778 263.896754 l
311.309209 266.810949 l
313.336639 286.33438 l
315.36407 288.786087 l
317.391501 287.685357 l
319.418932 288.278875 l
321.446363 286.628685 l
323.473794 287.406246 l
325.501225 287.902893 l
327.528656 286.556771 l
329.556087 279.286087 l
331.583518 282.371072 l
333.610948 282.379841 l
335.638379 281.380493 l
337.66581 282.472277 l
339.693241 281.319384 l
341.720672 282.005662 l
343.748103 280.660206 l
345.775534 275.877207 l
347.802965 276.659178 l
349.830396 275.814192 l
351.857827 275.857132 l
353.885258 277.674696 l
355.912688 276.278493 l
357.940119 276.170645 l
359.96755 277.202066 l
361.994981 276.682227 l
364.022412 275.098837 l
366.049843 275.843815 l
368.077274 276.15313 l
370.104705 277.699334 l
372.132136 262.987586 l
374.159567 257.478281 l
376.186997 257.814278 l
378.214428 257.747741 l
380.241859 258.881094 l
382.26929 258.502339 l
384.296721 259.44759 l
386.324152 259.683398 l
388.351583 258.034388 l
390.379014 257.849839 l
392.406445 259.516644 l
394.433876 262.493986 l
396.461307 266.717758 l
398.488737 266.56097 l
400.516168 266.249451 l
402.543599 266.671406 l
404.57103 265.437213 l
406.598461 266.066237 l
408.625892 265.441024 l
410.653323 266.432673 l
412.680754 265.517882 l
414.708185 264.918886 l
416.735616 265.254971 l
418.763046 262.457147 l
420.790477 252.852515 l
422.817908 254.821522 l
424.845339 252.102652 l
426.87277 254.478962 l
428.900201 252.749591 l
430.927632 252.37505 l
432.955063 252.43337 l
434.982494 253.526817 l
437.009925 252.821288 l
439.037356 254.322361 l
441.064786 257.535051 l
443.092217 254.558139 l
445.119648 253.275044 l
447.147079 259.489526 l
451.201941 256.591196 l
453.229372 256.661029 l
455.256803 257.255713 l
457.284234 256.096145 l
459.311665 254.30073 l
461.339095 257.548646 l
463.366526 257.240613 l
465.393957 256.540031 l
467.421388 258.705475 l
469.448819 264.526298 l
471.47625 268.26945 l
471.47625 268.26945 l
stroke
grestore
1.000 setlinewidth
1.000 0.000 0.000 setrgbcolor
gsave
403.5 308.8 68.02 58.68 clipbox
68.0175 335.850786 m
88.291809 335.851313 l
90.31924 224.757166 l
92.346671 175.258377 l
94.374102 175.723967 l
96.401533 177.202067 l
98.428964 177.304225 l
100.456394 258.807078 l
102.483825 277.919091 l
104.511256 300.803037 l
106.538687 303.778849 l
108.566118 302.179522 l
110.593549 304.013934 l
112.62098 302.151304 l
114.648411 303.495646 l
116.675842 300.85491 l
118.703273 302.231525 l
120.730704 300.930637 l
122.758134 300.07591 l
124.785565 300.280425 l
126.812996 300.745731 l
128.840427 299.814513 l
130.867858 299.940304 l
132.895289 299.650897 l
134.92272 284.664323 l
136.950151 283.651704 l
138.977582 288.763689 l
141.005013 289.089315 l
143.032443 287.261063 l
145.059874 289.069115 l
147.087305 289.111487 l
149.114736 288.322255 l
151.142167 288.503494 l
153.169598 286.367366 l
155.197029 288.658431 l
157.22446 288.027797 l
159.251891 269.194864 l
161.279322 268.443361 l
163.306753 269.098153 l
165.334183 269.408981 l
167.361614 272.137847 l
169.389045 266.37326 l
171.416476 268.80993 l
173.443907 269.241535 l
175.471338 270.001044 l
177.498769 268.182777 l
179.5262 269.772063 l
181.553631 264.003779 l
183.581062 257.486034 l
185.608492 260.634883 l
187.635923 259.283367 l
189.663354 260.532789 l
191.690785 257.334295 l
193.718216 258.605484 l
195.745647 258.595834 l
197.773078 259.831675 l
199.800509 259.15371 l
201.82794 258.207204 l
203.855371 258.554854 l
205.882802 257.947331 l
207.910232 259.079544 l
209.937663 237.129991 l
211.965094 225.120416 l
213.992525 222.067415 l
216.019956 225.401771 l
218.047387 224.152739 l
220.074818 223.720305 l
222.102249 221.339917 l
224.12968 223.360341 l
226.157111 222.710011 l
228.184541 221.624431 l
230.211972 221.750046 l
232.239403 227.354732 l
234.266834 225.536299 l
236.294265 257.963838 l
238.321696 265.3491 l
240.349127 266.884833 l
242.376558 267.316432 l
244.403989 267.308738 l
246.43142 265.055708 l
248.458851 265.534007 l
250.486281 266.673276 l
252.513712 264.492814 l
254.541143 266.901114 l
256.568574 265.422525 l
258.596005 265.994269 l
260.623436 264.689191 l
262.650867 266.461238 l
264.678298 264.613899 l
266.705729 264.560806 l
268.73316 334.006207 l
270.76059 335.852458 l
297.117192 335.851423 l
299.144623 323.868887 l
301.172054 262.054798 l
303.199485 261.176395 l
305.226916 262.589769 l
307.254347 262.488874 l
309.281778 263.896754 l
311.309209 266.810949 l
313.336639 286.33438 l
315.36407 288.786087 l
317.391501 287.685357 l
319.418932 288.278875 l
321.446363 286.628685 l
323.473794 287.406246 l
325.501225 287.902893 l
327.528656 286.556771 l
329.556087 279.286087 l
331.583518 282.371072 l
333.610948 282.379841 l
335.638379 281.380493 l
337.66581 282.472277 l
339.693241 281.319384 l
341.720672 282.005662 l
343.748103 280.660206 l
345.775534 275.877207 l
347.802965 276.659178 l
349.830396 275.814192 l
351.857827 275.857132 l
353.885258 277.674696 l
355.912688 276.278493 l
357.940119 276.170645 l
359.96755 277.202066 l
361.994981 276.682227 l
364.022412 275.098837 l
366.049843 275.843815 l
368.077274 276.15313 l
370.104705 277.699334 l
372.132136 262.987586 l
374.159567 257.478281 l
376.186997 257.814278 l
378.214428 257.747741 l
380.241859 258.881094 l
382.26929 258.502339 l
384.296721 259.44759 l
386.324152 259.683398 l
388.351583 258.034388 l
390.379014 257.849839 l
392.406445 259.516644 l
394.433876 262.493986 l
396.461307 266.717758 l
398.488737 266.56097 l
400.516168 266.249451 l
402.543599 266.671406 l
404.57103 265.437213 l
406.598461 266.066237 l
408.625892 265.441024 l
410.653323 266.432673 l
412.680754 265.517882 l
414.708185 264.918886 l
416.735616 265.254971 l
418.763046 262.457147 l
420.790477 252.852515 l
422.817908 254.821522 l
424.845339 252.102652 l
426.87277 254.478962 l
428.900201 252.749591 l
430.927632 252.37505 l
432.955063 252.43337 l
434.982494 253.526817 l
437.009925 252.821288 l
439.037356 254.322361 l
441.064786 257.535051 l
443.092217 254.558139 l
445.119648 253.275044 l
447.147079 259.489526 l
451.201941 256.591196 l
453.229372 256.661029 l
455.256803 257.255713 l
457.284234 256.096145 l
459.311665 254.30073 l
461.339095 257.548646 l
463.366526 257.240613 l
465.393957 256.540031 l
467.421388 258.705475 l
469.448819 264.526298 l
471.47625 268.26945 l
471.47625 268.26945 l
stroke
grestore
0 setlinejoin
0 setlinecap
[] 0 setdash
0.300 setgray
gsave
126.93125 62.68 m
416.5625 62.68 l
418.1625 62.68 418.9625 63.48 418.9625 65.08 c
418.9625 121.78 l
418.9625 123.38 418.1625 124.18 416.5625 124.18 c
126.93125 124.18 l
125.33125 124.18 124.53125 123.38 124.53125 121.78 c
124.53125 65.08 l
124.53125 63.48 125.33125 62.68 126.93125 62.68 c
cl
gsave
fill
grestore
stroke
grestore
0.000 setgray
gsave
124.93125 64.68 m
414.5625 64.68 l
416.1625 64.68 416.9625 65.48 416.9625 67.08 c
416.9625 123.78 l
416.9625 125.38 416.1625 126.18 414.5625 126.18 c
124.93125 126.18 l
123.33125 126.18 122.53125 125.38 122.53125 123.78 c
122.53125 67.08 l
122.53125 65.48 123.33125 64.68 124.93125 64.68 c
cl
gsave
1.000 setgray
fill
grestore
stroke
grestore
2.000 setlinewidth
1 setlinejoin
2 setlinecap
[] 0 setdash
0.050 0.030 0.528 setrgbcolor
gsave
130.93125 116.455 m
147.73125 116.455 l
stroke
grestore
0.000 setgray
/DejaVuSans findfont
12.000 scalefont
setfont
gsave
160.931250 112.255000 translate
0.000000 rotate
0.000000 0.000000 m /N glyphshow
8.976562 0.000000 m /o glyphshow
16.318359 0.000000 m /d glyphshow
23.935547 0.000000 m /e glyphshow
31.318359 0.000000 m /space glyphshow
35.132812 0.000000 m /one glyphshow
grestore
0.228 0.016 0.605 setrgbcolor
gsave
130.93125 103.03 m
147.73125 103.03 l
stroke
grestore
0.000 setgray
gsave
160.931250 98.830000 translate
0.000000 rotate
0.000000 0.000000 m /N glyphshow
8.976562 0.000000 m /o glyphshow
16.318359 0.000000 m /d glyphshow
23.935547 0.000000 m /e glyphshow
31.318359 0.000000 m /space glyphshow
35.132812 0.000000 m /two glyphshow
grestore
0.363 0.003 0.649 setrgbcolor
gsave
130.93125 89.605 m
147.73125 89.605 l
stroke
grestore
0.000 setgray
gsave
160.931250 85.405000 translate
0.000000 rotate
0.000000 0.000000 m /N glyphshow
8.976562 0.000000 m /o glyphshow
16.318359 0.000000 m /d glyphshow
23.935547 0.000000 m /e glyphshow
31.318359 0.000000 m /space glyphshow
35.132812 0.000000 m /three glyphshow
grestore
0.495 0.012 0.658 setrgbcolor
gsave
130.93125 76.18 m
147.73125 76.18 l
stroke
grestore
0.000 setgray
gsave
160.931250 71.980000 translate
0.000000 rotate
0.000000 0.000000 m /N glyphshow
8.976562 0.000000 m /o glyphshow
16.318359 0.000000 m /d glyphshow
23.935547 0.000000 m /e glyphshow
31.318359 0.000000 m /space glyphshow
35.132812 0.000000 m /four glyphshow
grestore
0.611 0.090 0.620 setrgbcolor
gsave
231.328125 116.455 m
248.128125 116.455 l
stroke
grestore
0.000 setgray
gsave
261.328125 112.255000 translate
0.000000 rotate
0.000000 0.000000 m /N glyphshow
8.976562 0.000000 m /o glyphshow
16.318359 0.000000 m /d glyphshow
23.935547 0.000000 m /e glyphshow
31.318359 0.000000 m /space glyphshow
35.132812 0.000000 m /five glyphshow
grestore
0.711 0.183 0.550 setrgbcolor
gsave
231.328125 103.03 m
248.128125 103.03 l
stroke
grestore
0.000 setgray
gsave
261.328125 98.830000 translate
0.000000 rotate
0.000000 0.000000 m /N glyphshow
8.976562 0.000000 m /o glyphshow
16.318359 0.000000 m /d glyphshow
23.935547 0.000000 m /e glyphshow
31.318359 0.000000 m /space glyphshow
35.132812 0.000000 m /six glyphshow
grestore
0.798 0.280 0.470 setrgbcolor
gsave
231.328125 89.605 m
248.128125 89.605 l
stroke
grestore
0.000 setgray
gsave
261.328125 85.405000 translate
0.000000 rotate
0.000000 0.000000 m /N glyphshow
8.976562 0.000000 m /o glyphshow
16.318359 0.000000 m /d glyphshow
23.935547 0.000000 m /e glyphshow
31.318359 0.000000 m /space glyphshow
35.132812 0.000000 m /seven glyphshow
grestore
3.000 setlinewidth
gsave
231.328125 76.18 m
248.128125 76.18 l
stroke
grestore
2.000 setlinewidth
1.000 0.000 0.000 setrgbcolor
gsave
231.328125 76.18 m
248.128125 76.18 l
stroke
grestore
0.000 setgray
gsave
261.328125 71.980000 translate
0.000000 rotate
0.000000 0.000000 m /N glyphshow
8.976562 0.000000 m /o glyphshow
16.318359 0.000000 m /d glyphshow
23.935547 0.000000 m /e glyphshow
31.318359 0.000000 m /space glyphshow
35.132812 0.000000 m /eight glyphshow
grestore
0.869 0.374 0.397 setrgbcolor
gsave
331.725 116.455 m
348.525 116.455 l
stroke
grestore
0.000 setgray
gsave
361.725000 112.255000 translate
0.000000 rotate
0.000000 0.000000 m /N glyphshow
8.976562 0.000000 m /o glyphshow
16.318359 0.000000 m /d glyphshow
23.935547 0.000000 m /e glyphshow
31.318359 0.000000 m /space glyphshow
35.132812 0.000000 m /nine glyphshow
grestore
0.928 0.473 0.326 setrgbcolor
gsave
331.725 103.03 m
348.525 103.03 l
stroke
grestore
0.000 setgray
gsave
361.725000 98.830000 translate
0.000000 rotate
0.000000 0.000000 m /N glyphshow
8.976562 0.000000 m /o glyphshow
16.318359 0.000000 m /d glyphshow
23.935547 0.000000 m /e glyphshow
31.318359 0.000000 m /space glyphshow
35.132812 0.000000 m /one glyphshow
42.767578 0.000000 m /zero glyphshow
grestore
0.973 0.586 0.252 setrgbcolor
gsave
331.725 89.605 m
348.525 89.605 l
stroke
grestore
0.000 setgray
gsave
361.725000 85.405000 translate
0.000000 rotate
0.000000 0.000000 m /N glyphshow
8.976562 0.000000 m /o glyphshow
16.318359 0.000000 m /d glyphshow
23.935547 0.000000 m /e glyphshow
31.318359 0.000000 m /space glyphshow
35.132812 0.000000 m /one glyphshow
42.767578 0.000000 m /one glyphshow
grestore
0.994 0.705 0.183 setrgbcolor
gsave
331.725 76.18 m
348.525 76.18 l
stroke
grestore
0.000 setgray
gsave
361.725000 71.980000 translate
0.000000 rotate
0.000000 0.000000 m /N glyphshow
8.976562 0.000000 m /o glyphshow
16.318359 0.000000 m /d glyphshow
23.935547 0.000000 m /e glyphshow
31.318359 0.000000 m /space glyphshow
35.132812 0.000000 m /one glyphshow
42.767578 0.000000 m /two glyphshow
grestore

end
showpage
