%!PS-Adobe-3.0 EPSF-3.0
%%Title: figures/hacc-12-node-new-governor/hacc_135_epoch_max_loop_time_comparison.eps
%%Creator: matplotlib version 2.0.0, http://matplotlib.org/
%%CreationDate: Mon Mar 27 16:21:05 2017
%%Orientation: portrait
%%BoundingBox: 54 180 558 612
%%EndComments
%%BeginProlog
/mpldict 8 dict def
mpldict begin
/m { moveto } bind def
/l { lineto } bind def
/r { rlineto } bind def
/c { curveto } bind def
/cl { closepath } bind def
/box {
m
1 index 0 r
0 exch r
neg 0 r
cl
} bind def
/clipbox {
box
clip
newpath
} bind def
%!PS-Adobe-3.0 Resource-Font
%%Title: DejaVu Sans
%%Copyright: Copyright (c) 2003 by Bitstream, Inc. All Rights Reserved. Copyright (c) 2006 by Tavmjong Bah. All Rights Reserved. DejaVu changes are in public domain 
%%Creator: Converted from TrueType to type 3 by PPR
25 dict begin
/_d{bind def}bind def
/_m{moveto}_d
/_l{lineto}_d
/_cl{closepath eofill}_d
/_c{curveto}_d
/_sc{7 -1 roll{setcachedevice}{pop pop pop pop pop pop}ifelse}_d
/_e{exec}_d
/FontName /DejaVuSans def
/PaintType 0 def
/FontMatrix[.001 0 0 .001 0 0]def
/FontBBox[-1021 -463 1793 1232]def
/FontType 3 def
/Encoding [ /space /numbersign /parenleft /parenright /hyphen /period /zero /one /two /three /four /five /six /seven /eight /nine /at /A /B /C /E /H /I /K /L /N /P /T /W /a /c /d /e /g /h /i /l /m /n /o /p /r /s /t /u /z ] def
/FontInfo 10 dict dup begin
/FamilyName (DejaVu Sans) def
/FullName (DejaVu Sans) def
/Notice (Copyright (c) 2003 by Bitstream, Inc. All Rights Reserved. Copyright (c) 2006 by Tavmjong Bah. All Rights Reserved. DejaVu changes are in public domain ) def
/Weight (Book) def
/Version (Version 2.35) def
/ItalicAngle 0.0 def
/isFixedPitch false def
/UnderlinePosition -130 def
/UnderlineThickness 90 def
end readonly def
/CharStrings 46 dict dup begin
/space{318 0 0 0 0 0 _sc
}_d
/numbersign{{838 0 77 0 761 718 _sc
511 440 _m
369 440 _l
328 277 _l
471 277 _l
511 440 _l
438 718 _m
387 515 _l
530 515 _l
581 718 _l
659 718 _l
609 515 _l
761 515 _l
761 440 _l
590 440 _l
550 277 _l
705 277 _l
705 202 _l
531 202 _l
480 0 _l
402 0 _l
452 202 _l
309 202 _l
259 0 _l
180 0 _l
231 202 _l
77 202 _l
77 277 _l
249 277 _l
290 440 _l
133 440 _l
}_e{133 515 _l
309 515 _l
359 718 _l
438 718 _l
_cl}_e}_d
/parenleft{390 0 86 -131 310 759 _sc
310 759 _m
266 683 234 609 213 536 _c
191 463 181 389 181 314 _c
181 238 191 164 213 91 _c
234 17 266 -56 310 -131 _c
232 -131 _l
183 -54 146 20 122 94 _c
98 168 86 241 86 314 _c
86 386 98 459 122 533 _c
146 607 182 682 232 759 _c
310 759 _l
_cl}_d
/parenright{390 0 80 -131 304 759 _sc
80 759 _m
158 759 _l
206 682 243 607 267 533 _c
291 459 304 386 304 314 _c
304 241 291 168 267 94 _c
243 20 206 -54 158 -131 _c
80 -131 _l
123 -56 155 17 177 91 _c
198 164 209 238 209 314 _c
209 389 198 463 177 536 _c
155 609 123 683 80 759 _c
_cl}_d
/hyphen{361 0 49 234 312 314 _sc
49 314 _m
312 314 _l
312 234 _l
49 234 _l
49 314 _l
_cl}_d
/period{318 0 107 0 210 124 _sc
107 124 _m
210 124 _l
210 0 _l
107 0 _l
107 124 _l
_cl}_d
/zero{636 0 66 -13 570 742 _sc
318 664 _m
267 664 229 639 203 589 _c
177 539 165 464 165 364 _c
165 264 177 189 203 139 _c
229 89 267 64 318 64 _c
369 64 407 89 433 139 _c
458 189 471 264 471 364 _c
471 464 458 539 433 589 _c
407 639 369 664 318 664 _c
318 742 _m
399 742 461 709 505 645 _c
548 580 570 486 570 364 _c
570 241 548 147 505 83 _c
461 19 399 -13 318 -13 _c
236 -13 173 19 130 83 _c
87 147 66 241 66 364 _c
66 486 87 580 130 645 _c
173 709 236 742 318 742 _c
_cl}_d
/one{636 0 110 0 544 729 _sc
124 83 _m
285 83 _l
285 639 _l
110 604 _l
110 694 _l
284 729 _l
383 729 _l
383 83 _l
544 83 _l
544 0 _l
124 0 _l
124 83 _l
_cl}_d
/two{{636 0 73 0 536 742 _sc
192 83 _m
536 83 _l
536 0 _l
73 0 _l
73 83 _l
110 121 161 173 226 239 _c
290 304 331 346 348 365 _c
380 400 402 430 414 455 _c
426 479 433 504 433 528 _c
433 566 419 598 392 622 _c
365 646 330 659 286 659 _c
255 659 222 653 188 643 _c
154 632 117 616 78 594 _c
78 694 _l
118 710 155 722 189 730 _c
223 738 255 742 284 742 _c
}_e{359 742 419 723 464 685 _c
509 647 532 597 532 534 _c
532 504 526 475 515 449 _c
504 422 484 390 454 354 _c
446 344 420 317 376 272 _c
332 227 271 164 192 83 _c
_cl}_e}_d
/three{{636 0 76 -13 556 742 _sc
406 393 _m
453 383 490 362 516 330 _c
542 298 556 258 556 212 _c
556 140 531 84 482 45 _c
432 6 362 -13 271 -13 _c
240 -13 208 -10 176 -4 _c
144 1 110 10 76 22 _c
76 117 _l
103 101 133 89 166 81 _c
198 73 232 69 268 69 _c
330 69 377 81 409 105 _c
441 129 458 165 458 212 _c
458 254 443 288 413 312 _c
383 336 341 349 287 349 _c
}_e{202 349 _l
202 430 _l
291 430 _l
339 430 376 439 402 459 _c
428 478 441 506 441 543 _c
441 580 427 609 401 629 _c
374 649 336 659 287 659 _c
260 659 231 656 200 650 _c
169 644 135 635 98 623 _c
98 711 _l
135 721 170 729 203 734 _c
235 739 266 742 296 742 _c
370 742 429 725 473 691 _c
517 657 539 611 539 553 _c
539 513 527 479 504 451 _c
481 423 448 403 406 393 _c
_cl}_e}_d
/four{636 0 49 0 580 729 _sc
378 643 _m
129 254 _l
378 254 _l
378 643 _l
352 729 _m
476 729 _l
476 254 _l
580 254 _l
580 172 _l
476 172 _l
476 0 _l
378 0 _l
378 172 _l
49 172 _l
49 267 _l
352 729 _l
_cl}_d
/five{{636 0 77 -13 549 729 _sc
108 729 _m
495 729 _l
495 646 _l
198 646 _l
198 467 _l
212 472 227 476 241 478 _c
255 480 270 482 284 482 _c
365 482 429 459 477 415 _c
525 370 549 310 549 234 _c
549 155 524 94 475 51 _c
426 8 357 -13 269 -13 _c
238 -13 207 -10 175 -6 _c
143 -1 111 6 77 17 _c
77 116 _l
106 100 136 88 168 80 _c
199 72 232 69 267 69 _c
}_e{323 69 368 83 401 113 _c
433 143 450 183 450 234 _c
450 284 433 324 401 354 _c
368 384 323 399 267 399 _c
241 399 214 396 188 390 _c
162 384 135 375 108 363 _c
108 729 _l
_cl}_e}_d
/six{{636 0 70 -13 573 742 _sc
330 404 _m
286 404 251 388 225 358 _c
199 328 186 286 186 234 _c
186 181 199 139 225 109 _c
251 79 286 64 330 64 _c
374 64 409 79 435 109 _c
461 139 474 181 474 234 _c
474 286 461 328 435 358 _c
409 388 374 404 330 404 _c
526 713 _m
526 623 _l
501 635 476 644 451 650 _c
425 656 400 659 376 659 _c
310 659 260 637 226 593 _c
}_e{192 549 172 482 168 394 _c
187 422 211 444 240 459 _c
269 474 301 482 336 482 _c
409 482 467 459 509 415 _c
551 371 573 310 573 234 _c
573 159 550 99 506 54 _c
462 9 403 -13 330 -13 _c
246 -13 181 19 137 83 _c
92 147 70 241 70 364 _c
70 479 97 571 152 639 _c
206 707 280 742 372 742 _c
396 742 421 739 447 735 _c
472 730 498 723 526 713 _c
_cl}_e}_d
/seven{636 0 82 0 551 729 _sc
82 729 _m
551 729 _l
551 687 _l
286 0 _l
183 0 _l
432 646 _l
82 646 _l
82 729 _l
_cl}_d
/eight{{636 0 68 -13 568 742 _sc
318 346 _m
271 346 234 333 207 308 _c
180 283 167 249 167 205 _c
167 161 180 126 207 101 _c
234 76 271 64 318 64 _c
364 64 401 76 428 102 _c
455 127 469 161 469 205 _c
469 249 455 283 429 308 _c
402 333 365 346 318 346 _c
219 388 _m
177 398 144 418 120 447 _c
96 476 85 511 85 553 _c
85 611 105 657 147 691 _c
188 725 245 742 318 742 _c
}_e{390 742 447 725 489 691 _c
530 657 551 611 551 553 _c
551 511 539 476 515 447 _c
491 418 459 398 417 388 _c
464 377 501 355 528 323 _c
554 291 568 251 568 205 _c
568 134 546 80 503 43 _c
459 5 398 -13 318 -13 _c
237 -13 175 5 132 43 _c
89 80 68 134 68 205 _c
68 251 81 291 108 323 _c
134 355 171 377 219 388 _c
183 544 _m
183 506 194 476 218 455 _c
}_e{242 434 275 424 318 424 _c
360 424 393 434 417 455 _c
441 476 453 506 453 544 _c
453 582 441 611 417 632 _c
393 653 360 664 318 664 _c
275 664 242 653 218 632 _c
194 611 183 582 183 544 _c
_cl}_e}_d
/nine{{636 0 63 -13 566 742 _sc
110 15 _m
110 105 _l
134 93 159 84 185 78 _c
210 72 235 69 260 69 _c
324 69 374 90 408 134 _c
442 178 462 244 468 334 _c
448 306 424 284 396 269 _c
367 254 335 247 300 247 _c
226 247 168 269 126 313 _c
84 357 63 417 63 494 _c
63 568 85 628 129 674 _c
173 719 232 742 306 742 _c
390 742 455 709 499 645 _c
543 580 566 486 566 364 _c
}_e{566 248 538 157 484 89 _c
429 21 356 -13 264 -13 _c
239 -13 214 -10 189 -6 _c
163 -2 137 5 110 15 _c
306 324 _m
350 324 385 339 411 369 _c
437 399 450 441 450 494 _c
450 546 437 588 411 618 _c
385 648 350 664 306 664 _c
262 664 227 648 201 618 _c
175 588 162 546 162 494 _c
162 441 175 399 201 369 _c
227 339 262 324 306 324 _c
_cl}_e}_d
/at{{1000 0 66 -173 930 704 _sc
372 262 _m
372 215 383 178 406 152 _c
429 126 461 113 502 113 _c
542 113 573 126 596 153 _c
619 179 631 216 631 262 _c
631 308 619 344 596 371 _c
572 397 541 411 501 411 _c
461 411 430 397 407 371 _c
383 344 372 308 372 262 _c
638 116 _m
618 91 596 73 571 61 _c
545 49 516 43 483 43 _c
427 43 381 63 346 104 _c
311 144 294 197 294 262 _c
}_e{294 327 311 380 346 421 _c
381 461 427 482 483 482 _c
516 482 545 475 571 463 _c
596 451 618 432 638 408 _c
638 472 _l
708 472 _l
708 113 _l
755 120 792 142 819 178 _c
846 214 860 261 860 319 _c
860 353 854 386 844 417 _c
834 447 818 476 798 502 _c
764 544 722 577 674 600 _c
625 622 572 634 515 634 _c
475 634 436 628 400 618 _c
363 607 329 591 298 571 _c
}_e{246 537 206 494 178 440 _c
149 386 135 327 135 265 _c
135 213 144 165 163 120 _c
181 74 208 34 244 0 _c
278 -33 317 -58 362 -76 _c
407 -94 455 -103 507 -103 _c
549 -103 590 -96 630 -82 _c
670 -68 708 -47 742 -21 _c
786 -75 _l
745 -107 701 -131 653 -148 _c
605 -164 556 -173 507 -173 _c
447 -173 390 -162 336 -141 _c
282 -119 235 -88 194 -48 _c
152 -8 120 38 98 92 _c
}_e{76 146 66 203 66 265 _c
66 324 77 380 99 434 _c
121 488 152 535 194 576 _c
236 617 284 649 339 671 _c
394 693 452 704 514 704 _c
583 704 647 689 706 661 _c
765 633 815 593 855 541 _c
879 509 898 474 911 437 _c
923 399 930 361 930 321 _c
930 235 904 167 852 118 _c
800 68 729 43 638 41 _c
638 116 _l
_cl}_e}_d
/A{684 0 8 0 676 729 _sc
342 632 _m
208 269 _l
476 269 _l
342 632 _l
286 729 _m
398 729 _l
676 0 _l
573 0 _l
507 187 _l
178 187 _l
112 0 _l
8 0 _l
286 729 _l
_cl}_d
/B{{686 0 98 0 615 729 _sc
197 348 _m
197 81 _l
355 81 _l
408 81 447 92 473 114 _c
498 136 511 169 511 215 _c
511 260 498 293 473 315 _c
447 337 408 348 355 348 _c
197 348 _l
197 648 _m
197 428 _l
343 428 _l
391 428 426 437 450 455 _c
474 473 486 500 486 538 _c
486 574 474 602 450 620 _c
426 638 391 648 343 648 _c
197 648 _l
98 729 _m
350 729 _l
}_e{425 729 483 713 524 682 _c
564 650 585 606 585 549 _c
585 504 574 468 553 442 _c
532 416 502 399 462 393 _c
510 382 548 360 575 327 _c
601 294 615 253 615 204 _c
615 138 592 88 548 53 _c
504 17 441 0 360 0 _c
98 0 _l
98 729 _l
_cl}_e}_d
/C{{698 0 56 -13 644 742 _sc
644 673 _m
644 569 _l
610 599 575 622 537 638 _c
499 653 460 661 418 661 _c
334 661 270 635 226 584 _c
182 533 160 460 160 364 _c
160 268 182 194 226 143 _c
270 92 334 67 418 67 _c
460 67 499 74 537 90 _c
575 105 610 128 644 159 _c
644 56 _l
609 32 572 15 534 4 _c
496 -7 455 -13 412 -13 _c
302 -13 215 20 151 87 _c
}_e{87 154 56 246 56 364 _c
56 481 87 573 151 641 _c
215 708 302 742 412 742 _c
456 742 497 736 535 725 _c
573 713 610 696 644 673 _c
_cl}_e}_d
/E{632 0 98 0 568 729 _sc
98 729 _m
559 729 _l
559 646 _l
197 646 _l
197 430 _l
544 430 _l
544 347 _l
197 347 _l
197 83 _l
568 83 _l
568 0 _l
98 0 _l
98 729 _l
_cl}_d
/H{752 0 98 0 654 729 _sc
98 729 _m
197 729 _l
197 430 _l
555 430 _l
555 729 _l
654 729 _l
654 0 _l
555 0 _l
555 347 _l
197 347 _l
197 0 _l
98 0 _l
98 729 _l
_cl}_d
/I{295 0 98 0 197 729 _sc
98 729 _m
197 729 _l
197 0 _l
98 0 _l
98 729 _l
_cl}_d
/K{656 0 98 0 677 729 _sc
98 729 _m
197 729 _l
197 421 _l
524 729 _l
651 729 _l
289 389 _l
677 0 _l
547 0 _l
197 351 _l
197 0 _l
98 0 _l
98 729 _l
_cl}_d
/L{557 0 98 0 552 729 _sc
98 729 _m
197 729 _l
197 83 _l
552 83 _l
552 0 _l
98 0 _l
98 729 _l
_cl}_d
/N{748 0 98 0 650 729 _sc
98 729 _m
231 729 _l
554 119 _l
554 729 _l
650 729 _l
650 0 _l
517 0 _l
194 610 _l
194 0 _l
98 0 _l
98 729 _l
_cl}_d
/P{603 0 98 0 569 729 _sc
197 648 _m
197 374 _l
321 374 _l
367 374 402 385 427 409 _c
452 433 465 467 465 511 _c
465 555 452 588 427 612 _c
402 636 367 648 321 648 _c
197 648 _l
98 729 _m
321 729 _l
402 729 464 710 506 673 _c
548 636 569 582 569 511 _c
569 439 548 384 506 348 _c
464 311 402 293 321 293 _c
197 293 _l
197 0 _l
98 0 _l
98 729 _l
_cl}_d
/T{611 0 -2 0 614 729 _sc
-2 729 _m
614 729 _l
614 646 _l
355 646 _l
355 0 _l
256 0 _l
256 646 _l
-2 646 _l
-2 729 _l
_cl}_d
/W{989 0 33 0 956 729 _sc
33 729 _m
133 729 _l
286 113 _l
439 729 _l
550 729 _l
703 113 _l
856 729 _l
956 729 _l
773 0 _l
649 0 _l
495 633 _l
340 0 _l
216 0 _l
33 729 _l
_cl}_d
/a{{613 0 60 -13 522 560 _sc
343 275 _m
270 275 220 266 192 250 _c
164 233 150 205 150 165 _c
150 133 160 107 181 89 _c
202 70 231 61 267 61 _c
317 61 357 78 387 114 _c
417 149 432 196 432 255 _c
432 275 _l
343 275 _l
522 312 _m
522 0 _l
432 0 _l
432 83 _l
411 49 385 25 355 10 _c
325 -5 287 -13 243 -13 _c
187 -13 142 2 109 33 _c
76 64 60 106 60 159 _c
}_e{60 220 80 266 122 298 _c
163 329 224 345 306 345 _c
432 345 _l
432 354 _l
432 395 418 427 391 450 _c
364 472 326 484 277 484 _c
245 484 215 480 185 472 _c
155 464 127 453 100 439 _c
100 522 _l
132 534 164 544 195 550 _c
226 556 256 560 286 560 _c
365 560 424 539 463 498 _c
502 457 522 395 522 312 _c
_cl}_e}_d
/c{{550 0 55 -13 488 560 _sc
488 526 _m
488 442 _l
462 456 437 466 411 473 _c
385 480 360 484 334 484 _c
276 484 230 465 198 428 _c
166 391 150 339 150 273 _c
150 206 166 154 198 117 _c
230 80 276 62 334 62 _c
360 62 385 65 411 72 _c
437 79 462 90 488 104 _c
488 21 _l
462 9 436 0 410 -5 _c
383 -10 354 -13 324 -13 _c
242 -13 176 12 128 64 _c
}_e{79 115 55 185 55 273 _c
55 362 79 432 128 483 _c
177 534 244 560 330 560 _c
358 560 385 557 411 551 _c
437 545 463 537 488 526 _c
_cl}_e}_d
/d{{635 0 55 -13 544 760 _sc
454 464 _m
454 760 _l
544 760 _l
544 0 _l
454 0 _l
454 82 _l
435 49 411 25 382 10 _c
353 -5 319 -13 279 -13 _c
213 -13 159 13 117 65 _c
75 117 55 187 55 273 _c
55 359 75 428 117 481 _c
159 533 213 560 279 560 _c
319 560 353 552 382 536 _c
411 520 435 496 454 464 _c
148 273 _m
148 207 161 155 188 117 _c
215 79 253 61 301 61 _c
}_e{348 61 385 79 413 117 _c
440 155 454 207 454 273 _c
454 339 440 390 413 428 _c
385 466 348 485 301 485 _c
253 485 215 466 188 428 _c
161 390 148 339 148 273 _c
_cl}_e}_d
/e{{615 0 55 -13 562 560 _sc
562 296 _m
562 252 _l
149 252 _l
153 190 171 142 205 110 _c
238 78 284 62 344 62 _c
378 62 412 66 444 74 _c
476 82 509 95 541 113 _c
541 28 _l
509 14 476 3 442 -3 _c
408 -9 373 -13 339 -13 _c
251 -13 182 12 131 62 _c
80 112 55 181 55 268 _c
55 357 79 428 127 481 _c
175 533 241 560 323 560 _c
397 560 455 536 498 489 _c
}_e{540 441 562 377 562 296 _c
472 322 _m
471 371 457 410 431 440 _c
404 469 368 484 324 484 _c
274 484 234 469 204 441 _c
174 413 156 373 152 322 _c
472 322 _l
_cl}_e}_d
/g{{635 0 55 -207 544 560 _sc
454 280 _m
454 344 440 395 414 431 _c
387 467 349 485 301 485 _c
253 485 215 467 188 431 _c
161 395 148 344 148 280 _c
148 215 161 165 188 129 _c
215 93 253 75 301 75 _c
349 75 387 93 414 129 _c
440 165 454 215 454 280 _c
544 68 _m
544 -24 523 -93 482 -139 _c
440 -184 377 -207 292 -207 _c
260 -207 231 -204 203 -200 _c
175 -195 147 -188 121 -178 _c
}_e{121 -91 _l
147 -105 173 -115 199 -122 _c
225 -129 251 -133 278 -133 _c
336 -133 380 -117 410 -87 _c
439 -56 454 -10 454 52 _c
454 96 _l
435 64 411 40 382 24 _c
353 8 319 0 279 0 _c
211 0 157 25 116 76 _c
75 127 55 195 55 280 _c
55 364 75 432 116 483 _c
157 534 211 560 279 560 _c
319 560 353 552 382 536 _c
411 520 435 496 454 464 _c
454 547 _l
544 547 _l
}_e{544 68 _l
_cl}_e}_d
/h{634 0 91 0 549 760 _sc
549 330 _m
549 0 _l
459 0 _l
459 327 _l
459 379 448 417 428 443 _c
408 469 378 482 338 482 _c
289 482 251 466 223 435 _c
195 404 181 362 181 309 _c
181 0 _l
91 0 _l
91 760 _l
181 760 _l
181 462 _l
202 494 227 519 257 535 _c
286 551 320 560 358 560 _c
420 560 468 540 500 501 _c
532 462 549 405 549 330 _c
_cl}_d
/i{278 0 94 0 184 760 _sc
94 547 _m
184 547 _l
184 0 _l
94 0 _l
94 547 _l
94 760 _m
184 760 _l
184 646 _l
94 646 _l
94 760 _l
_cl}_d
/l{278 0 94 0 184 760 _sc
94 760 _m
184 760 _l
184 0 _l
94 0 _l
94 760 _l
_cl}_d
/m{{974 0 91 0 889 560 _sc
520 442 _m
542 482 569 511 600 531 _c
631 550 668 560 711 560 _c
767 560 811 540 842 500 _c
873 460 889 403 889 330 _c
889 0 _l
799 0 _l
799 327 _l
799 379 789 418 771 444 _c
752 469 724 482 686 482 _c
639 482 602 466 575 435 _c
548 404 535 362 535 309 _c
535 0 _l
445 0 _l
445 327 _l
445 379 435 418 417 444 _c
398 469 369 482 331 482 _c
}_e{285 482 248 466 221 435 _c
194 404 181 362 181 309 _c
181 0 _l
91 0 _l
91 547 _l
181 547 _l
181 462 _l
201 495 226 520 255 536 _c
283 552 317 560 357 560 _c
397 560 430 550 458 530 _c
486 510 506 480 520 442 _c
_cl}_e}_d
/n{634 0 91 0 549 560 _sc
549 330 _m
549 0 _l
459 0 _l
459 327 _l
459 379 448 417 428 443 _c
408 469 378 482 338 482 _c
289 482 251 466 223 435 _c
195 404 181 362 181 309 _c
181 0 _l
91 0 _l
91 547 _l
181 547 _l
181 462 _l
202 494 227 519 257 535 _c
286 551 320 560 358 560 _c
420 560 468 540 500 501 _c
532 462 549 405 549 330 _c
_cl}_d
/o{612 0 55 -13 557 560 _sc
306 484 _m
258 484 220 465 192 427 _c
164 389 150 338 150 273 _c
150 207 163 156 191 118 _c
219 80 257 62 306 62 _c
354 62 392 80 420 118 _c
448 156 462 207 462 273 _c
462 337 448 389 420 427 _c
392 465 354 484 306 484 _c
306 560 _m
384 560 445 534 490 484 _c
534 433 557 363 557 273 _c
557 183 534 113 490 63 _c
445 12 384 -13 306 -13 _c
227 -13 165 12 121 63 _c
77 113 55 183 55 273 _c
55 363 77 433 121 484 _c
165 534 227 560 306 560 _c
_cl}_d
/p{{635 0 91 -207 580 560 _sc
181 82 _m
181 -207 _l
91 -207 _l
91 547 _l
181 547 _l
181 464 _l
199 496 223 520 252 536 _c
281 552 316 560 356 560 _c
422 560 476 533 518 481 _c
559 428 580 359 580 273 _c
580 187 559 117 518 65 _c
476 13 422 -13 356 -13 _c
316 -13 281 -5 252 10 _c
223 25 199 49 181 82 _c
487 273 _m
487 339 473 390 446 428 _c
418 466 381 485 334 485 _c
}_e{286 485 249 466 222 428 _c
194 390 181 339 181 273 _c
181 207 194 155 222 117 _c
249 79 286 61 334 61 _c
381 61 418 79 446 117 _c
473 155 487 207 487 273 _c
_cl}_e}_d
/r{411 0 91 0 411 560 _sc
411 463 _m
401 469 390 473 378 476 _c
366 478 353 480 339 480 _c
288 480 249 463 222 430 _c
194 397 181 350 181 288 _c
181 0 _l
91 0 _l
91 547 _l
181 547 _l
181 462 _l
199 495 224 520 254 536 _c
284 552 321 560 365 560 _c
371 560 378 559 386 559 _c
393 558 401 557 411 555 _c
411 463 _l
_cl}_d
/s{{521 0 54 -13 472 560 _sc
443 531 _m
443 446 _l
417 458 391 468 364 475 _c
336 481 308 485 279 485 _c
234 485 200 478 178 464 _c
156 450 145 430 145 403 _c
145 382 153 366 169 354 _c
185 342 217 330 265 320 _c
296 313 _l
360 299 405 279 432 255 _c
458 230 472 195 472 151 _c
472 100 452 60 412 31 _c
372 1 316 -13 246 -13 _c
216 -13 186 -10 154 -5 _c
}_e{122 0 89 8 54 20 _c
54 113 _l
87 95 120 82 152 74 _c
184 65 216 61 248 61 _c
290 61 323 68 346 82 _c
368 96 380 117 380 144 _c
380 168 371 187 355 200 _c
339 213 303 226 247 238 _c
216 245 _l
160 257 119 275 95 299 _c
70 323 58 356 58 399 _c
58 450 76 490 112 518 _c
148 546 200 560 268 560 _c
301 560 332 557 362 552 _c
391 547 418 540 443 531 _c
}_e{_cl}_e}_d
/t{392 0 27 0 368 702 _sc
183 702 _m
183 547 _l
368 547 _l
368 477 _l
183 477 _l
183 180 _l
183 135 189 106 201 94 _c
213 81 238 75 276 75 _c
368 75 _l
368 0 _l
276 0 _l
206 0 158 13 132 39 _c
106 65 93 112 93 180 _c
93 477 _l
27 477 _l
27 547 _l
93 547 _l
93 702 _l
183 702 _l
_cl}_d
/u{634 0 85 -13 543 560 _sc
85 216 _m
85 547 _l
175 547 _l
175 219 _l
175 167 185 129 205 103 _c
225 77 255 64 296 64 _c
344 64 383 79 411 110 _c
439 141 453 183 453 237 _c
453 547 _l
543 547 _l
543 0 _l
453 0 _l
453 84 _l
431 50 405 26 377 10 _c
348 -5 315 -13 277 -13 _c
214 -13 166 6 134 45 _c
101 83 85 140 85 216 _c
311 560 _m
311 560 _l
_cl}_d
/z{525 0 43 0 482 547 _sc
55 547 _m
482 547 _l
482 465 _l
144 72 _l
482 72 _l
482 0 _l
43 0 _l
43 82 _l
381 475 _l
55 475 _l
55 547 _l
_cl}_d
end readonly def

/BuildGlyph
 {exch begin
 CharStrings exch
 2 copy known not{pop /.notdef}if
 true 3 1 roll get exec
 end}_d

/BuildChar {
 1 index /Encoding get exch get
 1 index /BuildGlyph get exec
}_d

FontName currentdict end definefont pop
end
%%EndProlog
mpldict begin
54 180 translate
504 432 0 0 clipbox
gsave
0 0 m
504 0 l
504 432 l
0 432 l
cl
1.000 setgray
fill
grestore
gsave
67.905 58.68 m
471.47625 58.68 l
471.47625 367.528 l
67.905 367.528 l
cl
1.000 setgray
fill
grestore
1.500 setlinewidth
1 setlinejoin
2 setlinecap
[] 0 setdash
0.000 1.000 1.000 setrgbcolor
gsave
403.6 308.8 67.91 58.68 clipbox
67.905 138.285942 m
71.981477 103.902934 l
76.057955 103.675119 l
80.134432 70.420325 l
84.210909 97.004884 l
88.287386 103.373764 l
92.363864 66.060475 l
96.440341 66.456672 l
100.516818 69.010534 l
104.593295 77.411847 l
108.669773 98.617467 l
112.74625 66.700355 l
116.822727 69.776661 l
120.899205 68.675026 l
124.975682 84.157757 l
129.052159 106.203999 l
133.128636 77.365764 l
137.205114 75.069126 l
141.281591 76.654417 l
145.358068 105.561878 l
149.434545 132.766449 l
153.511023 120.763013 l
157.5875 86.676105 l
161.663977 87.28401 l
165.740455 117.240091 l
169.816932 122.580144 l
173.893409 91.69924 l
177.969886 90.661076 l
182.046364 94.394407 l
186.122841 95.716082 l
190.199318 93.826971 l
194.275795 92.002555 l
198.352273 93.811128 l
202.42875 94.607031 l
206.505227 96.253849 l
210.581705 96.437665 l
214.658182 95.934383 l
218.734659 97.389968 l
222.811136 100.813135 l
226.887614 98.238685 l
230.964091 132.573849 l
235.040568 146.546507 l
239.117045 112.779756 l
243.193523 112.865553 l
247.27 115.281279 l
251.346477 116.798995 l
255.422955 115.252925 l
259.499432 121.959254 l
263.575909 118.203193 l
267.652386 137.692134 l
271.728864 150.97821 l
275.805341 121.033355 l
279.881818 120.419262 l
283.958295 120.989829 l
288.034773 123.628822 l
292.11125 123.738641 l
296.187727 123.041113 l
300.264205 130.896008 l
304.340682 129.121621 l
308.417159 128.09687 l
312.493636 166.124609 l
316.570114 189.112637 l
320.646591 154.113787 l
324.723068 159.339481 l
328.799545 163.827446 l
332.876023 163.836343 l
336.9525 164.693357 l
341.028977 164.578371 l
345.105455 167.104691 l
349.181932 171.567984 l
353.258409 174.415966 l
357.334886 171.58664 l
361.411364 172.267134 l
365.487841 174.116747 l
369.564318 195.734612 l
373.640795 213.169736 l
377.717273 180.791372 l
381.79375 183.11935 l
385.870227 187.849479 l
389.946705 190.062991 l
394.023182 238.589942 l
398.099659 265.402848 l
402.176136 227.999952 l
406.252614 229.02658 l
410.329091 232.046664 l
414.405568 232.439993 l
418.482045 235.364034 l
422.558523 243.414423 l
426.635 248.009459 l
430.711477 250.270388 l
434.787955 251.425153 l
438.864432 256.931671 l
442.940909 254.779453 l
447.017386 258.500745 l
451.093864 258.457067 l
455.170341 260.373121 l
459.246818 266.866974 l
463.323295 266.299428 l
467.399773 268.590089 l
471.47625 367.528 l
stroke
grestore
0.000 0.000 1.000 setrgbcolor
gsave
403.6 308.8 67.91 58.68 clipbox
67.905 124.154254 m
71.981477 101.099284 l
76.057955 106.786845 l
80.134432 103.653585 l
84.210909 153.206984 l
88.287386 143.35439 l
92.363864 103.746791 l
96.440341 106.569372 l
100.516818 107.863293 l
104.593295 121.98173 l
108.669773 143.291277 l
112.74625 106.912246 l
116.822727 108.497109 l
120.899205 108.854477 l
124.975682 173.320822 l
129.052159 160.660369 l
133.128636 117.63143 l
137.205114 132.078897 l
141.281591 118.340252 l
145.358068 140.522055 l
149.434545 192.061751 l
153.511023 160.487026 l
157.5875 119.371199 l
161.663977 119.258931 l
165.740455 148.509431 l
169.816932 159.524512 l
173.893409 123.69487 l
177.969886 123.588323 l
182.046364 123.459366 l
186.122841 125.538001 l
190.199318 137.348407 l
194.275795 130.102284 l
198.352273 137.509889 l
202.42875 128.078668 l
206.505227 134.190277 l
210.581705 131.392327 l
214.658182 131.423272 l
218.734659 132.079137 l
222.811136 133.136992 l
226.887614 138.665959 l
230.964091 176.159182 l
235.040568 185.05631 l
239.117045 145.754759 l
243.193523 148.204395 l
247.27 147.870298 l
251.346477 150.889767 l
255.422955 148.721369 l
259.499432 149.969274 l
263.575909 151.764865 l
267.652386 176.921491 l
271.728864 198.601178 l
275.805341 152.103548 l
279.881818 151.241573 l
283.958295 152.253213 l
288.034773 154.118021 l
292.11125 157.225806 l
296.187727 152.496068 l
300.264205 152.337902 l
304.340682 153.373242 l
308.417159 154.253597 l
312.493636 199.722881 l
316.570114 203.427727 l
320.646591 163.669827 l
324.723068 166.48904 l
328.799545 165.977894 l
332.876023 174.301988 l
336.9525 169.008963 l
341.028977 170.140094 l
345.105455 173.736682 l
349.181932 171.559686 l
353.258409 172.206687 l
357.334886 174.176731 l
361.411364 173.924568 l
365.487841 180.736072 l
369.564318 206.063149 l
373.640795 219.342436 l
377.717273 180.124458 l
381.79375 182.909358 l
385.870227 182.642035 l
389.946705 202.83998 l
394.023182 241.821241 l
398.099659 260.066423 l
402.176136 222.308074 l
406.252614 235.010454 l
410.329091 224.137978 l
414.405568 225.5282 l
418.482045 236.622516 l
422.558523 232.577883 l
426.635 236.830447 l
430.711477 240.904559 l
434.787955 245.125876 l
438.864432 247.737341 l
442.940909 253.998194 l
447.017386 253.838729 l
451.093864 253.771561 l
455.170341 260.967694 l
459.246818 260.087947 l
463.323295 263.687029 l
467.399773 270.882774 l
471.47625 343.123271 l
stroke
grestore
1.000 setlinewidth
0 setlinejoin
[] 0 setdash
0.000 setgray
gsave
67.905 58.68 m
67.905 367.528 l
stroke
grestore
gsave
471.47625 58.68 m
471.47625 367.528 l
stroke
grestore
gsave
67.905 58.68 m
471.47625 58.68 l
stroke
grestore
gsave
67.905 367.528 m
471.47625 367.528 l
stroke
grestore
0.500 setlinewidth
1 setlinejoin
0 setlinecap
[] 0 setdash
gsave
/o {
gsave
newpath
translate
0.5 setlinewidth
1 setlinejoin
0 setlinecap
0 0 m
0 4 l

gsave
0.000 setgray
fill
grestore
stroke
grestore
} bind def
67.905 58.68 o
grestore
gsave
/o {
gsave
newpath
translate
0.5 setlinewidth
1 setlinejoin
0 setlinecap
0 0 m
0 -4 l

gsave
0.000 setgray
fill
grestore
stroke
grestore
} bind def
67.905 367.528 o
grestore
/DejaVuSans findfont
16.000 scalefont
setfont
gsave
62.811250 42.523750 translate
0.000000 rotate
0.000000 0.000000 m /zero glyphshow
grestore
gsave
/o {
gsave
newpath
translate
0.5 setlinewidth
1 setlinejoin
0 setlinecap
0 0 m
0 4 l

gsave
0.000 setgray
fill
grestore
stroke
grestore
} bind def
148.619 58.68 o
grestore
gsave
/o {
gsave
newpath
translate
0.5 setlinewidth
1 setlinejoin
0 setlinecap
0 0 m
0 -4 l

gsave
0.000 setgray
fill
grestore
stroke
grestore
} bind def
148.619 367.528 o
grestore
gsave
138.431750 42.523750 translate
0.000000 rotate
0.000000 0.000000 m /two glyphshow
10.179688 0.000000 m /zero glyphshow
grestore
gsave
/o {
gsave
newpath
translate
0.5 setlinewidth
1 setlinejoin
0 setlinecap
0 0 m
0 4 l

gsave
0.000 setgray
fill
grestore
stroke
grestore
} bind def
229.334 58.68 o
grestore
gsave
/o {
gsave
newpath
translate
0.5 setlinewidth
1 setlinejoin
0 setlinecap
0 0 m
0 -4 l

gsave
0.000 setgray
fill
grestore
stroke
grestore
} bind def
229.334 367.528 o
grestore
gsave
219.146000 42.523750 translate
0.000000 rotate
0.000000 0.000000 m /four glyphshow
10.179688 0.000000 m /zero glyphshow
grestore
gsave
/o {
gsave
newpath
translate
0.5 setlinewidth
1 setlinejoin
0 setlinecap
0 0 m
0 4 l

gsave
0.000 setgray
fill
grestore
stroke
grestore
} bind def
310.048 58.68 o
grestore
gsave
/o {
gsave
newpath
translate
0.5 setlinewidth
1 setlinejoin
0 setlinecap
0 0 m
0 -4 l

gsave
0.000 setgray
fill
grestore
stroke
grestore
} bind def
310.048 367.528 o
grestore
gsave
299.860250 42.523750 translate
0.000000 rotate
0.000000 0.000000 m /six glyphshow
10.179688 0.000000 m /zero glyphshow
grestore
gsave
/o {
gsave
newpath
translate
0.5 setlinewidth
1 setlinejoin
0 setlinecap
0 0 m
0 4 l

gsave
0.000 setgray
fill
grestore
stroke
grestore
} bind def
390.762 58.68 o
grestore
gsave
/o {
gsave
newpath
translate
0.5 setlinewidth
1 setlinejoin
0 setlinecap
0 0 m
0 -4 l

gsave
0.000 setgray
fill
grestore
stroke
grestore
} bind def
390.762 367.528 o
grestore
gsave
380.574500 42.523750 translate
0.000000 rotate
0.000000 0.000000 m /eight glyphshow
10.179688 0.000000 m /zero glyphshow
grestore
gsave
/o {
gsave
newpath
translate
0.5 setlinewidth
1 setlinejoin
0 setlinecap
0 0 m
0 4 l

gsave
0.000 setgray
fill
grestore
stroke
grestore
} bind def
471.476 58.68 o
grestore
gsave
/o {
gsave
newpath
translate
0.5 setlinewidth
1 setlinejoin
0 setlinecap
0 0 m
0 -4 l

gsave
0.000 setgray
fill
grestore
stroke
grestore
} bind def
471.476 367.528 o
grestore
gsave
456.195000 42.523750 translate
0.000000 rotate
0.000000 0.000000 m /one glyphshow
10.179688 0.000000 m /zero glyphshow
20.359375 0.000000 m /zero glyphshow
grestore
gsave
172.159375 22.039375 translate
0.000000 rotate
0.000000 0.000000 m /I glyphshow
4.718750 0.000000 m /t glyphshow
10.992188 0.000000 m /e glyphshow
20.835938 0.000000 m /r glyphshow
27.414062 0.000000 m /a glyphshow
37.218750 0.000000 m /t glyphshow
43.492188 0.000000 m /i glyphshow
47.937500 0.000000 m /o glyphshow
57.726562 0.000000 m /n glyphshow
67.867188 0.000000 m /space glyphshow
72.953125 0.000000 m /numbersign glyphshow
86.359375 0.000000 m /space glyphshow
91.445312 0.000000 m /parenleft glyphshow
97.687500 0.000000 m /N glyphshow
109.656250 0.000000 m /o glyphshow
119.445312 0.000000 m /r glyphshow
126.023438 0.000000 m /m glyphshow
141.609375 0.000000 m /a glyphshow
151.414062 0.000000 m /l glyphshow
155.859375 0.000000 m /i glyphshow
160.304688 0.000000 m /z glyphshow
168.703125 0.000000 m /e glyphshow
178.546875 0.000000 m /d glyphshow
188.703125 0.000000 m /parenright glyphshow
grestore
gsave
/o {
gsave
newpath
translate
0.5 setlinewidth
1 setlinejoin
0 setlinecap
0 0 m
4 0 l

gsave
0.000 setgray
fill
grestore
stroke
grestore
} bind def
67.905 58.68 o
grestore
gsave
/o {
gsave
newpath
translate
0.5 setlinewidth
1 setlinejoin
0 setlinecap
0 0 m
-4 0 l

gsave
0.000 setgray
fill
grestore
stroke
grestore
} bind def
471.476 58.68 o
grestore
gsave
38.436250 52.601875 translate
0.000000 rotate
0.000000 0.000000 m /zero glyphshow
10.179688 0.000000 m /period glyphshow
15.265625 0.000000 m /three glyphshow
grestore
gsave
/o {
gsave
newpath
translate
0.5 setlinewidth
1 setlinejoin
0 setlinecap
0 0 m
4 0 l

gsave
0.000 setgray
fill
grestore
stroke
grestore
} bind def
67.905 102.801 o
grestore
gsave
/o {
gsave
newpath
translate
0.5 setlinewidth
1 setlinejoin
0 setlinecap
0 0 m
-4 0 l

gsave
0.000 setgray
fill
grestore
stroke
grestore
} bind def
471.476 102.801 o
grestore
gsave
38.436250 96.723018 translate
0.000000 rotate
0.000000 0.000000 m /zero glyphshow
10.179688 0.000000 m /period glyphshow
15.265625 0.000000 m /four glyphshow
grestore
gsave
/o {
gsave
newpath
translate
0.5 setlinewidth
1 setlinejoin
0 setlinecap
0 0 m
4 0 l

gsave
0.000 setgray
fill
grestore
stroke
grestore
} bind def
67.905 146.922 o
grestore
gsave
/o {
gsave
newpath
translate
0.5 setlinewidth
1 setlinejoin
0 setlinecap
0 0 m
-4 0 l

gsave
0.000 setgray
fill
grestore
stroke
grestore
} bind def
471.476 146.922 o
grestore
gsave
38.436250 140.844161 translate
0.000000 rotate
0.000000 0.000000 m /zero glyphshow
10.179688 0.000000 m /period glyphshow
15.265625 0.000000 m /five glyphshow
grestore
gsave
/o {
gsave
newpath
translate
0.5 setlinewidth
1 setlinejoin
0 setlinecap
0 0 m
4 0 l

gsave
0.000 setgray
fill
grestore
stroke
grestore
} bind def
67.905 191.043 o
grestore
gsave
/o {
gsave
newpath
translate
0.5 setlinewidth
1 setlinejoin
0 setlinecap
0 0 m
-4 0 l

gsave
0.000 setgray
fill
grestore
stroke
grestore
} bind def
471.476 191.043 o
grestore
gsave
38.436250 184.965304 translate
0.000000 rotate
0.000000 0.000000 m /zero glyphshow
10.179688 0.000000 m /period glyphshow
15.265625 0.000000 m /six glyphshow
grestore
gsave
/o {
gsave
newpath
translate
0.5 setlinewidth
1 setlinejoin
0 setlinecap
0 0 m
4 0 l

gsave
0.000 setgray
fill
grestore
stroke
grestore
} bind def
67.905 235.165 o
grestore
gsave
/o {
gsave
newpath
translate
0.5 setlinewidth
1 setlinejoin
0 setlinecap
0 0 m
-4 0 l

gsave
0.000 setgray
fill
grestore
stroke
grestore
} bind def
471.476 235.165 o
grestore
gsave
38.436250 229.086446 translate
0.000000 rotate
0.000000 0.000000 m /zero glyphshow
10.179688 0.000000 m /period glyphshow
15.265625 0.000000 m /seven glyphshow
grestore
gsave
/o {
gsave
newpath
translate
0.5 setlinewidth
1 setlinejoin
0 setlinecap
0 0 m
4 0 l

gsave
0.000 setgray
fill
grestore
stroke
grestore
} bind def
67.905 279.286 o
grestore
gsave
/o {
gsave
newpath
translate
0.5 setlinewidth
1 setlinejoin
0 setlinecap
0 0 m
-4 0 l

gsave
0.000 setgray
fill
grestore
stroke
grestore
} bind def
471.476 279.286 o
grestore
gsave
38.436250 273.207589 translate
0.000000 rotate
0.000000 0.000000 m /zero glyphshow
10.179688 0.000000 m /period glyphshow
15.265625 0.000000 m /eight glyphshow
grestore
gsave
/o {
gsave
newpath
translate
0.5 setlinewidth
1 setlinejoin
0 setlinecap
0 0 m
4 0 l

gsave
0.000 setgray
fill
grestore
stroke
grestore
} bind def
67.905 323.407 o
grestore
gsave
/o {
gsave
newpath
translate
0.5 setlinewidth
1 setlinejoin
0 setlinecap
0 0 m
-4 0 l

gsave
0.000 setgray
fill
grestore
stroke
grestore
} bind def
471.476 323.407 o
grestore
gsave
38.436250 317.328732 translate
0.000000 rotate
0.000000 0.000000 m /zero glyphshow
10.179688 0.000000 m /period glyphshow
15.265625 0.000000 m /nine glyphshow
grestore
gsave
/o {
gsave
newpath
translate
0.5 setlinewidth
1 setlinejoin
0 setlinecap
0 0 m
4 0 l

gsave
0.000 setgray
fill
grestore
stroke
grestore
} bind def
67.905 367.528 o
grestore
gsave
/o {
gsave
newpath
translate
0.5 setlinewidth
1 setlinejoin
0 setlinecap
0 0 m
-4 0 l

gsave
0.000 setgray
fill
grestore
stroke
grestore
} bind def
471.476 367.528 o
grestore
gsave
38.436250 361.449875 translate
0.000000 rotate
0.000000 0.000000 m /one glyphshow
10.179688 0.000000 m /period glyphshow
15.265625 0.000000 m /zero glyphshow
grestore
gsave
30.108125 111.205563 translate
90.000000 rotate
0.000000 0.000000 m /N glyphshow
11.968750 0.000000 m /o glyphshow
21.757812 0.000000 m /r glyphshow
28.335938 0.000000 m /m glyphshow
43.921875 0.000000 m /a glyphshow
53.726562 0.000000 m /l glyphshow
58.171875 0.000000 m /i glyphshow
62.617188 0.000000 m /z glyphshow
71.015625 0.000000 m /e glyphshow
80.859375 0.000000 m /d glyphshow
91.015625 0.000000 m /space glyphshow
96.101562 0.000000 m /E glyphshow
106.210938 0.000000 m /l glyphshow
110.656250 0.000000 m /a glyphshow
120.460938 0.000000 m /p glyphshow
130.617188 0.000000 m /s glyphshow
138.953125 0.000000 m /e glyphshow
148.796875 0.000000 m /d glyphshow
158.953125 0.000000 m /space glyphshow
164.039062 0.000000 m /T glyphshow
173.812500 0.000000 m /i glyphshow
178.257812 0.000000 m /m glyphshow
193.843750 0.000000 m /e glyphshow
grestore
/DejaVuSans findfont
19.200 scalefont
setfont
gsave
83.956250 399.983085 translate
0.000000 rotate
0.000000 0.000000 m /H glyphshow
14.475098 0.000000 m /A glyphshow
27.643677 0.000000 m /C glyphshow
41.084839 0.000000 m /C glyphshow
54.526001 0.000000 m /space glyphshow
60.645020 0.000000 m /C glyphshow
74.086182 0.000000 m /r glyphshow
82.000488 0.000000 m /i glyphshow
87.348755 0.000000 m /t glyphshow
94.896484 0.000000 m /i glyphshow
100.244751 0.000000 m /c glyphshow
110.828491 0.000000 m /a glyphshow
122.624756 0.000000 m /l glyphshow
127.973022 0.000000 m /space glyphshow
134.092041 0.000000 m /P glyphshow
145.700317 0.000000 m /a glyphshow
157.496582 0.000000 m /t glyphshow
165.044312 0.000000 m /h glyphshow
177.244751 0.000000 m /space glyphshow
183.363770 0.000000 m /I glyphshow
189.041016 0.000000 m /t glyphshow
196.588745 0.000000 m /e glyphshow
208.432007 0.000000 m /r glyphshow
216.346313 0.000000 m /a glyphshow
228.142578 0.000000 m /t glyphshow
235.690308 0.000000 m /i glyphshow
241.038574 0.000000 m /o glyphshow
252.816040 0.000000 m /n glyphshow
265.016479 0.000000 m /space glyphshow
271.135498 0.000000 m /L glyphshow
281.860229 0.000000 m /o glyphshow
293.637695 0.000000 m /o glyphshow
305.415161 0.000000 m /p glyphshow
317.634399 0.000000 m /space glyphshow
323.753418 0.000000 m /T glyphshow
335.512085 0.000000 m /i glyphshow
340.860352 0.000000 m /m glyphshow
359.612183 0.000000 m /e glyphshow
grestore
gsave
138.948438 378.704960 translate
0.000000 rotate
0.000000 0.000000 m /at glyphshow
19.250000 0.000000 m /space glyphshow
25.369019 0.000000 m /one glyphshow
37.616455 0.000000 m /three glyphshow
49.863892 0.000000 m /five glyphshow
62.111328 0.000000 m /space glyphshow
68.230347 0.000000 m /W glyphshow
87.264160 0.000000 m /space glyphshow
93.383179 0.000000 m /hyphen glyphshow
100.329346 0.000000 m /space glyphshow
106.448364 0.000000 m /K glyphshow
119.071777 0.000000 m /n glyphshow
131.272217 0.000000 m /i glyphshow
136.620483 0.000000 m /g glyphshow
148.839722 0.000000 m /h glyphshow
161.040161 0.000000 m /t glyphshow
168.587891 0.000000 m /s glyphshow
178.617065 0.000000 m /space glyphshow
184.736084 0.000000 m /L glyphshow
195.460815 0.000000 m /a glyphshow
207.257080 0.000000 m /n glyphshow
219.457520 0.000000 m /d glyphshow
231.676758 0.000000 m /i glyphshow
237.025024 0.000000 m /n glyphshow
249.225464 0.000000 m /g glyphshow
grestore
1.000 setlinewidth
0 setlinejoin
[] 0 setdash
0.300 setgray
gsave
79.705 318.13425 m
233.41125 318.13425 l
235.277917 318.13425 236.21125 319.067583 236.21125 320.93425 c
236.21125 355.728 l
236.21125 357.594667 235.277917 358.528 233.41125 358.528 c
79.705 358.528 l
77.838333 358.528 76.905 357.594667 76.905 355.728 c
76.905 320.93425 l
76.905 319.067583 77.838333 318.13425 79.705 318.13425 c
cl
gsave
fill
grestore
stroke
grestore
0.000 setgray
gsave
77.705 320.13425 m
231.41125 320.13425 l
233.277917 320.13425 234.21125 321.067583 234.21125 322.93425 c
234.21125 357.728 l
234.21125 359.594667 233.277917 360.528 231.41125 360.528 c
77.705 360.528 l
75.838333 360.528 74.905 359.594667 74.905 357.728 c
74.905 322.93425 l
74.905 321.067583 75.838333 320.13425 77.705 320.13425 c
cl
gsave
1.000 setgray
fill
grestore
stroke
grestore
1.500 setlinewidth
1 setlinejoin
2 setlinecap
[] 0 setdash
0.000 1.000 1.000 setrgbcolor
gsave
84.705 349.187375 m
104.305 349.187375 l
stroke
grestore
0.000 setgray
/DejaVuSans findfont
14.000 scalefont
setfont
gsave
119.705000 344.287375 translate
0.000000 rotate
0.000000 0.000000 m /B glyphshow
9.604492 0.000000 m /a glyphshow
18.183594 0.000000 m /l glyphshow
22.073242 0.000000 m /a glyphshow
30.652344 0.000000 m /n glyphshow
39.525391 0.000000 m /c glyphshow
47.222656 0.000000 m /e glyphshow
55.835938 0.000000 m /r glyphshow
61.591797 0.000000 m /space glyphshow
66.041992 0.000000 m /P glyphshow
74.484375 0.000000 m /l glyphshow
78.374023 0.000000 m /u glyphshow
87.247070 0.000000 m /g glyphshow
96.133789 0.000000 m /i glyphshow
100.023438 0.000000 m /n glyphshow
grestore
0.000 0.000 1.000 setrgbcolor
gsave
84.705 333.5405 m
104.305 333.5405 l
stroke
grestore
0.000 setgray
gsave
119.705000 328.640500 translate
0.000000 rotate
0.000000 0.000000 m /B glyphshow
9.604492 0.000000 m /a glyphshow
18.183594 0.000000 m /s glyphshow
25.477539 0.000000 m /e glyphshow
34.090820 0.000000 m /l glyphshow
37.980469 0.000000 m /i glyphshow
41.870117 0.000000 m /n glyphshow
50.743164 0.000000 m /e glyphshow
grestore

end
showpage
