%!PS-Adobe-3.0 EPSF-3.0
%%Title: figures/hacc-12-node-new-governor/hacc_135_balanced_epoch_iteration_frequency_socket_0.eps
%%Creator: matplotlib version 2.0.0, http://matplotlib.org/
%%CreationDate: Tue Mar 21 14:16:34 2017
%%Orientation: portrait
%%BoundingBox: 54 180 558 612
%%EndComments
%%BeginProlog
/mpldict 8 dict def
mpldict begin
/m { moveto } bind def
/l { lineto } bind def
/r { rlineto } bind def
/c { curveto } bind def
/cl { closepath } bind def
/box {
m
1 index 0 r
0 exch r
neg 0 r
cl
} bind def
/clipbox {
box
clip
newpath
} bind def
%!PS-Adobe-3.0 Resource-Font
%%Title: DejaVu Sans
%%Copyright: Copyright (c) 2003 by Bitstream, Inc. All Rights Reserved. Copyright (c) 2006 by Tavmjong Bah. All Rights Reserved. DejaVu changes are in public domain 
%%Creator: Converted from TrueType to type 3 by PPR
25 dict begin
/_d{bind def}bind def
/_m{moveto}_d
/_l{lineto}_d
/_cl{closepath eofill}_d
/_c{curveto}_d
/_sc{7 -1 roll{setcachedevice}{pop pop pop pop pop pop}ifelse}_d
/_e{exec}_d
/FontName /DejaVuSans def
/PaintType 0 def
/FontMatrix[.001 0 0 .001 0 0]def
/FontBBox[-1021 -463 1793 1232]def
/FontType 3 def
/Encoding [ /space /numbersign /parenleft /parenright /hyphen /period /zero /one /two /three /four /five /six /seven /eight /nine /at /A /C /F /H /I /K /L /M /N /W /a /c /d /e /g /h /i /l /m /n /o /p /q /r /s /t /u /y /z ] def
/FontInfo 10 dict dup begin
/FamilyName (DejaVu Sans) def
/FullName (DejaVu Sans) def
/Notice (Copyright (c) 2003 by Bitstream, Inc. All Rights Reserved. Copyright (c) 2006 by Tavmjong Bah. All Rights Reserved. DejaVu changes are in public domain ) def
/Weight (Book) def
/Version (Version 2.35) def
/ItalicAngle 0.0 def
/isFixedPitch false def
/UnderlinePosition -130 def
/UnderlineThickness 90 def
end readonly def
/CharStrings 46 dict dup begin
/space{318 0 0 0 0 0 _sc
}_d
/numbersign{{838 0 77 0 761 718 _sc
511 440 _m
369 440 _l
328 277 _l
471 277 _l
511 440 _l
438 718 _m
387 515 _l
530 515 _l
581 718 _l
659 718 _l
609 515 _l
761 515 _l
761 440 _l
590 440 _l
550 277 _l
705 277 _l
705 202 _l
531 202 _l
480 0 _l
402 0 _l
452 202 _l
309 202 _l
259 0 _l
180 0 _l
231 202 _l
77 202 _l
77 277 _l
249 277 _l
290 440 _l
133 440 _l
}_e{133 515 _l
309 515 _l
359 718 _l
438 718 _l
_cl}_e}_d
/parenleft{390 0 86 -131 310 759 _sc
310 759 _m
266 683 234 609 213 536 _c
191 463 181 389 181 314 _c
181 238 191 164 213 91 _c
234 17 266 -56 310 -131 _c
232 -131 _l
183 -54 146 20 122 94 _c
98 168 86 241 86 314 _c
86 386 98 459 122 533 _c
146 607 182 682 232 759 _c
310 759 _l
_cl}_d
/parenright{390 0 80 -131 304 759 _sc
80 759 _m
158 759 _l
206 682 243 607 267 533 _c
291 459 304 386 304 314 _c
304 241 291 168 267 94 _c
243 20 206 -54 158 -131 _c
80 -131 _l
123 -56 155 17 177 91 _c
198 164 209 238 209 314 _c
209 389 198 463 177 536 _c
155 609 123 683 80 759 _c
_cl}_d
/hyphen{361 0 49 234 312 314 _sc
49 314 _m
312 314 _l
312 234 _l
49 234 _l
49 314 _l
_cl}_d
/period{318 0 107 0 210 124 _sc
107 124 _m
210 124 _l
210 0 _l
107 0 _l
107 124 _l
_cl}_d
/zero{636 0 66 -13 570 742 _sc
318 664 _m
267 664 229 639 203 589 _c
177 539 165 464 165 364 _c
165 264 177 189 203 139 _c
229 89 267 64 318 64 _c
369 64 407 89 433 139 _c
458 189 471 264 471 364 _c
471 464 458 539 433 589 _c
407 639 369 664 318 664 _c
318 742 _m
399 742 461 709 505 645 _c
548 580 570 486 570 364 _c
570 241 548 147 505 83 _c
461 19 399 -13 318 -13 _c
236 -13 173 19 130 83 _c
87 147 66 241 66 364 _c
66 486 87 580 130 645 _c
173 709 236 742 318 742 _c
_cl}_d
/one{636 0 110 0 544 729 _sc
124 83 _m
285 83 _l
285 639 _l
110 604 _l
110 694 _l
284 729 _l
383 729 _l
383 83 _l
544 83 _l
544 0 _l
124 0 _l
124 83 _l
_cl}_d
/two{{636 0 73 0 536 742 _sc
192 83 _m
536 83 _l
536 0 _l
73 0 _l
73 83 _l
110 121 161 173 226 239 _c
290 304 331 346 348 365 _c
380 400 402 430 414 455 _c
426 479 433 504 433 528 _c
433 566 419 598 392 622 _c
365 646 330 659 286 659 _c
255 659 222 653 188 643 _c
154 632 117 616 78 594 _c
78 694 _l
118 710 155 722 189 730 _c
223 738 255 742 284 742 _c
}_e{359 742 419 723 464 685 _c
509 647 532 597 532 534 _c
532 504 526 475 515 449 _c
504 422 484 390 454 354 _c
446 344 420 317 376 272 _c
332 227 271 164 192 83 _c
_cl}_e}_d
/three{{636 0 76 -13 556 742 _sc
406 393 _m
453 383 490 362 516 330 _c
542 298 556 258 556 212 _c
556 140 531 84 482 45 _c
432 6 362 -13 271 -13 _c
240 -13 208 -10 176 -4 _c
144 1 110 10 76 22 _c
76 117 _l
103 101 133 89 166 81 _c
198 73 232 69 268 69 _c
330 69 377 81 409 105 _c
441 129 458 165 458 212 _c
458 254 443 288 413 312 _c
383 336 341 349 287 349 _c
}_e{202 349 _l
202 430 _l
291 430 _l
339 430 376 439 402 459 _c
428 478 441 506 441 543 _c
441 580 427 609 401 629 _c
374 649 336 659 287 659 _c
260 659 231 656 200 650 _c
169 644 135 635 98 623 _c
98 711 _l
135 721 170 729 203 734 _c
235 739 266 742 296 742 _c
370 742 429 725 473 691 _c
517 657 539 611 539 553 _c
539 513 527 479 504 451 _c
481 423 448 403 406 393 _c
_cl}_e}_d
/four{636 0 49 0 580 729 _sc
378 643 _m
129 254 _l
378 254 _l
378 643 _l
352 729 _m
476 729 _l
476 254 _l
580 254 _l
580 172 _l
476 172 _l
476 0 _l
378 0 _l
378 172 _l
49 172 _l
49 267 _l
352 729 _l
_cl}_d
/five{{636 0 77 -13 549 729 _sc
108 729 _m
495 729 _l
495 646 _l
198 646 _l
198 467 _l
212 472 227 476 241 478 _c
255 480 270 482 284 482 _c
365 482 429 459 477 415 _c
525 370 549 310 549 234 _c
549 155 524 94 475 51 _c
426 8 357 -13 269 -13 _c
238 -13 207 -10 175 -6 _c
143 -1 111 6 77 17 _c
77 116 _l
106 100 136 88 168 80 _c
199 72 232 69 267 69 _c
}_e{323 69 368 83 401 113 _c
433 143 450 183 450 234 _c
450 284 433 324 401 354 _c
368 384 323 399 267 399 _c
241 399 214 396 188 390 _c
162 384 135 375 108 363 _c
108 729 _l
_cl}_e}_d
/six{{636 0 70 -13 573 742 _sc
330 404 _m
286 404 251 388 225 358 _c
199 328 186 286 186 234 _c
186 181 199 139 225 109 _c
251 79 286 64 330 64 _c
374 64 409 79 435 109 _c
461 139 474 181 474 234 _c
474 286 461 328 435 358 _c
409 388 374 404 330 404 _c
526 713 _m
526 623 _l
501 635 476 644 451 650 _c
425 656 400 659 376 659 _c
310 659 260 637 226 593 _c
}_e{192 549 172 482 168 394 _c
187 422 211 444 240 459 _c
269 474 301 482 336 482 _c
409 482 467 459 509 415 _c
551 371 573 310 573 234 _c
573 159 550 99 506 54 _c
462 9 403 -13 330 -13 _c
246 -13 181 19 137 83 _c
92 147 70 241 70 364 _c
70 479 97 571 152 639 _c
206 707 280 742 372 742 _c
396 742 421 739 447 735 _c
472 730 498 723 526 713 _c
_cl}_e}_d
/seven{636 0 82 0 551 729 _sc
82 729 _m
551 729 _l
551 687 _l
286 0 _l
183 0 _l
432 646 _l
82 646 _l
82 729 _l
_cl}_d
/eight{{636 0 68 -13 568 742 _sc
318 346 _m
271 346 234 333 207 308 _c
180 283 167 249 167 205 _c
167 161 180 126 207 101 _c
234 76 271 64 318 64 _c
364 64 401 76 428 102 _c
455 127 469 161 469 205 _c
469 249 455 283 429 308 _c
402 333 365 346 318 346 _c
219 388 _m
177 398 144 418 120 447 _c
96 476 85 511 85 553 _c
85 611 105 657 147 691 _c
188 725 245 742 318 742 _c
}_e{390 742 447 725 489 691 _c
530 657 551 611 551 553 _c
551 511 539 476 515 447 _c
491 418 459 398 417 388 _c
464 377 501 355 528 323 _c
554 291 568 251 568 205 _c
568 134 546 80 503 43 _c
459 5 398 -13 318 -13 _c
237 -13 175 5 132 43 _c
89 80 68 134 68 205 _c
68 251 81 291 108 323 _c
134 355 171 377 219 388 _c
183 544 _m
183 506 194 476 218 455 _c
}_e{242 434 275 424 318 424 _c
360 424 393 434 417 455 _c
441 476 453 506 453 544 _c
453 582 441 611 417 632 _c
393 653 360 664 318 664 _c
275 664 242 653 218 632 _c
194 611 183 582 183 544 _c
_cl}_e}_d
/nine{{636 0 63 -13 566 742 _sc
110 15 _m
110 105 _l
134 93 159 84 185 78 _c
210 72 235 69 260 69 _c
324 69 374 90 408 134 _c
442 178 462 244 468 334 _c
448 306 424 284 396 269 _c
367 254 335 247 300 247 _c
226 247 168 269 126 313 _c
84 357 63 417 63 494 _c
63 568 85 628 129 674 _c
173 719 232 742 306 742 _c
390 742 455 709 499 645 _c
543 580 566 486 566 364 _c
}_e{566 248 538 157 484 89 _c
429 21 356 -13 264 -13 _c
239 -13 214 -10 189 -6 _c
163 -2 137 5 110 15 _c
306 324 _m
350 324 385 339 411 369 _c
437 399 450 441 450 494 _c
450 546 437 588 411 618 _c
385 648 350 664 306 664 _c
262 664 227 648 201 618 _c
175 588 162 546 162 494 _c
162 441 175 399 201 369 _c
227 339 262 324 306 324 _c
_cl}_e}_d
/at{{1000 0 66 -173 930 704 _sc
372 262 _m
372 215 383 178 406 152 _c
429 126 461 113 502 113 _c
542 113 573 126 596 153 _c
619 179 631 216 631 262 _c
631 308 619 344 596 371 _c
572 397 541 411 501 411 _c
461 411 430 397 407 371 _c
383 344 372 308 372 262 _c
638 116 _m
618 91 596 73 571 61 _c
545 49 516 43 483 43 _c
427 43 381 63 346 104 _c
311 144 294 197 294 262 _c
}_e{294 327 311 380 346 421 _c
381 461 427 482 483 482 _c
516 482 545 475 571 463 _c
596 451 618 432 638 408 _c
638 472 _l
708 472 _l
708 113 _l
755 120 792 142 819 178 _c
846 214 860 261 860 319 _c
860 353 854 386 844 417 _c
834 447 818 476 798 502 _c
764 544 722 577 674 600 _c
625 622 572 634 515 634 _c
475 634 436 628 400 618 _c
363 607 329 591 298 571 _c
}_e{246 537 206 494 178 440 _c
149 386 135 327 135 265 _c
135 213 144 165 163 120 _c
181 74 208 34 244 0 _c
278 -33 317 -58 362 -76 _c
407 -94 455 -103 507 -103 _c
549 -103 590 -96 630 -82 _c
670 -68 708 -47 742 -21 _c
786 -75 _l
745 -107 701 -131 653 -148 _c
605 -164 556 -173 507 -173 _c
447 -173 390 -162 336 -141 _c
282 -119 235 -88 194 -48 _c
152 -8 120 38 98 92 _c
}_e{76 146 66 203 66 265 _c
66 324 77 380 99 434 _c
121 488 152 535 194 576 _c
236 617 284 649 339 671 _c
394 693 452 704 514 704 _c
583 704 647 689 706 661 _c
765 633 815 593 855 541 _c
879 509 898 474 911 437 _c
923 399 930 361 930 321 _c
930 235 904 167 852 118 _c
800 68 729 43 638 41 _c
638 116 _l
_cl}_e}_d
/A{684 0 8 0 676 729 _sc
342 632 _m
208 269 _l
476 269 _l
342 632 _l
286 729 _m
398 729 _l
676 0 _l
573 0 _l
507 187 _l
178 187 _l
112 0 _l
8 0 _l
286 729 _l
_cl}_d
/C{{698 0 56 -13 644 742 _sc
644 673 _m
644 569 _l
610 599 575 622 537 638 _c
499 653 460 661 418 661 _c
334 661 270 635 226 584 _c
182 533 160 460 160 364 _c
160 268 182 194 226 143 _c
270 92 334 67 418 67 _c
460 67 499 74 537 90 _c
575 105 610 128 644 159 _c
644 56 _l
609 32 572 15 534 4 _c
496 -7 455 -13 412 -13 _c
302 -13 215 20 151 87 _c
}_e{87 154 56 246 56 364 _c
56 481 87 573 151 641 _c
215 708 302 742 412 742 _c
456 742 497 736 535 725 _c
573 713 610 696 644 673 _c
_cl}_e}_d
/F{575 0 98 0 517 729 _sc
98 729 _m
517 729 _l
517 646 _l
197 646 _l
197 431 _l
486 431 _l
486 348 _l
197 348 _l
197 0 _l
98 0 _l
98 729 _l
_cl}_d
/H{752 0 98 0 654 729 _sc
98 729 _m
197 729 _l
197 430 _l
555 430 _l
555 729 _l
654 729 _l
654 0 _l
555 0 _l
555 347 _l
197 347 _l
197 0 _l
98 0 _l
98 729 _l
_cl}_d
/I{295 0 98 0 197 729 _sc
98 729 _m
197 729 _l
197 0 _l
98 0 _l
98 729 _l
_cl}_d
/K{656 0 98 0 677 729 _sc
98 729 _m
197 729 _l
197 421 _l
524 729 _l
651 729 _l
289 389 _l
677 0 _l
547 0 _l
197 351 _l
197 0 _l
98 0 _l
98 729 _l
_cl}_d
/L{557 0 98 0 552 729 _sc
98 729 _m
197 729 _l
197 83 _l
552 83 _l
552 0 _l
98 0 _l
98 729 _l
_cl}_d
/M{863 0 98 0 765 729 _sc
98 729 _m
245 729 _l
431 233 _l
618 729 _l
765 729 _l
765 0 _l
669 0 _l
669 640 _l
481 140 _l
382 140 _l
194 640 _l
194 0 _l
98 0 _l
98 729 _l
_cl}_d
/N{748 0 98 0 650 729 _sc
98 729 _m
231 729 _l
554 119 _l
554 729 _l
650 729 _l
650 0 _l
517 0 _l
194 610 _l
194 0 _l
98 0 _l
98 729 _l
_cl}_d
/W{989 0 33 0 956 729 _sc
33 729 _m
133 729 _l
286 113 _l
439 729 _l
550 729 _l
703 113 _l
856 729 _l
956 729 _l
773 0 _l
649 0 _l
495 633 _l
340 0 _l
216 0 _l
33 729 _l
_cl}_d
/a{{613 0 60 -13 522 560 _sc
343 275 _m
270 275 220 266 192 250 _c
164 233 150 205 150 165 _c
150 133 160 107 181 89 _c
202 70 231 61 267 61 _c
317 61 357 78 387 114 _c
417 149 432 196 432 255 _c
432 275 _l
343 275 _l
522 312 _m
522 0 _l
432 0 _l
432 83 _l
411 49 385 25 355 10 _c
325 -5 287 -13 243 -13 _c
187 -13 142 2 109 33 _c
76 64 60 106 60 159 _c
}_e{60 220 80 266 122 298 _c
163 329 224 345 306 345 _c
432 345 _l
432 354 _l
432 395 418 427 391 450 _c
364 472 326 484 277 484 _c
245 484 215 480 185 472 _c
155 464 127 453 100 439 _c
100 522 _l
132 534 164 544 195 550 _c
226 556 256 560 286 560 _c
365 560 424 539 463 498 _c
502 457 522 395 522 312 _c
_cl}_e}_d
/c{{550 0 55 -13 488 560 _sc
488 526 _m
488 442 _l
462 456 437 466 411 473 _c
385 480 360 484 334 484 _c
276 484 230 465 198 428 _c
166 391 150 339 150 273 _c
150 206 166 154 198 117 _c
230 80 276 62 334 62 _c
360 62 385 65 411 72 _c
437 79 462 90 488 104 _c
488 21 _l
462 9 436 0 410 -5 _c
383 -10 354 -13 324 -13 _c
242 -13 176 12 128 64 _c
}_e{79 115 55 185 55 273 _c
55 362 79 432 128 483 _c
177 534 244 560 330 560 _c
358 560 385 557 411 551 _c
437 545 463 537 488 526 _c
_cl}_e}_d
/d{{635 0 55 -13 544 760 _sc
454 464 _m
454 760 _l
544 760 _l
544 0 _l
454 0 _l
454 82 _l
435 49 411 25 382 10 _c
353 -5 319 -13 279 -13 _c
213 -13 159 13 117 65 _c
75 117 55 187 55 273 _c
55 359 75 428 117 481 _c
159 533 213 560 279 560 _c
319 560 353 552 382 536 _c
411 520 435 496 454 464 _c
148 273 _m
148 207 161 155 188 117 _c
215 79 253 61 301 61 _c
}_e{348 61 385 79 413 117 _c
440 155 454 207 454 273 _c
454 339 440 390 413 428 _c
385 466 348 485 301 485 _c
253 485 215 466 188 428 _c
161 390 148 339 148 273 _c
_cl}_e}_d
/e{{615 0 55 -13 562 560 _sc
562 296 _m
562 252 _l
149 252 _l
153 190 171 142 205 110 _c
238 78 284 62 344 62 _c
378 62 412 66 444 74 _c
476 82 509 95 541 113 _c
541 28 _l
509 14 476 3 442 -3 _c
408 -9 373 -13 339 -13 _c
251 -13 182 12 131 62 _c
80 112 55 181 55 268 _c
55 357 79 428 127 481 _c
175 533 241 560 323 560 _c
397 560 455 536 498 489 _c
}_e{540 441 562 377 562 296 _c
472 322 _m
471 371 457 410 431 440 _c
404 469 368 484 324 484 _c
274 484 234 469 204 441 _c
174 413 156 373 152 322 _c
472 322 _l
_cl}_e}_d
/g{{635 0 55 -207 544 560 _sc
454 280 _m
454 344 440 395 414 431 _c
387 467 349 485 301 485 _c
253 485 215 467 188 431 _c
161 395 148 344 148 280 _c
148 215 161 165 188 129 _c
215 93 253 75 301 75 _c
349 75 387 93 414 129 _c
440 165 454 215 454 280 _c
544 68 _m
544 -24 523 -93 482 -139 _c
440 -184 377 -207 292 -207 _c
260 -207 231 -204 203 -200 _c
175 -195 147 -188 121 -178 _c
}_e{121 -91 _l
147 -105 173 -115 199 -122 _c
225 -129 251 -133 278 -133 _c
336 -133 380 -117 410 -87 _c
439 -56 454 -10 454 52 _c
454 96 _l
435 64 411 40 382 24 _c
353 8 319 0 279 0 _c
211 0 157 25 116 76 _c
75 127 55 195 55 280 _c
55 364 75 432 116 483 _c
157 534 211 560 279 560 _c
319 560 353 552 382 536 _c
411 520 435 496 454 464 _c
454 547 _l
544 547 _l
}_e{544 68 _l
_cl}_e}_d
/h{634 0 91 0 549 760 _sc
549 330 _m
549 0 _l
459 0 _l
459 327 _l
459 379 448 417 428 443 _c
408 469 378 482 338 482 _c
289 482 251 466 223 435 _c
195 404 181 362 181 309 _c
181 0 _l
91 0 _l
91 760 _l
181 760 _l
181 462 _l
202 494 227 519 257 535 _c
286 551 320 560 358 560 _c
420 560 468 540 500 501 _c
532 462 549 405 549 330 _c
_cl}_d
/i{278 0 94 0 184 760 _sc
94 547 _m
184 547 _l
184 0 _l
94 0 _l
94 547 _l
94 760 _m
184 760 _l
184 646 _l
94 646 _l
94 760 _l
_cl}_d
/l{278 0 94 0 184 760 _sc
94 760 _m
184 760 _l
184 0 _l
94 0 _l
94 760 _l
_cl}_d
/m{{974 0 91 0 889 560 _sc
520 442 _m
542 482 569 511 600 531 _c
631 550 668 560 711 560 _c
767 560 811 540 842 500 _c
873 460 889 403 889 330 _c
889 0 _l
799 0 _l
799 327 _l
799 379 789 418 771 444 _c
752 469 724 482 686 482 _c
639 482 602 466 575 435 _c
548 404 535 362 535 309 _c
535 0 _l
445 0 _l
445 327 _l
445 379 435 418 417 444 _c
398 469 369 482 331 482 _c
}_e{285 482 248 466 221 435 _c
194 404 181 362 181 309 _c
181 0 _l
91 0 _l
91 547 _l
181 547 _l
181 462 _l
201 495 226 520 255 536 _c
283 552 317 560 357 560 _c
397 560 430 550 458 530 _c
486 510 506 480 520 442 _c
_cl}_e}_d
/n{634 0 91 0 549 560 _sc
549 330 _m
549 0 _l
459 0 _l
459 327 _l
459 379 448 417 428 443 _c
408 469 378 482 338 482 _c
289 482 251 466 223 435 _c
195 404 181 362 181 309 _c
181 0 _l
91 0 _l
91 547 _l
181 547 _l
181 462 _l
202 494 227 519 257 535 _c
286 551 320 560 358 560 _c
420 560 468 540 500 501 _c
532 462 549 405 549 330 _c
_cl}_d
/o{612 0 55 -13 557 560 _sc
306 484 _m
258 484 220 465 192 427 _c
164 389 150 338 150 273 _c
150 207 163 156 191 118 _c
219 80 257 62 306 62 _c
354 62 392 80 420 118 _c
448 156 462 207 462 273 _c
462 337 448 389 420 427 _c
392 465 354 484 306 484 _c
306 560 _m
384 560 445 534 490 484 _c
534 433 557 363 557 273 _c
557 183 534 113 490 63 _c
445 12 384 -13 306 -13 _c
227 -13 165 12 121 63 _c
77 113 55 183 55 273 _c
55 363 77 433 121 484 _c
165 534 227 560 306 560 _c
_cl}_d
/p{{635 0 91 -207 580 560 _sc
181 82 _m
181 -207 _l
91 -207 _l
91 547 _l
181 547 _l
181 464 _l
199 496 223 520 252 536 _c
281 552 316 560 356 560 _c
422 560 476 533 518 481 _c
559 428 580 359 580 273 _c
580 187 559 117 518 65 _c
476 13 422 -13 356 -13 _c
316 -13 281 -5 252 10 _c
223 25 199 49 181 82 _c
487 273 _m
487 339 473 390 446 428 _c
418 466 381 485 334 485 _c
}_e{286 485 249 466 222 428 _c
194 390 181 339 181 273 _c
181 207 194 155 222 117 _c
249 79 286 61 334 61 _c
381 61 418 79 446 117 _c
473 155 487 207 487 273 _c
_cl}_e}_d
/q{{635 0 55 -207 544 560 _sc
148 273 _m
148 207 161 155 188 117 _c
215 79 253 61 301 61 _c
348 61 385 79 413 117 _c
440 155 454 207 454 273 _c
454 339 440 390 413 428 _c
385 466 348 485 301 485 _c
253 485 215 466 188 428 _c
161 390 148 339 148 273 _c
454 82 _m
435 49 411 25 382 10 _c
353 -5 319 -13 279 -13 _c
213 -13 159 13 117 65 _c
75 117 55 187 55 273 _c
}_e{55 359 75 428 117 481 _c
159 533 213 560 279 560 _c
319 560 353 552 382 536 _c
411 520 435 496 454 464 _c
454 547 _l
544 547 _l
544 -207 _l
454 -207 _l
454 82 _l
_cl}_e}_d
/r{411 0 91 0 411 560 _sc
411 463 _m
401 469 390 473 378 476 _c
366 478 353 480 339 480 _c
288 480 249 463 222 430 _c
194 397 181 350 181 288 _c
181 0 _l
91 0 _l
91 547 _l
181 547 _l
181 462 _l
199 495 224 520 254 536 _c
284 552 321 560 365 560 _c
371 560 378 559 386 559 _c
393 558 401 557 411 555 _c
411 463 _l
_cl}_d
/s{{521 0 54 -13 472 560 _sc
443 531 _m
443 446 _l
417 458 391 468 364 475 _c
336 481 308 485 279 485 _c
234 485 200 478 178 464 _c
156 450 145 430 145 403 _c
145 382 153 366 169 354 _c
185 342 217 330 265 320 _c
296 313 _l
360 299 405 279 432 255 _c
458 230 472 195 472 151 _c
472 100 452 60 412 31 _c
372 1 316 -13 246 -13 _c
216 -13 186 -10 154 -5 _c
}_e{122 0 89 8 54 20 _c
54 113 _l
87 95 120 82 152 74 _c
184 65 216 61 248 61 _c
290 61 323 68 346 82 _c
368 96 380 117 380 144 _c
380 168 371 187 355 200 _c
339 213 303 226 247 238 _c
216 245 _l
160 257 119 275 95 299 _c
70 323 58 356 58 399 _c
58 450 76 490 112 518 _c
148 546 200 560 268 560 _c
301 560 332 557 362 552 _c
391 547 418 540 443 531 _c
}_e{_cl}_e}_d
/t{392 0 27 0 368 702 _sc
183 702 _m
183 547 _l
368 547 _l
368 477 _l
183 477 _l
183 180 _l
183 135 189 106 201 94 _c
213 81 238 75 276 75 _c
368 75 _l
368 0 _l
276 0 _l
206 0 158 13 132 39 _c
106 65 93 112 93 180 _c
93 477 _l
27 477 _l
27 547 _l
93 547 _l
93 702 _l
183 702 _l
_cl}_d
/u{634 0 85 -13 543 560 _sc
85 216 _m
85 547 _l
175 547 _l
175 219 _l
175 167 185 129 205 103 _c
225 77 255 64 296 64 _c
344 64 383 79 411 110 _c
439 141 453 183 453 237 _c
453 547 _l
543 547 _l
543 0 _l
453 0 _l
453 84 _l
431 50 405 26 377 10 _c
348 -5 315 -13 277 -13 _c
214 -13 166 6 134 45 _c
101 83 85 140 85 216 _c
311 560 _m
311 560 _l
_cl}_d
/y{592 0 30 -207 562 547 _sc
322 -50 _m
296 -114 271 -157 247 -177 _c
223 -197 191 -207 151 -207 _c
79 -207 _l
79 -132 _l
132 -132 _l
156 -132 175 -126 189 -114 _c
203 -102 218 -75 235 -31 _c
251 9 _l
30 547 _l
125 547 _l
296 119 _l
467 547 _l
562 547 _l
322 -50 _l
_cl}_d
/z{525 0 43 0 482 547 _sc
55 547 _m
482 547 _l
482 465 _l
144 72 _l
482 72 _l
482 0 _l
43 0 _l
43 82 _l
381 475 _l
55 475 _l
55 547 _l
_cl}_d
end readonly def

/BuildGlyph
 {exch begin
 CharStrings exch
 2 copy known not{pop /.notdef}if
 true 3 1 roll get exec
 end}_d

/BuildChar {
 1 index /Encoding get exch get
 1 index /BuildGlyph get exec
}_d

FontName currentdict end definefont pop
end
%%EndProlog
mpldict begin
54 180 translate
504 432 0 0 clipbox
gsave
0 0 m
504 0 l
504 432 l
0 432 l
cl
1.000 setgray
fill
grestore
gsave
68.0175 58.68 m
471.47625 58.68 l
471.47625 367.528 l
68.0175 367.528 l
cl
1.000 setgray
fill
grestore
1.000 setlinewidth
1 setlinejoin
2 setlinecap
[] 0 setdash
0.050 0.030 0.528 setrgbcolor
gsave
403.5 308.8 68.02 58.68 clipbox
68.0175 320.816947 m
72.092841 307.248553 l
76.168182 307.167882 l
80.243523 297.385797 l
84.318864 299.492633 l
88.394205 296.866892 l
92.469545 293.393335 l
96.544886 292.83853 l
100.620227 293.265231 l
104.695568 294.820224 l
108.770909 294.218336 l
112.84625 293.17197 l
116.921591 291.311133 l
120.996932 288.621139 l
125.072273 295.659102 l
129.147614 292.026633 l
133.222955 295.413487 l
137.298295 294.017789 l
141.373636 291.468596 l
145.448977 292.785852 l
149.524318 288.855001 l
153.599659 289.317567 l
157.675 289.580089 l
161.750341 296.208391 l
165.825682 293.697972 l
169.901023 289.431916 l
173.976364 289.069648 l
178.051705 291.245109 l
182.127045 287.288105 l
186.202386 291.522532 l
190.277727 291.006206 l
194.353068 292.863144 l
198.428409 291.423472 l
202.50375 292.197167 l
206.579091 292.27015 l
210.654432 292.405569 l
214.729773 288.991135 l
218.805114 287.900828 l
222.880455 288.6506 l
226.955795 287.848735 l
231.031136 284.379951 l
235.106477 294.43833 l
239.181818 291.359955 l
243.257159 291.330313 l
247.3325 291.21452 l
251.407841 288.459711 l
255.483182 287.67562 l
259.558523 288.067716 l
263.633864 289.755416 l
267.709205 292.025837 l
271.784545 290.107718 l
275.859886 290.464895 l
279.935227 295.936546 l
284.010568 295.981056 l
288.085909 290.931695 l
292.16125 290.614077 l
296.236591 290.60509 l
300.311932 293.818015 l
304.387273 293.688859 l
308.462614 290.568419 l
312.537955 291.887107 l
316.613295 294.505227 l
320.688636 293.926102 l
324.763977 293.870998 l
328.839318 294.283401 l
332.914659 296.129779 l
336.99 297.724947 l
341.065341 298.170764 l
345.140682 298.15573 l
349.216023 295.787937 l
353.291364 295.764209 l
357.366705 295.650689 l
361.442045 293.074934 l
365.517386 293.232556 l
369.592727 294.494818 l
373.668068 292.945741 l
377.743409 293.212374 l
381.81875 293.153691 l
385.894091 293.506406 l
389.969432 293.391456 l
394.044773 293.396424 l
398.120114 293.745006 l
402.195455 296.140472 l
406.270795 301.481037 l
410.346136 294.53101 l
414.421477 298.774613 l
418.496818 299.087095 l
422.572159 299.567438 l
426.6475 299.805958 l
430.722841 299.762416 l
434.798182 300.109216 l
438.873523 300.535457 l
442.948864 298.00752 l
447.024205 299.393991 l
451.099545 299.311162 l
455.174886 299.160392 l
459.250227 300.77818 l
463.325568 301.008287 l
467.400909 301.08109 l
471.47625 303.783442 l
stroke
grestore
0.228 0.016 0.605 setrgbcolor
gsave
403.5 308.8 68.02 58.68 clipbox
68.0175 333.183844 m
72.092841 318.098942 l
76.168182 317.900445 l
80.243523 303.886582 l
84.318864 311.746091 l
88.394205 309.731163 l
92.469545 302.489661 l
96.544886 302.09798 l
100.620227 301.479683 l
104.695568 299.719211 l
108.770909 298.921552 l
112.84625 297.741538 l
116.921591 297.786866 l
120.996932 297.808326 l
125.072273 300.426696 l
129.147614 297.176359 l
133.222955 301.625959 l
137.298295 301.090256 l
141.373636 298.479705 l
145.448977 303.90253 l
149.524318 300.40487 l
153.599659 302.643229 l
157.675 301.339818 l
161.750341 301.096029 l
165.825682 304.082016 l
169.901023 302.361618 l
173.976364 301.543771 l
178.051705 301.107031 l
182.127045 299.345985 l
186.202386 301.966183 l
190.277727 301.059713 l
194.353068 301.052433 l
198.428409 301.240067 l
202.50375 298.166886 l
206.579091 301.263638 l
210.654432 296.909802 l
214.729773 298.054188 l
218.805114 298.178041 l
222.880455 299.354939 l
226.955795 298.597679 l
231.031136 298.336792 l
235.106477 300.772934 l
239.181818 299.781834 l
243.257159 299.917229 l
247.3325 298.256842 l
251.407841 292.502663 l
255.483182 302.271711 l
259.558523 301.40082 l
263.633864 302.620839 l
267.709205 299.475474 l
271.784545 299.377576 l
275.859886 299.458095 l
279.935227 299.108552 l
284.010568 299.171626 l
288.085909 299.176928 l
292.16125 299.30837 l
296.236591 299.350316 l
300.311932 300.019778 l
304.387273 299.821854 l
308.462614 299.776994 l
312.537955 299.256549 l
316.613295 303.18196 l
320.688636 302.126057 l
324.763977 302.547227 l
328.839318 305.252468 l
332.914659 301.909662 l
336.99 304.202954 l
341.065341 304.996885 l
345.140682 305.170976 l
349.216023 305.309793 l
353.291364 305.456428 l
357.366705 305.053838 l
361.442045 305.53899 l
365.517386 305.531642 l
369.592727 306.436446 l
373.668068 305.865136 l
377.743409 305.613605 l
381.81875 306.115535 l
385.894091 306.199739 l
389.969432 304.655635 l
394.044773 305.393236 l
398.120114 307.54927 l
402.195455 307.440686 l
406.270795 307.217671 l
410.346136 307.480055 l
414.421477 307.420843 l
418.496818 307.412577 l
422.572159 307.445597 l
426.6475 307.965061 l
430.722841 307.977432 l
434.798182 306.173757 l
438.873523 308.205488 l
442.948864 307.724048 l
447.024205 307.602933 l
451.099545 303.100411 l
455.174886 308.740324 l
459.250227 308.841481 l
463.325568 308.798362 l
467.400909 308.820004 l
471.47625 311.739909 l
stroke
grestore
0.363 0.003 0.649 setrgbcolor
gsave
403.5 308.8 68.02 58.68 clipbox
68.0175 332.526164 m
72.092841 317.076657 l
76.168182 313.029391 l
80.243523 306.436389 l
84.318864 308.768328 l
88.394205 306.295328 l
92.469545 298.426782 l
96.544886 295.614633 l
100.620227 299.544827 l
104.695568 300.371741 l
108.770909 300.271392 l
112.84625 298.831739 l
116.921591 299.509393 l
120.996932 295.60921 l
125.072273 301.167683 l
129.147614 299.532719 l
133.222955 300.050532 l
137.298295 297.522708 l
141.373636 297.073989 l
145.448977 301.159579 l
149.524318 297.377227 l
153.599659 300.000357 l
157.675 298.99378 l
161.750341 298.595747 l
165.825682 301.772692 l
169.901023 299.197452 l
173.976364 298.71704 l
178.051705 298.382605 l
182.127045 298.433479 l
186.202386 298.626408 l
190.277727 296.864511 l
194.353068 299.601269 l
198.428409 299.3182 l
202.50375 299.57558 l
206.579091 299.143969 l
210.654432 297.710534 l
214.729773 299.029156 l
218.805114 299.230524 l
222.880455 299.705045 l
226.955795 298.63606 l
231.031136 298.129316 l
235.106477 301.132637 l
239.181818 299.472646 l
243.257159 301.190587 l
247.3325 301.361262 l
251.407841 301.55922 l
255.483182 300.114757 l
259.558523 301.410392 l
263.633864 301.181388 l
267.709205 302.713179 l
271.784545 301.13416 l
275.859886 301.029209 l
279.935227 299.1403 l
284.010568 299.536982 l
288.085909 299.533223 l
292.16125 299.847753 l
296.236591 299.53232 l
300.311932 300.701526 l
304.387273 300.203736 l
308.462614 300.478021 l
312.537955 299.725387 l
316.613295 302.440238 l
320.688636 302.192767 l
324.763977 302.806986 l
328.839318 303.148784 l
332.914659 302.717493 l
336.99 303.02539 l
341.065341 302.677502 l
345.140682 299.294856 l
349.216023 305.557185 l
353.291364 304.150615 l
357.366705 305.840446 l
361.442045 305.690836 l
365.517386 305.492513 l
369.592727 307.080045 l
373.668068 305.814367 l
377.743409 306.1335 l
381.81875 306.357823 l
385.894091 306.521444 l
389.969432 306.666581 l
394.044773 306.550196 l
398.120114 308.286234 l
402.195455 308.557783 l
406.270795 308.456961 l
410.346136 308.618449 l
414.421477 308.845141 l
418.496818 309.007511 l
422.572159 309.127022 l
426.6475 309.483454 l
430.722841 309.322403 l
434.798182 309.158792 l
438.873523 309.267523 l
442.948864 304.697409 l
447.024205 308.750937 l
451.099545 313.259374 l
455.174886 313.233017 l
459.250227 307.093571 l
463.325568 308.958992 l
467.400909 309.540778 l
471.47625 311.859626 l
stroke
grestore
0.495 0.012 0.658 setrgbcolor
gsave
403.5 308.8 68.02 58.68 clipbox
68.0175 313.531786 m
72.092841 299.803572 l
76.168182 299.9863 l
80.243523 292.874305 l
84.318864 295.501041 l
88.394205 292.853094 l
92.469545 291.869251 l
96.544886 291.85764 l
100.620227 292.499033 l
104.695568 289.229065 l
108.770909 292.427192 l
112.84625 284.429007 l
116.921591 289.247555 l
120.996932 293.463582 l
125.072273 295.653671 l
129.147614 289.986495 l
133.222955 287.333574 l
137.298295 287.417286 l
141.373636 290.544319 l
145.448977 295.050783 l
149.524318 290.3308 l
153.599659 292.350074 l
157.675 290.604796 l
161.750341 290.60406 l
165.825682 289.878501 l
169.901023 287.034248 l
173.976364 286.022135 l
178.051705 285.454551 l
182.127045 286.992891 l
186.202386 287.240428 l
190.277727 282.922698 l
194.353068 283.619483 l
198.428409 283.028256 l
202.50375 283.775764 l
206.579091 284.500826 l
210.654432 284.050068 l
214.729773 281.157586 l
218.805114 281.720174 l
222.880455 281.31664 l
226.955795 280.80517 l
231.031136 280.280253 l
235.106477 283.338593 l
239.181818 286.309909 l
243.257159 284.90099 l
247.3325 285.540446 l
251.407841 282.118391 l
255.483182 284.537308 l
259.558523 287.442722 l
263.633864 286.181337 l
267.709205 287.073399 l
271.784545 285.575799 l
275.859886 282.673004 l
279.935227 282.137204 l
284.010568 281.789171 l
288.085909 281.171285 l
292.16125 285.169872 l
296.236591 285.000079 l
300.311932 277.987615 l
304.387273 286.617448 l
308.462614 286.603967 l
312.537955 285.255995 l
316.613295 282.625638 l
320.688636 287.389805 l
324.763977 287.672086 l
328.839318 287.595051 l
332.914659 288.070613 l
336.99 287.492753 l
341.065341 287.569469 l
345.140682 287.893961 l
349.216023 288.180566 l
353.291364 288.20783 l
357.366705 287.922192 l
361.442045 288.124769 l
365.517386 288.335223 l
369.592727 290.162374 l
373.668068 288.96971 l
377.743409 289.411768 l
381.81875 289.180031 l
385.894091 289.385096 l
389.969432 289.337999 l
394.044773 286.900272 l
398.120114 290.279428 l
402.195455 290.223524 l
406.270795 288.714997 l
410.346136 291.156055 l
414.421477 290.889683 l
418.496818 291.212706 l
422.572159 291.173139 l
426.6475 291.712719 l
430.722841 291.450862 l
434.798182 289.349763 l
438.873523 290.552238 l
442.948864 286.842383 l
447.024205 286.913179 l
451.099545 291.75198 l
455.174886 292.191652 l
459.250227 291.986086 l
463.325568 292.201013 l
467.400909 291.961771 l
471.47625 293.007258 l
stroke
grestore
0.611 0.090 0.620 setrgbcolor
gsave
403.5 308.8 68.02 58.68 clipbox
68.0175 316.598797 m
72.092841 298.959628 l
76.168182 300.05051 l
80.243523 293.127284 l
84.318864 296.145734 l
88.394205 293.99432 l
92.469545 294.925219 l
96.544886 294.834828 l
100.620227 295.212191 l
104.695568 293.363776 l
108.770909 292.556189 l
112.84625 291.549998 l
116.921591 291.949854 l
120.996932 290.711185 l
125.072273 292.600292 l
129.147614 288.345083 l
133.222955 287.033638 l
137.298295 285.057974 l
141.373636 290.69789 l
145.448977 283.924808 l
149.524318 287.297774 l
153.599659 291.424005 l
157.675 289.711558 l
161.750341 288.765305 l
165.825682 293.780162 l
169.901023 291.898473 l
173.976364 291.652862 l
178.051705 288.978338 l
182.127045 290.532949 l
186.202386 290.755315 l
190.277727 287.247763 l
194.353068 286.974916 l
198.428409 286.9037 l
202.50375 288.887619 l
206.579091 289.126192 l
210.654432 289.472145 l
214.729773 286.736105 l
218.805114 285.871911 l
222.880455 286.478763 l
226.955795 285.275387 l
231.031136 283.743233 l
235.106477 287.023153 l
239.181818 286.705812 l
243.257159 286.609375 l
247.3325 286.982148 l
251.407841 286.431918 l
255.483182 288.449017 l
259.558523 284.825776 l
263.633864 290.889011 l
267.709205 292.539682 l
271.784545 290.894661 l
275.859886 287.098739 l
279.935227 286.748928 l
284.010568 286.874373 l
288.085909 288.579946 l
292.16125 288.909645 l
296.236591 288.928111 l
300.311932 285.879306 l
304.387273 285.214703 l
308.462614 285.19238 l
312.537955 287.256127 l
316.613295 290.234599 l
320.688636 290.262055 l
324.763977 289.452399 l
328.839318 283.835234 l
332.914659 291.105353 l
336.99 286.637931 l
341.065341 286.188614 l
345.140682 286.245221 l
349.216023 286.371387 l
353.291364 285.502283 l
357.366705 288.858952 l
361.442045 292.621445 l
365.517386 292.921228 l
369.592727 294.07385 l
373.668068 290.219455 l
377.743409 290.177881 l
381.81875 290.363209 l
385.894091 289.646975 l
389.969432 290.058374 l
394.044773 289.254257 l
398.120114 289.232164 l
402.195455 291.881472 l
406.270795 293.364449 l
410.346136 292.798594 l
414.421477 292.812819 l
418.496818 292.947239 l
422.572159 290.347738 l
426.6475 290.517551 l
430.722841 293.017845 l
434.798182 292.618963 l
438.873523 294.903936 l
442.948864 294.182405 l
447.024205 295.799484 l
451.099545 295.254491 l
455.174886 296.293355 l
459.250227 294.190488 l
463.325568 298.898597 l
467.400909 298.975936 l
471.47625 297.582887 l
stroke
grestore
0.711 0.183 0.550 setrgbcolor
gsave
403.5 308.8 68.02 58.68 clipbox
68.0175 316.499927 m
72.092841 301.171045 l
76.168182 301.17632 l
80.243523 294.647809 l
84.318864 297.395479 l
88.394205 295.753652 l
92.469545 291.409599 l
96.544886 291.112093 l
100.620227 291.462131 l
104.695568 294.643912 l
108.770909 293.751774 l
112.84625 292.700854 l
116.921591 291.943535 l
120.996932 294.022166 l
125.072273 292.870617 l
129.147614 292.33227 l
133.222955 290.620883 l
137.298295 287.777448 l
141.373636 294.030577 l
145.448977 298.032825 l
149.524318 293.074037 l
153.599659 292.481718 l
157.675 289.7969 l
161.750341 289.153077 l
165.825682 296.600911 l
169.901023 294.806361 l
173.976364 293.543689 l
178.051705 292.928308 l
182.127045 292.50571 l
186.202386 292.388522 l
190.277727 293.83113 l
194.353068 293.557901 l
198.428409 290.889601 l
202.50375 293.457184 l
206.579091 292.740964 l
210.654432 293.161679 l
214.729773 294.535129 l
218.805114 294.658675 l
222.880455 295.012675 l
226.955795 295.009746 l
231.031136 295.545327 l
235.106477 297.801027 l
239.181818 295.623078 l
243.257159 294.737563 l
247.3325 295.947999 l
251.407841 294.856733 l
255.483182 295.546698 l
259.558523 296.303 l
263.633864 298.023518 l
267.709205 300.35567 l
271.784545 299.168799 l
275.859886 299.227654 l
279.935227 297.666239 l
284.010568 298.15535 l
288.085909 295.39142 l
292.16125 295.415179 l
296.236591 295.28084 l
300.311932 297.751253 l
304.387273 297.851148 l
308.462614 297.52384 l
312.537955 298.89736 l
316.613295 301.487844 l
320.688636 300.866454 l
324.763977 303.236577 l
328.839318 300.978192 l
332.914659 303.879741 l
336.99 298.982 l
341.065341 298.326228 l
345.140682 302.946422 l
349.216023 302.893539 l
353.291364 304.050568 l
357.366705 304.67661 l
361.442045 300.480873 l
365.517386 300.651042 l
369.592727 301.766437 l
373.668068 300.250297 l
377.743409 299.774542 l
381.81875 301.862037 l
385.894091 303.173337 l
389.969432 303.267387 l
394.044773 303.141533 l
398.120114 305.849908 l
402.195455 305.73278 l
406.270795 306.042435 l
410.346136 305.644897 l
414.421477 305.660348 l
418.496818 305.423806 l
422.572159 306.60657 l
426.6475 306.92517 l
430.722841 306.845075 l
434.798182 303.958116 l
438.873523 306.614332 l
442.948864 311.756958 l
447.024205 310.211256 l
451.099545 309.944989 l
455.174886 308.774306 l
459.250227 309.026801 l
463.325568 308.423869 l
467.400909 308.867697 l
471.47625 312.088598 l
stroke
grestore
0.798 0.280 0.470 setrgbcolor
gsave
403.5 308.8 68.02 58.68 clipbox
68.0175 316.893146 m
72.092841 304.019264 l
76.168182 304.114706 l
80.243523 295.713215 l
84.318864 298.224472 l
88.394205 295.98917 l
92.469545 295.296143 l
96.544886 295.348345 l
100.620227 295.269506 l
104.695568 292.695051 l
108.770909 291.081005 l
112.84625 292.661624 l
116.921591 294.594942 l
120.996932 293.907623 l
125.072273 295.230401 l
129.147614 292.329131 l
133.222955 291.056684 l
137.298295 289.496283 l
141.373636 291.853806 l
145.448977 295.786942 l
149.524318 291.586789 l
153.599659 290.445047 l
157.675 288.060701 l
161.750341 288.247249 l
165.825682 292.122105 l
169.901023 292.738403 l
173.976364 291.355326 l
178.051705 289.253409 l
182.127045 289.864194 l
186.202386 288.650971 l
190.277727 292.626483 l
194.353068 292.769448 l
198.428409 290.421239 l
202.50375 293.07172 l
206.579091 293.607967 l
210.654432 293.219629 l
214.729773 290.162994 l
218.805114 290.099793 l
222.880455 290.603981 l
226.955795 291.580626 l
231.031136 291.349519 l
235.106477 294.058716 l
239.181818 295.327265 l
243.257159 295.462828 l
247.3325 295.572893 l
251.407841 296.891637 l
255.483182 296.429775 l
259.558523 296.886359 l
263.633864 296.965301 l
267.709205 298.314093 l
271.784545 297.050621 l
275.859886 298.86762 l
279.935227 298.87958 l
284.010568 299.086953 l
288.085909 294.902227 l
292.16125 294.368342 l
296.236591 294.161946 l
300.311932 296.313006 l
304.387273 297.932351 l
308.462614 297.888556 l
312.537955 301.747762 l
316.613295 304.038985 l
320.688636 303.567906 l
324.763977 302.626454 l
328.839318 302.781734 l
332.914659 302.654121 l
336.99 303.317853 l
341.065341 303.466327 l
345.140682 303.55389 l
349.216023 297.935306 l
353.291364 304.359997 l
357.366705 304.119207 l
361.442045 299.090809 l
365.517386 299.186492 l
369.592727 300.30432 l
373.668068 301.453101 l
377.743409 301.770287 l
381.81875 301.989767 l
385.894091 299.87839 l
389.969432 302.059214 l
394.044773 303.575082 l
398.120114 302.654193 l
402.195455 305.026124 l
406.270795 308.853145 l
410.346136 306.95526 l
414.421477 306.974883 l
418.496818 306.982484 l
422.572159 305.185653 l
426.6475 305.359109 l
430.722841 305.044706 l
434.798182 304.880659 l
438.873523 306.443743 l
442.948864 306.329949 l
447.024205 305.704952 l
451.099545 306.42685 l
455.174886 306.422491 l
459.250227 303.123868 l
463.325568 306.519333 l
467.400909 306.691066 l
471.47625 309.900586 l
stroke
grestore
0.869 0.374 0.397 setrgbcolor
gsave
403.5 308.8 68.02 58.68 clipbox
68.0175 301.859967 m
72.092841 292.433992 l
76.168182 293.329396 l
80.243523 291.394498 l
84.318864 295.18107 l
88.394205 286.24367 l
92.469545 287.017557 l
96.544886 279.929063 l
100.620227 282.186579 l
104.695568 292.897612 l
108.770909 292.446201 l
112.84625 291.650427 l
116.921591 289.262156 l
120.996932 290.323482 l
125.072273 292.592412 l
129.147614 286.935315 l
133.222955 284.89811 l
137.298295 285.654171 l
141.373636 290.578054 l
145.448977 294.766469 l
149.524318 289.286358 l
153.599659 291.930041 l
157.675 291.459305 l
161.750341 291.04131 l
165.825682 294.139979 l
169.901023 289.269087 l
173.976364 289.737771 l
178.051705 290.193606 l
182.127045 290.916616 l
186.202386 289.727984 l
190.277727 291.415316 l
194.353068 291.139326 l
198.428409 291.501999 l
202.50375 291.948418 l
206.579091 292.102448 l
210.654432 292.150119 l
214.729773 292.219298 l
218.805114 292.105188 l
222.880455 287.036331 l
226.955795 292.08984 l
231.031136 292.048619 l
235.106477 294.848594 l
239.181818 295.657208 l
243.257159 295.570592 l
247.3325 293.04787 l
251.407841 295.238853 l
255.483182 295.728016 l
259.558523 296.569038 l
263.633864 296.662985 l
267.709205 298.40138 l
271.784545 297.019962 l
275.859886 294.779884 l
279.935227 295.905049 l
284.010568 295.790104 l
288.085909 297.992813 l
292.16125 295.603524 l
296.236591 297.205383 l
300.311932 297.235422 l
304.387273 297.049138 l
308.462614 297.020115 l
312.537955 297.924684 l
316.613295 300.376518 l
320.688636 295.963577 l
324.763977 295.314656 l
328.839318 299.481291 l
332.914659 299.864623 l
336.99 298.48499 l
341.065341 300.325283 l
345.140682 300.319131 l
349.216023 304.699215 l
353.291364 305.41125 l
357.366705 305.075305 l
361.442045 300.085883 l
365.517386 300.623149 l
369.592727 303.1357 l
373.668068 303.497704 l
377.743409 304.266486 l
381.81875 301.706168 l
385.894091 303.347808 l
389.969432 304.859473 l
394.044773 304.484846 l
398.120114 304.813075 l
402.195455 304.50378 l
406.270795 304.607524 l
410.346136 305.386162 l
414.421477 305.625413 l
418.496818 305.756002 l
422.572159 306.123977 l
426.6475 308.556869 l
430.722841 310.161914 l
434.798182 308.874888 l
438.873523 309.255977 l
442.948864 308.967779 l
447.024205 309.325597 l
451.099545 309.026976 l
455.174886 309.184239 l
459.250227 309.959816 l
463.325568 309.938893 l
467.400909 310.037977 l
471.47625 312.120999 l
stroke
grestore
0.928 0.473 0.326 setrgbcolor
gsave
403.5 308.8 68.02 58.68 clipbox
68.0175 299.009438 m
72.092841 292.399291 l
76.168182 290.202178 l
80.243523 285.60967 l
84.318864 289.047133 l
88.394205 286.265652 l
92.469545 287.847878 l
96.544886 288.032205 l
100.620227 288.308159 l
104.695568 289.192639 l
108.770909 287.605092 l
112.84625 287.106919 l
116.921591 288.285466 l
120.996932 284.315671 l
125.072273 290.214789 l
129.147614 287.160375 l
133.222955 285.639496 l
137.298295 285.441109 l
141.373636 289.5127 l
145.448977 291.41048 l
149.524318 285.5706 l
153.599659 286.024165 l
157.675 283.445398 l
161.750341 285.849116 l
165.825682 291.894609 l
169.901023 284.647365 l
173.976364 283.633515 l
178.051705 287.822067 l
182.127045 289.359583 l
186.202386 289.330017 l
190.277727 289.420357 l
194.353068 288.858492 l
198.428409 289.261699 l
202.50375 288.095061 l
206.579091 288.650693 l
210.654432 281.346058 l
214.729773 289.632403 l
218.805114 287.446469 l
222.880455 289.993909 l
226.955795 289.06015 l
231.031136 287.230468 l
235.106477 290.334562 l
239.181818 288.054187 l
243.257159 287.273261 l
247.3325 289.593153 l
251.407841 291.894754 l
255.483182 289.077181 l
259.558523 290.977467 l
263.633864 289.549921 l
267.709205 291.289447 l
271.784545 289.415146 l
275.859886 287.220365 l
279.935227 286.837607 l
284.010568 286.994333 l
288.085909 290.061127 l
292.16125 287.895989 l
296.236591 290.655779 l
300.311932 289.522398 l
304.387273 289.979001 l
308.462614 290.180882 l
312.537955 288.235942 l
316.613295 291.433728 l
320.688636 290.806662 l
324.763977 293.662756 l
328.839318 293.8854 l
332.914659 293.741137 l
336.99 292.818555 l
341.065341 298.17322 l
345.140682 289.794718 l
349.216023 291.995259 l
353.291364 287.846956 l
357.366705 289.215712 l
361.442045 290.778764 l
365.517386 290.989934 l
369.592727 292.327295 l
373.668068 288.506232 l
377.743409 288.331472 l
381.81875 288.619889 l
385.894091 294.239551 l
389.969432 295.061356 l
394.044773 294.298668 l
398.120114 290.083564 l
402.195455 289.14268 l
406.270795 290.898005 l
410.346136 293.31443 l
414.421477 292.766577 l
418.496818 293.004308 l
422.572159 294.127164 l
426.6475 288.151364 l
430.722841 296.917815 l
434.798182 291.899157 l
438.873523 291.926978 l
442.948864 291.784296 l
447.024205 294.719718 l
451.099545 294.994504 l
455.174886 294.910145 l
459.250227 293.127125 l
463.325568 292.715913 l
467.400909 292.442372 l
471.47625 295.027233 l
stroke
grestore
0.973 0.586 0.252 setrgbcolor
gsave
403.5 308.8 68.02 58.68 clipbox
68.0175 308.951731 m
72.092841 296.58382 l
76.168182 298.356566 l
80.243523 289.728591 l
84.318864 292.589013 l
88.394205 289.905921 l
92.469545 287.197945 l
96.544886 291.7415 l
100.620227 291.859729 l
104.695568 291.86392 l
108.770909 290.363898 l
112.84625 282.266913 l
116.921591 288.73834 l
120.996932 287.99275 l
125.072273 290.284418 l
129.147614 290.024697 l
133.222955 288.722976 l
137.298295 289.620346 l
141.373636 287.978985 l
145.448977 292.74259 l
149.524318 287.570407 l
153.599659 286.54583 l
157.675 283.694575 l
161.750341 284.090024 l
165.825682 291.068182 l
169.901023 289.18004 l
173.976364 288.542563 l
178.051705 287.640909 l
182.127045 283.074328 l
186.202386 287.024759 l
190.277727 281.58307 l
194.353068 281.458365 l
198.428409 281.428084 l
202.50375 283.979576 l
206.579091 284.716296 l
210.654432 285.065093 l
214.729773 282.68749 l
218.805114 282.87043 l
222.880455 283.333615 l
226.955795 280.271719 l
231.031136 279.084264 l
235.106477 286.448106 l
239.181818 282.361405 l
243.257159 283.001845 l
247.3325 283.214572 l
251.407841 286.776837 l
255.483182 287.130455 l
259.558523 287.674754 l
263.633864 283.991428 l
267.709205 285.465249 l
271.784545 283.140534 l
275.859886 282.813411 l
279.935227 282.561775 l
284.010568 281.202155 l
288.085909 280.172093 l
292.16125 280.468202 l
296.236591 287.877858 l
300.311932 285.818771 l
304.387273 285.227558 l
308.462614 285.027608 l
312.537955 280.379783 l
316.613295 282.944661 l
320.688636 283.367837 l
324.763977 285.205248 l
328.839318 284.136157 l
332.914659 284.640734 l
336.99 284.940375 l
341.065341 288.038216 l
345.140682 288.123112 l
349.216023 286.572423 l
353.291364 286.691277 l
357.366705 284.543643 l
361.442045 281.311637 l
365.517386 277.377236 l
369.592727 283.837351 l
373.668068 282.103906 l
377.743409 289.913817 l
381.81875 289.524091 l
385.894091 286.568868 l
389.969432 286.472206 l
394.044773 285.242683 l
398.120114 291.036385 l
402.195455 289.601305 l
406.270795 289.435141 l
410.346136 291.398044 l
414.421477 289.600759 l
418.496818 290.526991 l
422.572159 288.109676 l
426.6475 287.740528 l
430.722841 287.88206 l
434.798182 287.096502 l
438.873523 283.328104 l
442.948864 287.955473 l
447.024205 287.799992 l
451.099545 287.7221 l
455.174886 287.784676 l
459.250227 289.665144 l
463.325568 289.81869 l
467.400909 289.873377 l
471.47625 293.169723 l
stroke
grestore
0.994 0.705 0.183 setrgbcolor
gsave
403.5 308.8 68.02 58.68 clipbox
68.0175 293.742497 m
72.092841 285.980873 l
76.168182 285.542055 l
80.243523 281.927825 l
84.318864 285.096069 l
88.394205 283.279782 l
92.469545 285.895604 l
96.544886 285.943023 l
100.620227 286.142322 l
104.695568 288.882695 l
108.770909 286.997076 l
112.84625 287.256586 l
116.921591 287.54623 l
120.996932 287.190757 l
125.072273 289.103896 l
129.147614 285.011494 l
133.222955 291.206859 l
137.298295 288.291946 l
141.373636 287.926415 l
145.448977 290.893072 l
149.524318 282.761781 l
153.599659 280.523194 l
157.675 288.433489 l
161.750341 282.323418 l
165.825682 290.347221 l
169.901023 287.499359 l
173.976364 286.981002 l
178.051705 286.251705 l
182.127045 287.248686 l
186.202386 289.009295 l
190.277727 286.130841 l
194.353068 287.855806 l
198.428409 287.894411 l
202.50375 288.32146 l
206.579091 288.382182 l
210.654432 288.349061 l
214.729773 288.666325 l
218.805114 288.272444 l
222.880455 288.581286 l
226.955795 288.152431 l
231.031136 287.181273 l
235.106477 290.25624 l
239.181818 285.017741 l
243.257159 284.776641 l
247.3325 284.989232 l
251.407841 288.902103 l
255.483182 289.119826 l
259.558523 289.489798 l
263.633864 288.725223 l
267.709205 290.41158 l
271.784545 288.583936 l
275.859886 290.113013 l
279.935227 290.00976 l
284.010568 289.771418 l
288.085909 288.946147 l
292.16125 288.794335 l
296.236591 288.800362 l
300.311932 292.27553 l
304.387273 292.216954 l
308.462614 292.003996 l
312.537955 290.905953 l
316.613295 294.001628 l
320.688636 293.907363 l
324.763977 293.866723 l
328.839318 294.472161 l
332.914659 294.017922 l
336.99 293.724873 l
341.065341 294.081415 l
345.140682 294.258197 l
349.216023 293.382349 l
353.291364 297.950266 l
357.366705 297.730364 l
361.442045 292.730547 l
365.517386 293.015312 l
369.592727 297.020227 l
373.668068 293.498645 l
377.743409 293.453028 l
381.81875 294.342329 l
385.894091 296.013959 l
389.969432 296.409739 l
394.044773 295.598675 l
398.120114 295.012557 l
402.195455 297.152511 l
406.270795 295.387343 l
410.346136 297.993432 l
414.421477 298.195399 l
418.496818 298.550307 l
422.572159 297.416116 l
426.6475 304.805688 l
430.722841 299.673994 l
434.798182 298.78934 l
438.873523 298.375658 l
442.948864 298.292388 l
447.024205 297.672202 l
451.099545 297.48674 l
455.174886 297.102276 l
459.250227 296.380243 l
463.325568 296.190208 l
467.400909 294.154126 l
471.47625 303.252077 l
stroke
grestore
0 setlinejoin
[] 0 setdash
0.000 setgray
gsave
68.0175 58.68 m
68.0175 367.528 l
stroke
grestore
gsave
471.47625 58.68 m
471.47625 367.528 l
stroke
grestore
gsave
68.0175 58.68 m
471.47625 58.68 l
stroke
grestore
gsave
68.0175 367.528 m
471.47625 367.528 l
stroke
grestore
0.500 setlinewidth
1 setlinejoin
0 setlinecap
[] 0 setdash
gsave
/o {
gsave
newpath
translate
0.5 setlinewidth
1 setlinejoin
0 setlinecap
0 0 m
0 4 l

gsave
0.000 setgray
fill
grestore
stroke
grestore
} bind def
68.0175 58.68 o
grestore
gsave
/o {
gsave
newpath
translate
0.5 setlinewidth
1 setlinejoin
0 setlinecap
0 0 m
0 -4 l

gsave
0.000 setgray
fill
grestore
stroke
grestore
} bind def
68.0175 367.528 o
grestore
/DejaVuSans findfont
16.000 scalefont
setfont
gsave
62.923750 42.523750 translate
0.000000 rotate
0.000000 0.000000 m /zero glyphshow
grestore
gsave
/o {
gsave
newpath
translate
0.5 setlinewidth
1 setlinejoin
0 setlinecap
0 0 m
0 4 l

gsave
0.000 setgray
fill
grestore
stroke
grestore
} bind def
148.709 58.68 o
grestore
gsave
/o {
gsave
newpath
translate
0.5 setlinewidth
1 setlinejoin
0 setlinecap
0 0 m
0 -4 l

gsave
0.000 setgray
fill
grestore
stroke
grestore
} bind def
148.709 367.528 o
grestore
gsave
138.521750 42.523750 translate
0.000000 rotate
0.000000 0.000000 m /two glyphshow
10.179688 0.000000 m /zero glyphshow
grestore
gsave
/o {
gsave
newpath
translate
0.5 setlinewidth
1 setlinejoin
0 setlinecap
0 0 m
0 4 l

gsave
0.000 setgray
fill
grestore
stroke
grestore
} bind def
229.401 58.68 o
grestore
gsave
/o {
gsave
newpath
translate
0.5 setlinewidth
1 setlinejoin
0 setlinecap
0 0 m
0 -4 l

gsave
0.000 setgray
fill
grestore
stroke
grestore
} bind def
229.401 367.528 o
grestore
gsave
219.213500 42.523750 translate
0.000000 rotate
0.000000 0.000000 m /four glyphshow
10.179688 0.000000 m /zero glyphshow
grestore
gsave
/o {
gsave
newpath
translate
0.5 setlinewidth
1 setlinejoin
0 setlinecap
0 0 m
0 4 l

gsave
0.000 setgray
fill
grestore
stroke
grestore
} bind def
310.093 58.68 o
grestore
gsave
/o {
gsave
newpath
translate
0.5 setlinewidth
1 setlinejoin
0 setlinecap
0 0 m
0 -4 l

gsave
0.000 setgray
fill
grestore
stroke
grestore
} bind def
310.093 367.528 o
grestore
gsave
299.905250 42.523750 translate
0.000000 rotate
0.000000 0.000000 m /six glyphshow
10.179688 0.000000 m /zero glyphshow
grestore
gsave
/o {
gsave
newpath
translate
0.5 setlinewidth
1 setlinejoin
0 setlinecap
0 0 m
0 4 l

gsave
0.000 setgray
fill
grestore
stroke
grestore
} bind def
390.784 58.68 o
grestore
gsave
/o {
gsave
newpath
translate
0.5 setlinewidth
1 setlinejoin
0 setlinecap
0 0 m
0 -4 l

gsave
0.000 setgray
fill
grestore
stroke
grestore
} bind def
390.784 367.528 o
grestore
gsave
380.597000 42.523750 translate
0.000000 rotate
0.000000 0.000000 m /eight glyphshow
10.179688 0.000000 m /zero glyphshow
grestore
gsave
/o {
gsave
newpath
translate
0.5 setlinewidth
1 setlinejoin
0 setlinecap
0 0 m
0 4 l

gsave
0.000 setgray
fill
grestore
stroke
grestore
} bind def
471.476 58.68 o
grestore
gsave
/o {
gsave
newpath
translate
0.5 setlinewidth
1 setlinejoin
0 setlinecap
0 0 m
0 -4 l

gsave
0.000 setgray
fill
grestore
stroke
grestore
} bind def
471.476 367.528 o
grestore
gsave
456.195000 42.523750 translate
0.000000 rotate
0.000000 0.000000 m /one glyphshow
10.179688 0.000000 m /zero glyphshow
20.359375 0.000000 m /zero glyphshow
grestore
gsave
172.215625 22.039375 translate
0.000000 rotate
0.000000 0.000000 m /I glyphshow
4.718750 0.000000 m /t glyphshow
10.992188 0.000000 m /e glyphshow
20.835938 0.000000 m /r glyphshow
27.414062 0.000000 m /a glyphshow
37.218750 0.000000 m /t glyphshow
43.492188 0.000000 m /i glyphshow
47.937500 0.000000 m /o glyphshow
57.726562 0.000000 m /n glyphshow
67.867188 0.000000 m /space glyphshow
72.953125 0.000000 m /numbersign glyphshow
86.359375 0.000000 m /space glyphshow
91.445312 0.000000 m /parenleft glyphshow
97.687500 0.000000 m /N glyphshow
109.656250 0.000000 m /o glyphshow
119.445312 0.000000 m /r glyphshow
126.023438 0.000000 m /m glyphshow
141.609375 0.000000 m /a glyphshow
151.414062 0.000000 m /l glyphshow
155.859375 0.000000 m /i glyphshow
160.304688 0.000000 m /z glyphshow
168.703125 0.000000 m /e glyphshow
178.546875 0.000000 m /d glyphshow
188.703125 0.000000 m /parenright glyphshow
grestore
gsave
/o {
gsave
newpath
translate
0.5 setlinewidth
1 setlinejoin
0 setlinecap
0 0 m
4 0 l

gsave
0.000 setgray
fill
grestore
stroke
grestore
} bind def
68.0175 58.68 o
grestore
gsave
/o {
gsave
newpath
translate
0.5 setlinewidth
1 setlinejoin
0 setlinecap
0 0 m
-4 0 l

gsave
0.000 setgray
fill
grestore
stroke
grestore
} bind def
471.476 58.68 o
grestore
gsave
38.548750 52.601875 translate
0.000000 rotate
0.000000 0.000000 m /zero glyphshow
10.179688 0.000000 m /period glyphshow
15.265625 0.000000 m /zero glyphshow
grestore
gsave
/o {
gsave
newpath
translate
0.5 setlinewidth
1 setlinejoin
0 setlinecap
0 0 m
4 0 l

gsave
0.000 setgray
fill
grestore
stroke
grestore
} bind def
68.0175 110.155 o
grestore
gsave
/o {
gsave
newpath
translate
0.5 setlinewidth
1 setlinejoin
0 setlinecap
0 0 m
-4 0 l

gsave
0.000 setgray
fill
grestore
stroke
grestore
} bind def
471.476 110.155 o
grestore
gsave
38.548750 104.076542 translate
0.000000 rotate
0.000000 0.000000 m /zero glyphshow
10.179688 0.000000 m /period glyphshow
15.265625 0.000000 m /two glyphshow
grestore
gsave
/o {
gsave
newpath
translate
0.5 setlinewidth
1 setlinejoin
0 setlinecap
0 0 m
4 0 l

gsave
0.000 setgray
fill
grestore
stroke
grestore
} bind def
68.0175 161.629 o
grestore
gsave
/o {
gsave
newpath
translate
0.5 setlinewidth
1 setlinejoin
0 setlinecap
0 0 m
-4 0 l

gsave
0.000 setgray
fill
grestore
stroke
grestore
} bind def
471.476 161.629 o
grestore
gsave
38.548750 155.551208 translate
0.000000 rotate
0.000000 0.000000 m /zero glyphshow
10.179688 0.000000 m /period glyphshow
15.265625 0.000000 m /four glyphshow
grestore
gsave
/o {
gsave
newpath
translate
0.5 setlinewidth
1 setlinejoin
0 setlinecap
0 0 m
4 0 l

gsave
0.000 setgray
fill
grestore
stroke
grestore
} bind def
68.0175 213.104 o
grestore
gsave
/o {
gsave
newpath
translate
0.5 setlinewidth
1 setlinejoin
0 setlinecap
0 0 m
-4 0 l

gsave
0.000 setgray
fill
grestore
stroke
grestore
} bind def
471.476 213.104 o
grestore
gsave
38.548750 207.025875 translate
0.000000 rotate
0.000000 0.000000 m /zero glyphshow
10.179688 0.000000 m /period glyphshow
15.265625 0.000000 m /six glyphshow
grestore
gsave
/o {
gsave
newpath
translate
0.5 setlinewidth
1 setlinejoin
0 setlinecap
0 0 m
4 0 l

gsave
0.000 setgray
fill
grestore
stroke
grestore
} bind def
68.0175 264.579 o
grestore
gsave
/o {
gsave
newpath
translate
0.5 setlinewidth
1 setlinejoin
0 setlinecap
0 0 m
-4 0 l

gsave
0.000 setgray
fill
grestore
stroke
grestore
} bind def
471.476 264.579 o
grestore
gsave
38.548750 258.500542 translate
0.000000 rotate
0.000000 0.000000 m /zero glyphshow
10.179688 0.000000 m /period glyphshow
15.265625 0.000000 m /eight glyphshow
grestore
gsave
/o {
gsave
newpath
translate
0.5 setlinewidth
1 setlinejoin
0 setlinecap
0 0 m
4 0 l

gsave
0.000 setgray
fill
grestore
stroke
grestore
} bind def
68.0175 316.053 o
grestore
gsave
/o {
gsave
newpath
translate
0.5 setlinewidth
1 setlinejoin
0 setlinecap
0 0 m
-4 0 l

gsave
0.000 setgray
fill
grestore
stroke
grestore
} bind def
471.476 316.053 o
grestore
gsave
38.548750 309.975208 translate
0.000000 rotate
0.000000 0.000000 m /one glyphshow
10.179688 0.000000 m /period glyphshow
15.265625 0.000000 m /zero glyphshow
grestore
gsave
/o {
gsave
newpath
translate
0.5 setlinewidth
1 setlinejoin
0 setlinecap
0 0 m
4 0 l

gsave
0.000 setgray
fill
grestore
stroke
grestore
} bind def
68.0175 367.528 o
grestore
gsave
/o {
gsave
newpath
translate
0.5 setlinewidth
1 setlinejoin
0 setlinecap
0 0 m
-4 0 l

gsave
0.000 setgray
fill
grestore
stroke
grestore
} bind def
471.476 367.528 o
grestore
gsave
38.548750 361.449875 translate
0.000000 rotate
0.000000 0.000000 m /one glyphshow
10.179688 0.000000 m /period glyphshow
15.265625 0.000000 m /two glyphshow
grestore
gsave
30.220625 122.947750 translate
90.000000 rotate
0.000000 0.000000 m /N glyphshow
11.968750 0.000000 m /o glyphshow
21.757812 0.000000 m /r glyphshow
28.335938 0.000000 m /m glyphshow
43.921875 0.000000 m /a glyphshow
53.726562 0.000000 m /l glyphshow
58.171875 0.000000 m /i glyphshow
62.617188 0.000000 m /z glyphshow
71.015625 0.000000 m /e glyphshow
80.859375 0.000000 m /d glyphshow
91.015625 0.000000 m /space glyphshow
96.101562 0.000000 m /F glyphshow
105.289062 0.000000 m /r glyphshow
111.867188 0.000000 m /e glyphshow
121.710938 0.000000 m /q glyphshow
131.867188 0.000000 m /u glyphshow
142.007812 0.000000 m /e glyphshow
151.851562 0.000000 m /n glyphshow
161.992188 0.000000 m /c glyphshow
170.789062 0.000000 m /y glyphshow
grestore
/DejaVuSans findfont
19.200 scalefont
setfont
gsave
89.301563 399.983085 translate
0.000000 rotate
0.000000 0.000000 m /H glyphshow
14.475098 0.000000 m /A glyphshow
27.643677 0.000000 m /C glyphshow
41.084839 0.000000 m /C glyphshow
54.526001 0.000000 m /space glyphshow
60.645020 0.000000 m /I glyphshow
66.322266 0.000000 m /t glyphshow
73.869995 0.000000 m /e glyphshow
85.713257 0.000000 m /r glyphshow
93.627563 0.000000 m /a glyphshow
105.423828 0.000000 m /t glyphshow
112.971558 0.000000 m /i glyphshow
118.319824 0.000000 m /o glyphshow
130.097290 0.000000 m /n glyphshow
142.297729 0.000000 m /space glyphshow
148.416748 0.000000 m /L glyphshow
159.141479 0.000000 m /o glyphshow
170.918945 0.000000 m /o glyphshow
182.696411 0.000000 m /p glyphshow
194.915649 0.000000 m /space glyphshow
201.034668 0.000000 m /M glyphshow
217.643433 0.000000 m /e glyphshow
229.486694 0.000000 m /a glyphshow
241.282959 0.000000 m /n glyphshow
253.483398 0.000000 m /space glyphshow
259.602417 0.000000 m /F glyphshow
270.659302 0.000000 m /r glyphshow
278.573608 0.000000 m /e glyphshow
290.416870 0.000000 m /q glyphshow
302.636108 0.000000 m /u glyphshow
314.836548 0.000000 m /e glyphshow
326.679810 0.000000 m /n glyphshow
338.880249 0.000000 m /c glyphshow
349.463989 0.000000 m /y glyphshow
grestore
gsave
139.004688 378.704960 translate
0.000000 rotate
0.000000 0.000000 m /at glyphshow
19.250000 0.000000 m /space glyphshow
25.369019 0.000000 m /one glyphshow
37.616455 0.000000 m /three glyphshow
49.863892 0.000000 m /five glyphshow
62.111328 0.000000 m /space glyphshow
68.230347 0.000000 m /W glyphshow
87.264160 0.000000 m /space glyphshow
93.383179 0.000000 m /hyphen glyphshow
100.329346 0.000000 m /space glyphshow
106.448364 0.000000 m /K glyphshow
119.071777 0.000000 m /n glyphshow
131.272217 0.000000 m /i glyphshow
136.620483 0.000000 m /g glyphshow
148.839722 0.000000 m /h glyphshow
161.040161 0.000000 m /t glyphshow
168.587891 0.000000 m /s glyphshow
178.617065 0.000000 m /space glyphshow
184.736084 0.000000 m /L glyphshow
195.460815 0.000000 m /a glyphshow
207.257080 0.000000 m /n glyphshow
219.457520 0.000000 m /d glyphshow
231.676758 0.000000 m /i glyphshow
237.025024 0.000000 m /n glyphshow
249.225464 0.000000 m /g glyphshow
grestore
3.000 setlinewidth
2 setlinecap
gsave
403.5 308.8 68.02 58.68 clipbox
68.0175 224.374187 m
72.092841 218.922682 l
76.168182 219.103876 l
80.243523 264.390371 l
84.318864 269.441608 l
88.394205 266.436761 l
92.469545 275.457985 l
96.544886 277.086156 l
100.620227 277.248942 l
104.695568 283.377465 l
108.770909 283.542198 l
112.84625 282.560343 l
116.921591 283.649283 l
120.996932 283.169693 l
125.072273 284.415266 l
129.147614 283.228552 l
133.222955 282.349006 l
137.298295 281.757354 l
141.373636 280.102248 l
145.448977 286.129513 l
149.524318 286.847034 l
153.599659 287.216843 l
157.675 285.118563 l
161.750341 284.095928 l
165.825682 288.46058 l
169.901023 286.021157 l
173.976364 284.060428 l
178.051705 281.305873 l
182.127045 283.988831 l
186.202386 283.459774 l
190.277727 283.921166 l
194.353068 286.769823 l
198.428409 287.093456 l
202.50375 283.928093 l
206.579091 289.325326 l
210.654432 289.268538 l
214.729773 288.077923 l
218.805114 287.409317 l
222.880455 288.375977 l
226.955795 288.081186 l
231.031136 287.426011 l
235.106477 290.207599 l
239.181818 287.509751 l
243.257159 287.523862 l
247.3325 287.687811 l
251.407841 286.688363 l
255.483182 286.633618 l
259.558523 287.633113 l
263.633864 284.582925 l
267.709205 286.64898 l
271.784545 284.846583 l
275.859886 281.376647 l
279.935227 284.141577 l
284.010568 284.391277 l
288.085909 286.893665 l
292.16125 286.813398 l
296.236591 286.744997 l
300.311932 286.796608 l
304.387273 283.664462 l
308.462614 288.506365 l
312.537955 285.980163 l
316.613295 288.480784 l
320.688636 288.413114 l
324.763977 287.684943 l
328.839318 287.920247 l
332.914659 287.446832 l
336.99 284.87625 l
341.065341 288.331694 l
345.140682 288.111666 l
349.216023 286.315483 l
353.291364 286.237376 l
357.366705 286.263655 l
361.442045 288.795404 l
365.517386 290.763626 l
369.592727 291.993342 l
373.668068 289.360133 l
377.743409 290.955508 l
381.81875 291.402679 l
385.894091 289.674266 l
389.969432 289.910787 l
394.044773 289.308737 l
398.120114 287.501879 l
402.195455 288.716717 l
406.270795 292.376811 l
410.346136 289.683872 l
414.421477 289.51807 l
418.496818 289.357879 l
422.572159 285.700322 l
426.6475 286.686325 l
430.722841 293.262681 l
434.798182 286.444298 l
438.873523 286.134926 l
442.948864 286.186014 l
447.024205 287.971273 l
451.099545 288.280842 l
455.174886 288.21966 l
459.250227 286.300234 l
463.325568 288.700214 l
467.400909 287.828027 l
471.47625 290.707057 l
stroke
grestore
1.000 setlinewidth
1.000 0.000 0.000 setrgbcolor
gsave
403.5 308.8 68.02 58.68 clipbox
68.0175 224.374187 m
72.092841 218.922682 l
76.168182 219.103876 l
80.243523 264.390371 l
84.318864 269.441608 l
88.394205 266.436761 l
92.469545 275.457985 l
96.544886 277.086156 l
100.620227 277.248942 l
104.695568 283.377465 l
108.770909 283.542198 l
112.84625 282.560343 l
116.921591 283.649283 l
120.996932 283.169693 l
125.072273 284.415266 l
129.147614 283.228552 l
133.222955 282.349006 l
137.298295 281.757354 l
141.373636 280.102248 l
145.448977 286.129513 l
149.524318 286.847034 l
153.599659 287.216843 l
157.675 285.118563 l
161.750341 284.095928 l
165.825682 288.46058 l
169.901023 286.021157 l
173.976364 284.060428 l
178.051705 281.305873 l
182.127045 283.988831 l
186.202386 283.459774 l
190.277727 283.921166 l
194.353068 286.769823 l
198.428409 287.093456 l
202.50375 283.928093 l
206.579091 289.325326 l
210.654432 289.268538 l
214.729773 288.077923 l
218.805114 287.409317 l
222.880455 288.375977 l
226.955795 288.081186 l
231.031136 287.426011 l
235.106477 290.207599 l
239.181818 287.509751 l
243.257159 287.523862 l
247.3325 287.687811 l
251.407841 286.688363 l
255.483182 286.633618 l
259.558523 287.633113 l
263.633864 284.582925 l
267.709205 286.64898 l
271.784545 284.846583 l
275.859886 281.376647 l
279.935227 284.141577 l
284.010568 284.391277 l
288.085909 286.893665 l
292.16125 286.813398 l
296.236591 286.744997 l
300.311932 286.796608 l
304.387273 283.664462 l
308.462614 288.506365 l
312.537955 285.980163 l
316.613295 288.480784 l
320.688636 288.413114 l
324.763977 287.684943 l
328.839318 287.920247 l
332.914659 287.446832 l
336.99 284.87625 l
341.065341 288.331694 l
345.140682 288.111666 l
349.216023 286.315483 l
353.291364 286.237376 l
357.366705 286.263655 l
361.442045 288.795404 l
365.517386 290.763626 l
369.592727 291.993342 l
373.668068 289.360133 l
377.743409 290.955508 l
381.81875 291.402679 l
385.894091 289.674266 l
389.969432 289.910787 l
394.044773 289.308737 l
398.120114 287.501879 l
402.195455 288.716717 l
406.270795 292.376811 l
410.346136 289.683872 l
414.421477 289.51807 l
418.496818 289.357879 l
422.572159 285.700322 l
426.6475 286.686325 l
430.722841 293.262681 l
434.798182 286.444298 l
438.873523 286.134926 l
442.948864 286.186014 l
447.024205 287.971273 l
451.099545 288.280842 l
455.174886 288.21966 l
459.250227 286.300234 l
463.325568 288.700214 l
467.400909 287.828027 l
471.47625 290.707057 l
stroke
grestore
0 setlinejoin
0 setlinecap
[] 0 setdash
0.300 setgray
gsave
126.93125 62.68 m
416.5625 62.68 l
418.1625 62.68 418.9625 63.48 418.9625 65.08 c
418.9625 121.78 l
418.9625 123.38 418.1625 124.18 416.5625 124.18 c
126.93125 124.18 l
125.33125 124.18 124.53125 123.38 124.53125 121.78 c
124.53125 65.08 l
124.53125 63.48 125.33125 62.68 126.93125 62.68 c
cl
gsave
fill
grestore
stroke
grestore
0.000 setgray
gsave
124.93125 64.68 m
414.5625 64.68 l
416.1625 64.68 416.9625 65.48 416.9625 67.08 c
416.9625 123.78 l
416.9625 125.38 416.1625 126.18 414.5625 126.18 c
124.93125 126.18 l
123.33125 126.18 122.53125 125.38 122.53125 123.78 c
122.53125 67.08 l
122.53125 65.48 123.33125 64.68 124.93125 64.68 c
cl
gsave
1.000 setgray
fill
grestore
stroke
grestore
2.000 setlinewidth
1 setlinejoin
2 setlinecap
[] 0 setdash
0.050 0.030 0.528 setrgbcolor
gsave
130.93125 116.455 m
147.73125 116.455 l
stroke
grestore
0.000 setgray
/DejaVuSans findfont
12.000 scalefont
setfont
gsave
160.931250 112.255000 translate
0.000000 rotate
0.000000 0.000000 m /N glyphshow
8.976562 0.000000 m /o glyphshow
16.318359 0.000000 m /d glyphshow
23.935547 0.000000 m /e glyphshow
31.318359 0.000000 m /space glyphshow
35.132812 0.000000 m /one glyphshow
grestore
0.228 0.016 0.605 setrgbcolor
gsave
130.93125 103.03 m
147.73125 103.03 l
stroke
grestore
0.000 setgray
gsave
160.931250 98.830000 translate
0.000000 rotate
0.000000 0.000000 m /N glyphshow
8.976562 0.000000 m /o glyphshow
16.318359 0.000000 m /d glyphshow
23.935547 0.000000 m /e glyphshow
31.318359 0.000000 m /space glyphshow
35.132812 0.000000 m /two glyphshow
grestore
0.363 0.003 0.649 setrgbcolor
gsave
130.93125 89.605 m
147.73125 89.605 l
stroke
grestore
0.000 setgray
gsave
160.931250 85.405000 translate
0.000000 rotate
0.000000 0.000000 m /N glyphshow
8.976562 0.000000 m /o glyphshow
16.318359 0.000000 m /d glyphshow
23.935547 0.000000 m /e glyphshow
31.318359 0.000000 m /space glyphshow
35.132812 0.000000 m /three glyphshow
grestore
0.495 0.012 0.658 setrgbcolor
gsave
130.93125 76.18 m
147.73125 76.18 l
stroke
grestore
0.000 setgray
gsave
160.931250 71.980000 translate
0.000000 rotate
0.000000 0.000000 m /N glyphshow
8.976562 0.000000 m /o glyphshow
16.318359 0.000000 m /d glyphshow
23.935547 0.000000 m /e glyphshow
31.318359 0.000000 m /space glyphshow
35.132812 0.000000 m /four glyphshow
grestore
0.611 0.090 0.620 setrgbcolor
gsave
231.328125 116.455 m
248.128125 116.455 l
stroke
grestore
0.000 setgray
gsave
261.328125 112.255000 translate
0.000000 rotate
0.000000 0.000000 m /N glyphshow
8.976562 0.000000 m /o glyphshow
16.318359 0.000000 m /d glyphshow
23.935547 0.000000 m /e glyphshow
31.318359 0.000000 m /space glyphshow
35.132812 0.000000 m /five glyphshow
grestore
0.711 0.183 0.550 setrgbcolor
gsave
231.328125 103.03 m
248.128125 103.03 l
stroke
grestore
0.000 setgray
gsave
261.328125 98.830000 translate
0.000000 rotate
0.000000 0.000000 m /N glyphshow
8.976562 0.000000 m /o glyphshow
16.318359 0.000000 m /d glyphshow
23.935547 0.000000 m /e glyphshow
31.318359 0.000000 m /space glyphshow
35.132812 0.000000 m /six glyphshow
grestore
0.798 0.280 0.470 setrgbcolor
gsave
231.328125 89.605 m
248.128125 89.605 l
stroke
grestore
0.000 setgray
gsave
261.328125 85.405000 translate
0.000000 rotate
0.000000 0.000000 m /N glyphshow
8.976562 0.000000 m /o glyphshow
16.318359 0.000000 m /d glyphshow
23.935547 0.000000 m /e glyphshow
31.318359 0.000000 m /space glyphshow
35.132812 0.000000 m /seven glyphshow
grestore
3.000 setlinewidth
gsave
231.328125 76.18 m
248.128125 76.18 l
stroke
grestore
2.000 setlinewidth
1.000 0.000 0.000 setrgbcolor
gsave
231.328125 76.18 m
248.128125 76.18 l
stroke
grestore
0.000 setgray
gsave
261.328125 71.980000 translate
0.000000 rotate
0.000000 0.000000 m /N glyphshow
8.976562 0.000000 m /o glyphshow
16.318359 0.000000 m /d glyphshow
23.935547 0.000000 m /e glyphshow
31.318359 0.000000 m /space glyphshow
35.132812 0.000000 m /eight glyphshow
grestore
0.869 0.374 0.397 setrgbcolor
gsave
331.725 116.455 m
348.525 116.455 l
stroke
grestore
0.000 setgray
gsave
361.725000 112.255000 translate
0.000000 rotate
0.000000 0.000000 m /N glyphshow
8.976562 0.000000 m /o glyphshow
16.318359 0.000000 m /d glyphshow
23.935547 0.000000 m /e glyphshow
31.318359 0.000000 m /space glyphshow
35.132812 0.000000 m /nine glyphshow
grestore
0.928 0.473 0.326 setrgbcolor
gsave
331.725 103.03 m
348.525 103.03 l
stroke
grestore
0.000 setgray
gsave
361.725000 98.830000 translate
0.000000 rotate
0.000000 0.000000 m /N glyphshow
8.976562 0.000000 m /o glyphshow
16.318359 0.000000 m /d glyphshow
23.935547 0.000000 m /e glyphshow
31.318359 0.000000 m /space glyphshow
35.132812 0.000000 m /one glyphshow
42.767578 0.000000 m /zero glyphshow
grestore
0.973 0.586 0.252 setrgbcolor
gsave
331.725 89.605 m
348.525 89.605 l
stroke
grestore
0.000 setgray
gsave
361.725000 85.405000 translate
0.000000 rotate
0.000000 0.000000 m /N glyphshow
8.976562 0.000000 m /o glyphshow
16.318359 0.000000 m /d glyphshow
23.935547 0.000000 m /e glyphshow
31.318359 0.000000 m /space glyphshow
35.132812 0.000000 m /one glyphshow
42.767578 0.000000 m /one glyphshow
grestore
0.994 0.705 0.183 setrgbcolor
gsave
331.725 76.18 m
348.525 76.18 l
stroke
grestore
0.000 setgray
gsave
361.725000 71.980000 translate
0.000000 rotate
0.000000 0.000000 m /N glyphshow
8.976562 0.000000 m /o glyphshow
16.318359 0.000000 m /d glyphshow
23.935547 0.000000 m /e glyphshow
31.318359 0.000000 m /space glyphshow
35.132812 0.000000 m /one glyphshow
42.767578 0.000000 m /two glyphshow
grestore

end
showpage
