%!PS-Adobe-3.0 EPSF-3.0
%%Title: figures/minife-12-node-new-governor/minife_runtime_comparison_mean.eps
%%Creator: matplotlib version 2.0.0, http://matplotlib.org/
%%CreationDate: Tue Mar 21 13:48:15 2017
%%Orientation: portrait
%%BoundingBox: 79 223 532 568
%%EndComments
%%BeginProlog
/mpldict 8 dict def
mpldict begin
/m { moveto } bind def
/l { lineto } bind def
/r { rlineto } bind def
/c { curveto } bind def
/cl { closepath } bind def
/box {
m
1 index 0 r
0 exch r
neg 0 r
cl
} bind def
/clipbox {
box
clip
newpath
} bind def
%!PS-Adobe-3.0 Resource-Font
%%Title: DejaVu Sans
%%Copyright: Copyright (c) 2003 by Bitstream, Inc. All Rights Reserved. Copyright (c) 2006 by Tavmjong Bah. All Rights Reserved. DejaVu changes are in public domain 
%%Creator: Converted from TrueType to type 3 by PPR
25 dict begin
/_d{bind def}bind def
/_m{moveto}_d
/_l{lineto}_d
/_cl{closepath eofill}_d
/_c{curveto}_d
/_sc{7 -1 roll{setcachedevice}{pop pop pop pop pop pop}ifelse}_d
/_e{exec}_d
/FontName /DejaVuSans def
/PaintType 0 def
/FontMatrix[.001 0 0 .001 0 0]def
/FontBBox[-1021 -463 1793 1232]def
/FontType 3 def
/Encoding [ /space /parenleft /parenright /plus /hyphen /period /zero /one /two /four /five /six /seven /eight /nine /A /B /C /D /K /L /M /N /P /R /S /W /a /c /d /e /f /g /h /i /k /l /m /n /o /p /r /s /t /u /w /z ] def
/FontInfo 10 dict dup begin
/FamilyName (DejaVu Sans) def
/FullName (DejaVu Sans) def
/Notice (Copyright (c) 2003 by Bitstream, Inc. All Rights Reserved. Copyright (c) 2006 by Tavmjong Bah. All Rights Reserved. DejaVu changes are in public domain ) def
/Weight (Book) def
/Version (Version 2.35) def
/ItalicAngle 0.0 def
/isFixedPitch false def
/UnderlinePosition -130 def
/UnderlineThickness 90 def
end readonly def
/CharStrings 47 dict dup begin
/space{318 0 0 0 0 0 _sc
}_d
/parenleft{390 0 86 -131 310 759 _sc
310 759 _m
266 683 234 609 213 536 _c
191 463 181 389 181 314 _c
181 238 191 164 213 91 _c
234 17 266 -56 310 -131 _c
232 -131 _l
183 -54 146 20 122 94 _c
98 168 86 241 86 314 _c
86 386 98 459 122 533 _c
146 607 182 682 232 759 _c
310 759 _l
_cl}_d
/parenright{390 0 80 -131 304 759 _sc
80 759 _m
158 759 _l
206 682 243 607 267 533 _c
291 459 304 386 304 314 _c
304 241 291 168 267 94 _c
243 20 206 -54 158 -131 _c
80 -131 _l
123 -56 155 17 177 91 _c
198 164 209 238 209 314 _c
209 389 198 463 177 536 _c
155 609 123 683 80 759 _c
_cl}_d
/plus{838 0 106 0 732 627 _sc
460 627 _m
460 355 _l
732 355 _l
732 272 _l
460 272 _l
460 0 _l
378 0 _l
378 272 _l
106 272 _l
106 355 _l
378 355 _l
378 627 _l
460 627 _l
_cl}_d
/hyphen{361 0 49 234 312 314 _sc
49 314 _m
312 314 _l
312 234 _l
49 234 _l
49 314 _l
_cl}_d
/period{318 0 107 0 210 124 _sc
107 124 _m
210 124 _l
210 0 _l
107 0 _l
107 124 _l
_cl}_d
/zero{636 0 66 -13 570 742 _sc
318 664 _m
267 664 229 639 203 589 _c
177 539 165 464 165 364 _c
165 264 177 189 203 139 _c
229 89 267 64 318 64 _c
369 64 407 89 433 139 _c
458 189 471 264 471 364 _c
471 464 458 539 433 589 _c
407 639 369 664 318 664 _c
318 742 _m
399 742 461 709 505 645 _c
548 580 570 486 570 364 _c
570 241 548 147 505 83 _c
461 19 399 -13 318 -13 _c
236 -13 173 19 130 83 _c
87 147 66 241 66 364 _c
66 486 87 580 130 645 _c
173 709 236 742 318 742 _c
_cl}_d
/one{636 0 110 0 544 729 _sc
124 83 _m
285 83 _l
285 639 _l
110 604 _l
110 694 _l
284 729 _l
383 729 _l
383 83 _l
544 83 _l
544 0 _l
124 0 _l
124 83 _l
_cl}_d
/two{{636 0 73 0 536 742 _sc
192 83 _m
536 83 _l
536 0 _l
73 0 _l
73 83 _l
110 121 161 173 226 239 _c
290 304 331 346 348 365 _c
380 400 402 430 414 455 _c
426 479 433 504 433 528 _c
433 566 419 598 392 622 _c
365 646 330 659 286 659 _c
255 659 222 653 188 643 _c
154 632 117 616 78 594 _c
78 694 _l
118 710 155 722 189 730 _c
223 738 255 742 284 742 _c
}_e{359 742 419 723 464 685 _c
509 647 532 597 532 534 _c
532 504 526 475 515 449 _c
504 422 484 390 454 354 _c
446 344 420 317 376 272 _c
332 227 271 164 192 83 _c
_cl}_e}_d
/four{636 0 49 0 580 729 _sc
378 643 _m
129 254 _l
378 254 _l
378 643 _l
352 729 _m
476 729 _l
476 254 _l
580 254 _l
580 172 _l
476 172 _l
476 0 _l
378 0 _l
378 172 _l
49 172 _l
49 267 _l
352 729 _l
_cl}_d
/five{{636 0 77 -13 549 729 _sc
108 729 _m
495 729 _l
495 646 _l
198 646 _l
198 467 _l
212 472 227 476 241 478 _c
255 480 270 482 284 482 _c
365 482 429 459 477 415 _c
525 370 549 310 549 234 _c
549 155 524 94 475 51 _c
426 8 357 -13 269 -13 _c
238 -13 207 -10 175 -6 _c
143 -1 111 6 77 17 _c
77 116 _l
106 100 136 88 168 80 _c
199 72 232 69 267 69 _c
}_e{323 69 368 83 401 113 _c
433 143 450 183 450 234 _c
450 284 433 324 401 354 _c
368 384 323 399 267 399 _c
241 399 214 396 188 390 _c
162 384 135 375 108 363 _c
108 729 _l
_cl}_e}_d
/six{{636 0 70 -13 573 742 _sc
330 404 _m
286 404 251 388 225 358 _c
199 328 186 286 186 234 _c
186 181 199 139 225 109 _c
251 79 286 64 330 64 _c
374 64 409 79 435 109 _c
461 139 474 181 474 234 _c
474 286 461 328 435 358 _c
409 388 374 404 330 404 _c
526 713 _m
526 623 _l
501 635 476 644 451 650 _c
425 656 400 659 376 659 _c
310 659 260 637 226 593 _c
}_e{192 549 172 482 168 394 _c
187 422 211 444 240 459 _c
269 474 301 482 336 482 _c
409 482 467 459 509 415 _c
551 371 573 310 573 234 _c
573 159 550 99 506 54 _c
462 9 403 -13 330 -13 _c
246 -13 181 19 137 83 _c
92 147 70 241 70 364 _c
70 479 97 571 152 639 _c
206 707 280 742 372 742 _c
396 742 421 739 447 735 _c
472 730 498 723 526 713 _c
_cl}_e}_d
/seven{636 0 82 0 551 729 _sc
82 729 _m
551 729 _l
551 687 _l
286 0 _l
183 0 _l
432 646 _l
82 646 _l
82 729 _l
_cl}_d
/eight{{636 0 68 -13 568 742 _sc
318 346 _m
271 346 234 333 207 308 _c
180 283 167 249 167 205 _c
167 161 180 126 207 101 _c
234 76 271 64 318 64 _c
364 64 401 76 428 102 _c
455 127 469 161 469 205 _c
469 249 455 283 429 308 _c
402 333 365 346 318 346 _c
219 388 _m
177 398 144 418 120 447 _c
96 476 85 511 85 553 _c
85 611 105 657 147 691 _c
188 725 245 742 318 742 _c
}_e{390 742 447 725 489 691 _c
530 657 551 611 551 553 _c
551 511 539 476 515 447 _c
491 418 459 398 417 388 _c
464 377 501 355 528 323 _c
554 291 568 251 568 205 _c
568 134 546 80 503 43 _c
459 5 398 -13 318 -13 _c
237 -13 175 5 132 43 _c
89 80 68 134 68 205 _c
68 251 81 291 108 323 _c
134 355 171 377 219 388 _c
183 544 _m
183 506 194 476 218 455 _c
}_e{242 434 275 424 318 424 _c
360 424 393 434 417 455 _c
441 476 453 506 453 544 _c
453 582 441 611 417 632 _c
393 653 360 664 318 664 _c
275 664 242 653 218 632 _c
194 611 183 582 183 544 _c
_cl}_e}_d
/nine{{636 0 63 -13 566 742 _sc
110 15 _m
110 105 _l
134 93 159 84 185 78 _c
210 72 235 69 260 69 _c
324 69 374 90 408 134 _c
442 178 462 244 468 334 _c
448 306 424 284 396 269 _c
367 254 335 247 300 247 _c
226 247 168 269 126 313 _c
84 357 63 417 63 494 _c
63 568 85 628 129 674 _c
173 719 232 742 306 742 _c
390 742 455 709 499 645 _c
543 580 566 486 566 364 _c
}_e{566 248 538 157 484 89 _c
429 21 356 -13 264 -13 _c
239 -13 214 -10 189 -6 _c
163 -2 137 5 110 15 _c
306 324 _m
350 324 385 339 411 369 _c
437 399 450 441 450 494 _c
450 546 437 588 411 618 _c
385 648 350 664 306 664 _c
262 664 227 648 201 618 _c
175 588 162 546 162 494 _c
162 441 175 399 201 369 _c
227 339 262 324 306 324 _c
_cl}_e}_d
/A{684 0 8 0 676 729 _sc
342 632 _m
208 269 _l
476 269 _l
342 632 _l
286 729 _m
398 729 _l
676 0 _l
573 0 _l
507 187 _l
178 187 _l
112 0 _l
8 0 _l
286 729 _l
_cl}_d
/B{{686 0 98 0 615 729 _sc
197 348 _m
197 81 _l
355 81 _l
408 81 447 92 473 114 _c
498 136 511 169 511 215 _c
511 260 498 293 473 315 _c
447 337 408 348 355 348 _c
197 348 _l
197 648 _m
197 428 _l
343 428 _l
391 428 426 437 450 455 _c
474 473 486 500 486 538 _c
486 574 474 602 450 620 _c
426 638 391 648 343 648 _c
197 648 _l
98 729 _m
350 729 _l
}_e{425 729 483 713 524 682 _c
564 650 585 606 585 549 _c
585 504 574 468 553 442 _c
532 416 502 399 462 393 _c
510 382 548 360 575 327 _c
601 294 615 253 615 204 _c
615 138 592 88 548 53 _c
504 17 441 0 360 0 _c
98 0 _l
98 729 _l
_cl}_e}_d
/C{{698 0 56 -13 644 742 _sc
644 673 _m
644 569 _l
610 599 575 622 537 638 _c
499 653 460 661 418 661 _c
334 661 270 635 226 584 _c
182 533 160 460 160 364 _c
160 268 182 194 226 143 _c
270 92 334 67 418 67 _c
460 67 499 74 537 90 _c
575 105 610 128 644 159 _c
644 56 _l
609 32 572 15 534 4 _c
496 -7 455 -13 412 -13 _c
302 -13 215 20 151 87 _c
}_e{87 154 56 246 56 364 _c
56 481 87 573 151 641 _c
215 708 302 742 412 742 _c
456 742 497 736 535 725 _c
573 713 610 696 644 673 _c
_cl}_e}_d
/D{770 0 98 0 711 729 _sc
197 648 _m
197 81 _l
316 81 _l
416 81 490 103 537 149 _c
583 195 607 267 607 365 _c
607 463 583 534 537 580 _c
490 625 416 648 316 648 _c
197 648 _l
98 729 _m
301 729 _l
442 729 546 699 612 641 _c
678 582 711 490 711 365 _c
711 239 677 147 611 88 _c
545 29 441 0 301 0 _c
98 0 _l
98 729 _l
_cl}_d
/K{656 0 98 0 677 729 _sc
98 729 _m
197 729 _l
197 421 _l
524 729 _l
651 729 _l
289 389 _l
677 0 _l
547 0 _l
197 351 _l
197 0 _l
98 0 _l
98 729 _l
_cl}_d
/L{557 0 98 0 552 729 _sc
98 729 _m
197 729 _l
197 83 _l
552 83 _l
552 0 _l
98 0 _l
98 729 _l
_cl}_d
/M{863 0 98 0 765 729 _sc
98 729 _m
245 729 _l
431 233 _l
618 729 _l
765 729 _l
765 0 _l
669 0 _l
669 640 _l
481 140 _l
382 140 _l
194 640 _l
194 0 _l
98 0 _l
98 729 _l
_cl}_d
/N{748 0 98 0 650 729 _sc
98 729 _m
231 729 _l
554 119 _l
554 729 _l
650 729 _l
650 0 _l
517 0 _l
194 610 _l
194 0 _l
98 0 _l
98 729 _l
_cl}_d
/P{603 0 98 0 569 729 _sc
197 648 _m
197 374 _l
321 374 _l
367 374 402 385 427 409 _c
452 433 465 467 465 511 _c
465 555 452 588 427 612 _c
402 636 367 648 321 648 _c
197 648 _l
98 729 _m
321 729 _l
402 729 464 710 506 673 _c
548 636 569 582 569 511 _c
569 439 548 384 506 348 _c
464 311 402 293 321 293 _c
197 293 _l
197 0 _l
98 0 _l
98 729 _l
_cl}_d
/R{{695 0 98 0 666 729 _sc
444 342 _m
465 334 486 319 506 296 _c
526 272 546 240 566 199 _c
666 0 _l
560 0 _l
467 187 _l
443 235 419 268 397 284 _c
374 300 343 308 304 308 _c
197 308 _l
197 0 _l
98 0 _l
98 729 _l
321 729 _l
404 729 466 711 507 677 _c
548 642 569 589 569 519 _c
569 473 558 434 537 404 _c
515 374 484 353 444 342 _c
197 648 _m
197 389 _l
321 389 _l
}_e{368 389 404 400 428 422 _c
452 444 465 476 465 519 _c
465 561 452 593 428 615 _c
404 637 368 648 321 648 _c
197 648 _l
_cl}_e}_d
/S{{635 0 66 -13 579 742 _sc
535 705 _m
535 609 _l
497 627 462 640 429 649 _c
395 657 363 662 333 662 _c
279 662 237 651 208 631 _c
179 610 165 580 165 542 _c
165 510 174 485 194 469 _c
213 452 250 439 304 429 _c
364 417 _l
437 403 491 378 526 343 _c
561 307 579 260 579 201 _c
579 130 555 77 508 41 _c
460 5 391 -13 300 -13 _c
265 -13 228 -9 189 -2 _c
}_e{150 5 110 16 69 32 _c
69 134 _l
109 111 148 94 186 83 _c
224 71 262 66 300 66 _c
356 66 399 77 430 99 _c
460 121 476 152 476 194 _c
476 230 465 258 443 278 _c
421 298 385 313 335 323 _c
275 335 _l
201 349 148 372 115 404 _c
82 435 66 478 66 534 _c
66 598 88 649 134 686 _c
179 723 242 742 322 742 _c
356 742 390 739 426 733 _c
461 727 497 717 535 705 _c
}_e{_cl}_e}_d
/W{989 0 33 0 956 729 _sc
33 729 _m
133 729 _l
286 113 _l
439 729 _l
550 729 _l
703 113 _l
856 729 _l
956 729 _l
773 0 _l
649 0 _l
495 633 _l
340 0 _l
216 0 _l
33 729 _l
_cl}_d
/a{{613 0 60 -13 522 560 _sc
343 275 _m
270 275 220 266 192 250 _c
164 233 150 205 150 165 _c
150 133 160 107 181 89 _c
202 70 231 61 267 61 _c
317 61 357 78 387 114 _c
417 149 432 196 432 255 _c
432 275 _l
343 275 _l
522 312 _m
522 0 _l
432 0 _l
432 83 _l
411 49 385 25 355 10 _c
325 -5 287 -13 243 -13 _c
187 -13 142 2 109 33 _c
76 64 60 106 60 159 _c
}_e{60 220 80 266 122 298 _c
163 329 224 345 306 345 _c
432 345 _l
432 354 _l
432 395 418 427 391 450 _c
364 472 326 484 277 484 _c
245 484 215 480 185 472 _c
155 464 127 453 100 439 _c
100 522 _l
132 534 164 544 195 550 _c
226 556 256 560 286 560 _c
365 560 424 539 463 498 _c
502 457 522 395 522 312 _c
_cl}_e}_d
/c{{550 0 55 -13 488 560 _sc
488 526 _m
488 442 _l
462 456 437 466 411 473 _c
385 480 360 484 334 484 _c
276 484 230 465 198 428 _c
166 391 150 339 150 273 _c
150 206 166 154 198 117 _c
230 80 276 62 334 62 _c
360 62 385 65 411 72 _c
437 79 462 90 488 104 _c
488 21 _l
462 9 436 0 410 -5 _c
383 -10 354 -13 324 -13 _c
242 -13 176 12 128 64 _c
}_e{79 115 55 185 55 273 _c
55 362 79 432 128 483 _c
177 534 244 560 330 560 _c
358 560 385 557 411 551 _c
437 545 463 537 488 526 _c
_cl}_e}_d
/d{{635 0 55 -13 544 760 _sc
454 464 _m
454 760 _l
544 760 _l
544 0 _l
454 0 _l
454 82 _l
435 49 411 25 382 10 _c
353 -5 319 -13 279 -13 _c
213 -13 159 13 117 65 _c
75 117 55 187 55 273 _c
55 359 75 428 117 481 _c
159 533 213 560 279 560 _c
319 560 353 552 382 536 _c
411 520 435 496 454 464 _c
148 273 _m
148 207 161 155 188 117 _c
215 79 253 61 301 61 _c
}_e{348 61 385 79 413 117 _c
440 155 454 207 454 273 _c
454 339 440 390 413 428 _c
385 466 348 485 301 485 _c
253 485 215 466 188 428 _c
161 390 148 339 148 273 _c
_cl}_e}_d
/e{{615 0 55 -13 562 560 _sc
562 296 _m
562 252 _l
149 252 _l
153 190 171 142 205 110 _c
238 78 284 62 344 62 _c
378 62 412 66 444 74 _c
476 82 509 95 541 113 _c
541 28 _l
509 14 476 3 442 -3 _c
408 -9 373 -13 339 -13 _c
251 -13 182 12 131 62 _c
80 112 55 181 55 268 _c
55 357 79 428 127 481 _c
175 533 241 560 323 560 _c
397 560 455 536 498 489 _c
}_e{540 441 562 377 562 296 _c
472 322 _m
471 371 457 410 431 440 _c
404 469 368 484 324 484 _c
274 484 234 469 204 441 _c
174 413 156 373 152 322 _c
472 322 _l
_cl}_e}_d
/f{352 0 23 0 371 760 _sc
371 760 _m
371 685 _l
285 685 _l
253 685 230 678 218 665 _c
205 652 199 629 199 595 _c
199 547 _l
347 547 _l
347 477 _l
199 477 _l
199 0 _l
109 0 _l
109 477 _l
23 477 _l
23 547 _l
109 547 _l
109 585 _l
109 645 123 690 151 718 _c
179 746 224 760 286 760 _c
371 760 _l
_cl}_d
/g{{635 0 55 -207 544 560 _sc
454 280 _m
454 344 440 395 414 431 _c
387 467 349 485 301 485 _c
253 485 215 467 188 431 _c
161 395 148 344 148 280 _c
148 215 161 165 188 129 _c
215 93 253 75 301 75 _c
349 75 387 93 414 129 _c
440 165 454 215 454 280 _c
544 68 _m
544 -24 523 -93 482 -139 _c
440 -184 377 -207 292 -207 _c
260 -207 231 -204 203 -200 _c
175 -195 147 -188 121 -178 _c
}_e{121 -91 _l
147 -105 173 -115 199 -122 _c
225 -129 251 -133 278 -133 _c
336 -133 380 -117 410 -87 _c
439 -56 454 -10 454 52 _c
454 96 _l
435 64 411 40 382 24 _c
353 8 319 0 279 0 _c
211 0 157 25 116 76 _c
75 127 55 195 55 280 _c
55 364 75 432 116 483 _c
157 534 211 560 279 560 _c
319 560 353 552 382 536 _c
411 520 435 496 454 464 _c
454 547 _l
544 547 _l
}_e{544 68 _l
_cl}_e}_d
/h{634 0 91 0 549 760 _sc
549 330 _m
549 0 _l
459 0 _l
459 327 _l
459 379 448 417 428 443 _c
408 469 378 482 338 482 _c
289 482 251 466 223 435 _c
195 404 181 362 181 309 _c
181 0 _l
91 0 _l
91 760 _l
181 760 _l
181 462 _l
202 494 227 519 257 535 _c
286 551 320 560 358 560 _c
420 560 468 540 500 501 _c
532 462 549 405 549 330 _c
_cl}_d
/i{278 0 94 0 184 760 _sc
94 547 _m
184 547 _l
184 0 _l
94 0 _l
94 547 _l
94 760 _m
184 760 _l
184 646 _l
94 646 _l
94 760 _l
_cl}_d
/k{579 0 91 0 576 760 _sc
91 760 _m
181 760 _l
181 311 _l
449 547 _l
564 547 _l
274 291 _l
576 0 _l
459 0 _l
181 267 _l
181 0 _l
91 0 _l
91 760 _l
_cl}_d
/l{278 0 94 0 184 760 _sc
94 760 _m
184 760 _l
184 0 _l
94 0 _l
94 760 _l
_cl}_d
/m{{974 0 91 0 889 560 _sc
520 442 _m
542 482 569 511 600 531 _c
631 550 668 560 711 560 _c
767 560 811 540 842 500 _c
873 460 889 403 889 330 _c
889 0 _l
799 0 _l
799 327 _l
799 379 789 418 771 444 _c
752 469 724 482 686 482 _c
639 482 602 466 575 435 _c
548 404 535 362 535 309 _c
535 0 _l
445 0 _l
445 327 _l
445 379 435 418 417 444 _c
398 469 369 482 331 482 _c
}_e{285 482 248 466 221 435 _c
194 404 181 362 181 309 _c
181 0 _l
91 0 _l
91 547 _l
181 547 _l
181 462 _l
201 495 226 520 255 536 _c
283 552 317 560 357 560 _c
397 560 430 550 458 530 _c
486 510 506 480 520 442 _c
_cl}_e}_d
/n{634 0 91 0 549 560 _sc
549 330 _m
549 0 _l
459 0 _l
459 327 _l
459 379 448 417 428 443 _c
408 469 378 482 338 482 _c
289 482 251 466 223 435 _c
195 404 181 362 181 309 _c
181 0 _l
91 0 _l
91 547 _l
181 547 _l
181 462 _l
202 494 227 519 257 535 _c
286 551 320 560 358 560 _c
420 560 468 540 500 501 _c
532 462 549 405 549 330 _c
_cl}_d
/o{612 0 55 -13 557 560 _sc
306 484 _m
258 484 220 465 192 427 _c
164 389 150 338 150 273 _c
150 207 163 156 191 118 _c
219 80 257 62 306 62 _c
354 62 392 80 420 118 _c
448 156 462 207 462 273 _c
462 337 448 389 420 427 _c
392 465 354 484 306 484 _c
306 560 _m
384 560 445 534 490 484 _c
534 433 557 363 557 273 _c
557 183 534 113 490 63 _c
445 12 384 -13 306 -13 _c
227 -13 165 12 121 63 _c
77 113 55 183 55 273 _c
55 363 77 433 121 484 _c
165 534 227 560 306 560 _c
_cl}_d
/p{{635 0 91 -207 580 560 _sc
181 82 _m
181 -207 _l
91 -207 _l
91 547 _l
181 547 _l
181 464 _l
199 496 223 520 252 536 _c
281 552 316 560 356 560 _c
422 560 476 533 518 481 _c
559 428 580 359 580 273 _c
580 187 559 117 518 65 _c
476 13 422 -13 356 -13 _c
316 -13 281 -5 252 10 _c
223 25 199 49 181 82 _c
487 273 _m
487 339 473 390 446 428 _c
418 466 381 485 334 485 _c
}_e{286 485 249 466 222 428 _c
194 390 181 339 181 273 _c
181 207 194 155 222 117 _c
249 79 286 61 334 61 _c
381 61 418 79 446 117 _c
473 155 487 207 487 273 _c
_cl}_e}_d
/r{411 0 91 0 411 560 _sc
411 463 _m
401 469 390 473 378 476 _c
366 478 353 480 339 480 _c
288 480 249 463 222 430 _c
194 397 181 350 181 288 _c
181 0 _l
91 0 _l
91 547 _l
181 547 _l
181 462 _l
199 495 224 520 254 536 _c
284 552 321 560 365 560 _c
371 560 378 559 386 559 _c
393 558 401 557 411 555 _c
411 463 _l
_cl}_d
/s{{521 0 54 -13 472 560 _sc
443 531 _m
443 446 _l
417 458 391 468 364 475 _c
336 481 308 485 279 485 _c
234 485 200 478 178 464 _c
156 450 145 430 145 403 _c
145 382 153 366 169 354 _c
185 342 217 330 265 320 _c
296 313 _l
360 299 405 279 432 255 _c
458 230 472 195 472 151 _c
472 100 452 60 412 31 _c
372 1 316 -13 246 -13 _c
216 -13 186 -10 154 -5 _c
}_e{122 0 89 8 54 20 _c
54 113 _l
87 95 120 82 152 74 _c
184 65 216 61 248 61 _c
290 61 323 68 346 82 _c
368 96 380 117 380 144 _c
380 168 371 187 355 200 _c
339 213 303 226 247 238 _c
216 245 _l
160 257 119 275 95 299 _c
70 323 58 356 58 399 _c
58 450 76 490 112 518 _c
148 546 200 560 268 560 _c
301 560 332 557 362 552 _c
391 547 418 540 443 531 _c
}_e{_cl}_e}_d
/t{392 0 27 0 368 702 _sc
183 702 _m
183 547 _l
368 547 _l
368 477 _l
183 477 _l
183 180 _l
183 135 189 106 201 94 _c
213 81 238 75 276 75 _c
368 75 _l
368 0 _l
276 0 _l
206 0 158 13 132 39 _c
106 65 93 112 93 180 _c
93 477 _l
27 477 _l
27 547 _l
93 547 _l
93 702 _l
183 702 _l
_cl}_d
/u{634 0 85 -13 543 560 _sc
85 216 _m
85 547 _l
175 547 _l
175 219 _l
175 167 185 129 205 103 _c
225 77 255 64 296 64 _c
344 64 383 79 411 110 _c
439 141 453 183 453 237 _c
453 547 _l
543 547 _l
543 0 _l
453 0 _l
453 84 _l
431 50 405 26 377 10 _c
348 -5 315 -13 277 -13 _c
214 -13 166 6 134 45 _c
101 83 85 140 85 216 _c
311 560 _m
311 560 _l
_cl}_d
/w{818 0 42 0 776 547 _sc
42 547 _m
132 547 _l
244 120 _l
356 547 _l
462 547 _l
574 120 _l
686 547 _l
776 547 _l
633 0 _l
527 0 _l
409 448 _l
291 0 _l
185 0 _l
42 547 _l
_cl}_d
/z{525 0 43 0 482 547 _sc
55 547 _m
482 547 _l
482 465 _l
144 72 _l
482 72 _l
482 0 _l
43 0 _l
43 82 _l
381 475 _l
55 475 _l
55 547 _l
_cl}_d
end readonly def

/BuildGlyph
 {exch begin
 CharStrings exch
 2 copy known not{pop /.notdef}if
 true 3 1 roll get exec
 end}_d

/BuildChar {
 1 index /Encoding get exch get
 1 index /BuildGlyph get exec
}_d

FontName currentdict end definefont pop
end
%%EndProlog
mpldict begin
79.2 223.2 translate
453.6 345.6 0 0 clipbox
gsave
0 0 m
453.6 0 l
453.6 345.6 l
0 345.6 l
cl
1.000 setgray
fill
grestore
gsave
59.67 51.12 m
421.875 51.12 l
421.875 306.4504 l
59.67 306.4504 l
cl
1.000 setgray
fill
grestore
1.000 setlinewidth
0 setlinejoin
2 setlinecap
[] 0 setdash
0.000 setgray
gsave
59.67 51.12 m
59.67 306.4504 l
stroke
grestore
gsave
421.875 51.12 m
421.875 306.4504 l
stroke
grestore
gsave
59.67 51.12 m
421.875 51.12 l
stroke
grestore
gsave
59.67 306.4504 m
421.875 306.4504 l
stroke
grestore
0.500 setlinewidth
1 setlinejoin
0 setlinecap
[] 0 setdash
gsave
/o {
gsave
newpath
translate
0.5 setlinewidth
1 setlinejoin
0 setlinecap
0 0 m
0 4 l

gsave
0.000 setgray
fill
grestore
stroke
grestore
} bind def
79.2021 51.12 o
grestore
gsave
/o {
gsave
newpath
translate
0.5 setlinewidth
1 setlinejoin
0 setlinecap
0 0 m
0 -4 l

gsave
0.000 setgray
fill
grestore
stroke
grestore
} bind def
79.2021 306.45 o
grestore
/DejaVuSans findfont
14.000 scalefont
setfont
gsave
65.842695 36.479375 translate
0.000000 rotate
0.000000 0.000000 m /one glyphshow
8.907227 0.000000 m /five glyphshow
17.814453 0.000000 m /zero glyphshow
grestore
gsave
/o {
gsave
newpath
translate
0.5 setlinewidth
1 setlinejoin
0 setlinecap
0 0 m
0 4 l

gsave
0.000 setgray
fill
grestore
stroke
grestore
} bind def
115.107 51.12 o
grestore
gsave
/o {
gsave
newpath
translate
0.5 setlinewidth
1 setlinejoin
0 setlinecap
0 0 m
0 -4 l

gsave
0.000 setgray
fill
grestore
stroke
grestore
} bind def
115.107 306.45 o
grestore
gsave
101.747235 36.479375 translate
0.000000 rotate
0.000000 0.000000 m /one glyphshow
8.907227 0.000000 m /five glyphshow
17.814453 0.000000 m /five glyphshow
grestore
gsave
/o {
gsave
newpath
translate
0.5 setlinewidth
1 setlinejoin
0 setlinecap
0 0 m
0 4 l

gsave
0.000 setgray
fill
grestore
stroke
grestore
} bind def
151.011 51.12 o
grestore
gsave
/o {
gsave
newpath
translate
0.5 setlinewidth
1 setlinejoin
0 setlinecap
0 0 m
0 -4 l

gsave
0.000 setgray
fill
grestore
stroke
grestore
} bind def
151.011 306.45 o
grestore
gsave
137.651775 36.479375 translate
0.000000 rotate
0.000000 0.000000 m /one glyphshow
8.907227 0.000000 m /six glyphshow
17.814453 0.000000 m /zero glyphshow
grestore
gsave
/o {
gsave
newpath
translate
0.5 setlinewidth
1 setlinejoin
0 setlinecap
0 0 m
0 4 l

gsave
0.000 setgray
fill
grestore
stroke
grestore
} bind def
186.916 51.12 o
grestore
gsave
/o {
gsave
newpath
translate
0.5 setlinewidth
1 setlinejoin
0 setlinecap
0 0 m
0 -4 l

gsave
0.000 setgray
fill
grestore
stroke
grestore
} bind def
186.916 306.45 o
grestore
gsave
173.556315 36.479375 translate
0.000000 rotate
0.000000 0.000000 m /one glyphshow
8.907227 0.000000 m /six glyphshow
17.814453 0.000000 m /five glyphshow
grestore
gsave
/o {
gsave
newpath
translate
0.5 setlinewidth
1 setlinejoin
0 setlinecap
0 0 m
0 4 l

gsave
0.000 setgray
fill
grestore
stroke
grestore
} bind def
222.82 51.12 o
grestore
gsave
/o {
gsave
newpath
translate
0.5 setlinewidth
1 setlinejoin
0 setlinecap
0 0 m
0 -4 l

gsave
0.000 setgray
fill
grestore
stroke
grestore
} bind def
222.82 306.45 o
grestore
gsave
209.460855 36.479375 translate
0.000000 rotate
0.000000 0.000000 m /one glyphshow
8.907227 0.000000 m /seven glyphshow
17.814453 0.000000 m /zero glyphshow
grestore
gsave
/o {
gsave
newpath
translate
0.5 setlinewidth
1 setlinejoin
0 setlinecap
0 0 m
0 4 l

gsave
0.000 setgray
fill
grestore
stroke
grestore
} bind def
258.725 51.12 o
grestore
gsave
/o {
gsave
newpath
translate
0.5 setlinewidth
1 setlinejoin
0 setlinecap
0 0 m
0 -4 l

gsave
0.000 setgray
fill
grestore
stroke
grestore
} bind def
258.725 306.45 o
grestore
gsave
245.365395 36.479375 translate
0.000000 rotate
0.000000 0.000000 m /one glyphshow
8.907227 0.000000 m /seven glyphshow
17.814453 0.000000 m /five glyphshow
grestore
gsave
/o {
gsave
newpath
translate
0.5 setlinewidth
1 setlinejoin
0 setlinecap
0 0 m
0 4 l

gsave
0.000 setgray
fill
grestore
stroke
grestore
} bind def
294.629 51.12 o
grestore
gsave
/o {
gsave
newpath
translate
0.5 setlinewidth
1 setlinejoin
0 setlinecap
0 0 m
0 -4 l

gsave
0.000 setgray
fill
grestore
stroke
grestore
} bind def
294.629 306.45 o
grestore
gsave
281.269935 36.479375 translate
0.000000 rotate
0.000000 0.000000 m /one glyphshow
8.907227 0.000000 m /eight glyphshow
17.814453 0.000000 m /zero glyphshow
grestore
gsave
/o {
gsave
newpath
translate
0.5 setlinewidth
1 setlinejoin
0 setlinecap
0 0 m
0 4 l

gsave
0.000 setgray
fill
grestore
stroke
grestore
} bind def
330.534 51.12 o
grestore
gsave
/o {
gsave
newpath
translate
0.5 setlinewidth
1 setlinejoin
0 setlinecap
0 0 m
0 -4 l

gsave
0.000 setgray
fill
grestore
stroke
grestore
} bind def
330.534 306.45 o
grestore
gsave
317.174475 36.479375 translate
0.000000 rotate
0.000000 0.000000 m /one glyphshow
8.907227 0.000000 m /eight glyphshow
17.814453 0.000000 m /five glyphshow
grestore
gsave
/o {
gsave
newpath
translate
0.5 setlinewidth
1 setlinejoin
0 setlinecap
0 0 m
0 4 l

gsave
0.000 setgray
fill
grestore
stroke
grestore
} bind def
366.438 51.12 o
grestore
gsave
/o {
gsave
newpath
translate
0.5 setlinewidth
1 setlinejoin
0 setlinecap
0 0 m
0 -4 l

gsave
0.000 setgray
fill
grestore
stroke
grestore
} bind def
366.438 306.45 o
grestore
gsave
353.079015 36.479375 translate
0.000000 rotate
0.000000 0.000000 m /one glyphshow
8.907227 0.000000 m /nine glyphshow
17.814453 0.000000 m /zero glyphshow
grestore
gsave
/o {
gsave
newpath
translate
0.5 setlinewidth
1 setlinejoin
0 setlinecap
0 0 m
0 4 l

gsave
0.000 setgray
fill
grestore
stroke
grestore
} bind def
402.343 51.12 o
grestore
gsave
/o {
gsave
newpath
translate
0.5 setlinewidth
1 setlinejoin
0 setlinecap
0 0 m
0 -4 l

gsave
0.000 setgray
fill
grestore
stroke
grestore
} bind def
402.343 306.45 o
grestore
gsave
388.983555 36.479375 translate
0.000000 rotate
0.000000 0.000000 m /one glyphshow
8.907227 0.000000 m /nine glyphshow
17.814453 0.000000 m /five glyphshow
grestore
gsave
97.897500 17.932500 translate
0.000000 rotate
0.000000 0.000000 m /P glyphshow
8.442383 0.000000 m /e glyphshow
17.055664 0.000000 m /r glyphshow
22.811523 0.000000 m /hyphen glyphshow
27.863281 0.000000 m /N glyphshow
38.335938 0.000000 m /o glyphshow
46.901367 0.000000 m /d glyphshow
55.788086 0.000000 m /e glyphshow
64.401367 0.000000 m /space glyphshow
68.851562 0.000000 m /S glyphshow
77.738281 0.000000 m /o glyphshow
86.303711 0.000000 m /c glyphshow
94.000977 0.000000 m /k glyphshow
102.108398 0.000000 m /e glyphshow
110.721680 0.000000 m /t glyphshow
116.210938 0.000000 m /plus glyphshow
127.941406 0.000000 m /D glyphshow
138.721680 0.000000 m /R glyphshow
148.449219 0.000000 m /A glyphshow
158.026367 0.000000 m /M glyphshow
170.105469 0.000000 m /space glyphshow
174.555664 0.000000 m /P glyphshow
182.998047 0.000000 m /o glyphshow
191.563477 0.000000 m /w glyphshow
203.013672 0.000000 m /e glyphshow
211.626953 0.000000 m /r glyphshow
217.382812 0.000000 m /space glyphshow
221.833008 0.000000 m /L glyphshow
229.632812 0.000000 m /i glyphshow
233.522461 0.000000 m /m glyphshow
247.160156 0.000000 m /i glyphshow
251.049805 0.000000 m /t glyphshow
256.539062 0.000000 m /space glyphshow
260.989258 0.000000 m /parenleft glyphshow
266.451172 0.000000 m /W glyphshow
280.293945 0.000000 m /parenright glyphshow
grestore
[6 6] 0 setdash
gsave
362.2 255.3 59.67 51.12 clipbox
59.67 51.12 m
421.875 51.12 l
stroke
grestore
[] 0 setdash
gsave
/o {
gsave
newpath
translate
0.5 setlinewidth
1 setlinejoin
0 setlinecap
0 0 m
4 0 l

gsave
0.000 setgray
fill
grestore
stroke
grestore
} bind def
59.67 51.12 o
grestore
gsave
/o {
gsave
newpath
translate
0.5 setlinewidth
1 setlinejoin
0 setlinecap
0 0 m
-4 0 l

gsave
0.000 setgray
fill
grestore
stroke
grestore
} bind def
421.875 51.12 o
grestore
gsave
33.404375 45.799688 translate
0.000000 rotate
0.000000 0.000000 m /zero glyphshow
8.907227 0.000000 m /period glyphshow
13.357422 0.000000 m /two glyphshow
grestore
[6 6] 0 setdash
gsave
362.2 255.3 59.67 51.12 clipbox
59.67 83.0363 m
421.875 83.0363 l
stroke
grestore
[] 0 setdash
gsave
/o {
gsave
newpath
translate
0.5 setlinewidth
1 setlinejoin
0 setlinecap
0 0 m
4 0 l

gsave
0.000 setgray
fill
grestore
stroke
grestore
} bind def
59.67 83.0363 o
grestore
gsave
/o {
gsave
newpath
translate
0.5 setlinewidth
1 setlinejoin
0 setlinecap
0 0 m
-4 0 l

gsave
0.000 setgray
fill
grestore
stroke
grestore
} bind def
421.875 83.0363 o
grestore
gsave
33.404375 77.715988 translate
0.000000 rotate
0.000000 0.000000 m /zero glyphshow
8.907227 0.000000 m /period glyphshow
13.357422 0.000000 m /four glyphshow
grestore
[6 6] 0 setdash
gsave
362.2 255.3 59.67 51.12 clipbox
59.67 114.9526 m
421.875 114.9526 l
stroke
grestore
[] 0 setdash
gsave
/o {
gsave
newpath
translate
0.5 setlinewidth
1 setlinejoin
0 setlinecap
0 0 m
4 0 l

gsave
0.000 setgray
fill
grestore
stroke
grestore
} bind def
59.67 114.953 o
grestore
gsave
/o {
gsave
newpath
translate
0.5 setlinewidth
1 setlinejoin
0 setlinecap
0 0 m
-4 0 l

gsave
0.000 setgray
fill
grestore
stroke
grestore
} bind def
421.875 114.953 o
grestore
gsave
33.404375 109.632288 translate
0.000000 rotate
0.000000 0.000000 m /zero glyphshow
8.907227 0.000000 m /period glyphshow
13.357422 0.000000 m /six glyphshow
grestore
[6 6] 0 setdash
gsave
362.2 255.3 59.67 51.12 clipbox
59.67 146.8689 m
421.875 146.8689 l
stroke
grestore
[] 0 setdash
gsave
/o {
gsave
newpath
translate
0.5 setlinewidth
1 setlinejoin
0 setlinecap
0 0 m
4 0 l

gsave
0.000 setgray
fill
grestore
stroke
grestore
} bind def
59.67 146.869 o
grestore
gsave
/o {
gsave
newpath
translate
0.5 setlinewidth
1 setlinejoin
0 setlinecap
0 0 m
-4 0 l

gsave
0.000 setgray
fill
grestore
stroke
grestore
} bind def
421.875 146.869 o
grestore
gsave
33.404375 141.548588 translate
0.000000 rotate
0.000000 0.000000 m /zero glyphshow
8.907227 0.000000 m /period glyphshow
13.357422 0.000000 m /eight glyphshow
grestore
[6 6] 0 setdash
gsave
362.2 255.3 59.67 51.12 clipbox
59.67 178.7852 m
421.875 178.7852 l
stroke
grestore
[] 0 setdash
gsave
/o {
gsave
newpath
translate
0.5 setlinewidth
1 setlinejoin
0 setlinecap
0 0 m
4 0 l

gsave
0.000 setgray
fill
grestore
stroke
grestore
} bind def
59.67 178.785 o
grestore
gsave
/o {
gsave
newpath
translate
0.5 setlinewidth
1 setlinejoin
0 setlinecap
0 0 m
-4 0 l

gsave
0.000 setgray
fill
grestore
stroke
grestore
} bind def
421.875 178.785 o
grestore
gsave
33.404375 173.464888 translate
0.000000 rotate
0.000000 0.000000 m /one glyphshow
8.907227 0.000000 m /period glyphshow
13.357422 0.000000 m /zero glyphshow
grestore
[6 6] 0 setdash
gsave
362.2 255.3 59.67 51.12 clipbox
59.67 210.7015 m
421.875 210.7015 l
stroke
grestore
[] 0 setdash
gsave
/o {
gsave
newpath
translate
0.5 setlinewidth
1 setlinejoin
0 setlinecap
0 0 m
4 0 l

gsave
0.000 setgray
fill
grestore
stroke
grestore
} bind def
59.67 210.702 o
grestore
gsave
/o {
gsave
newpath
translate
0.5 setlinewidth
1 setlinejoin
0 setlinecap
0 0 m
-4 0 l

gsave
0.000 setgray
fill
grestore
stroke
grestore
} bind def
421.875 210.702 o
grestore
gsave
33.404375 205.381188 translate
0.000000 rotate
0.000000 0.000000 m /one glyphshow
8.907227 0.000000 m /period glyphshow
13.357422 0.000000 m /two glyphshow
grestore
[6 6] 0 setdash
gsave
362.2 255.3 59.67 51.12 clipbox
59.67 242.6178 m
421.875 242.6178 l
stroke
grestore
[] 0 setdash
gsave
/o {
gsave
newpath
translate
0.5 setlinewidth
1 setlinejoin
0 setlinecap
0 0 m
4 0 l

gsave
0.000 setgray
fill
grestore
stroke
grestore
} bind def
59.67 242.618 o
grestore
gsave
/o {
gsave
newpath
translate
0.5 setlinewidth
1 setlinejoin
0 setlinecap
0 0 m
-4 0 l

gsave
0.000 setgray
fill
grestore
stroke
grestore
} bind def
421.875 242.618 o
grestore
gsave
33.404375 237.297488 translate
0.000000 rotate
0.000000 0.000000 m /one glyphshow
8.907227 0.000000 m /period glyphshow
13.357422 0.000000 m /four glyphshow
grestore
[6 6] 0 setdash
gsave
362.2 255.3 59.67 51.12 clipbox
59.67 274.5341 m
421.875 274.5341 l
stroke
grestore
[] 0 setdash
gsave
/o {
gsave
newpath
translate
0.5 setlinewidth
1 setlinejoin
0 setlinecap
0 0 m
4 0 l

gsave
0.000 setgray
fill
grestore
stroke
grestore
} bind def
59.67 274.534 o
grestore
gsave
/o {
gsave
newpath
translate
0.5 setlinewidth
1 setlinejoin
0 setlinecap
0 0 m
-4 0 l

gsave
0.000 setgray
fill
grestore
stroke
grestore
} bind def
421.875 274.534 o
grestore
gsave
33.404375 269.213788 translate
0.000000 rotate
0.000000 0.000000 m /one glyphshow
8.907227 0.000000 m /period glyphshow
13.357422 0.000000 m /six glyphshow
grestore
[6 6] 0 setdash
gsave
362.2 255.3 59.67 51.12 clipbox
59.67 306.4504 m
421.875 306.4504 l
stroke
grestore
[] 0 setdash
gsave
/o {
gsave
newpath
translate
0.5 setlinewidth
1 setlinejoin
0 setlinecap
0 0 m
4 0 l

gsave
0.000 setgray
fill
grestore
stroke
grestore
} bind def
59.67 306.45 o
grestore
gsave
/o {
gsave
newpath
translate
0.5 setlinewidth
1 setlinejoin
0 setlinecap
0 0 m
-4 0 l

gsave
0.000 setgray
fill
grestore
stroke
grestore
} bind def
421.875 306.45 o
grestore
gsave
33.404375 301.130088 translate
0.000000 rotate
0.000000 0.000000 m /one glyphshow
8.907227 0.000000 m /period glyphshow
13.357422 0.000000 m /eight glyphshow
grestore
gsave
25.498125 107.191450 translate
90.000000 rotate
0.000000 0.000000 m /N glyphshow
10.472656 0.000000 m /o glyphshow
19.038086 0.000000 m /r glyphshow
24.793945 0.000000 m /m glyphshow
38.431641 0.000000 m /a glyphshow
47.010742 0.000000 m /l glyphshow
50.900391 0.000000 m /i glyphshow
54.790039 0.000000 m /z glyphshow
62.138672 0.000000 m /e glyphshow
70.751953 0.000000 m /d glyphshow
79.638672 0.000000 m /space glyphshow
84.088867 0.000000 m /R glyphshow
93.816406 0.000000 m /u glyphshow
102.689453 0.000000 m /n glyphshow
111.562500 0.000000 m /t glyphshow
117.051758 0.000000 m /i glyphshow
120.941406 0.000000 m /m glyphshow
134.579102 0.000000 m /e glyphshow
grestore
1.000 setlinewidth
0 setlinejoin
[] 0 setdash
gsave
362.2 255.3 59.67 51.12 clipbox
79.20207 19.2037 m
91.768659 19.2037 l
91.768659 216.810071 l
79.20207 216.810071 l
cl
gsave
0.000 1.000 1.000 setrgbcolor
fill
grestore
stroke
grestore
gsave
362.2 255.3 59.67 51.12 clipbox
115.10661 19.2037 m
127.673199 19.2037 l
127.673199 207.209366 l
115.10661 207.209366 l
cl
gsave
0.000 1.000 1.000 setrgbcolor
fill
grestore
stroke
grestore
gsave
362.2 255.3 59.67 51.12 clipbox
151.01115 19.2037 m
163.577739 19.2037 l
163.577739 200.005151 l
151.01115 200.005151 l
cl
gsave
0.000 1.000 1.000 setrgbcolor
fill
grestore
stroke
grestore
gsave
362.2 255.3 59.67 51.12 clipbox
186.91569 19.2037 m
199.482279 19.2037 l
199.482279 194.802757 l
186.91569 194.802757 l
cl
gsave
0.000 1.000 1.000 setrgbcolor
fill
grestore
stroke
grestore
gsave
362.2 255.3 59.67 51.12 clipbox
222.82023 19.2037 m
235.386819 19.2037 l
235.386819 191.154417 l
222.82023 191.154417 l
cl
gsave
0.000 1.000 1.000 setrgbcolor
fill
grestore
stroke
grestore
gsave
362.2 255.3 59.67 51.12 clipbox
258.72477 19.2037 m
271.291359 19.2037 l
271.291359 185.981992 l
258.72477 185.981992 l
cl
gsave
0.000 1.000 1.000 setrgbcolor
fill
grestore
stroke
grestore
gsave
362.2 255.3 59.67 51.12 clipbox
294.62931 19.2037 m
307.195899 19.2037 l
307.195899 183.327909 l
294.62931 183.327909 l
cl
gsave
0.000 1.000 1.000 setrgbcolor
fill
grestore
stroke
grestore
gsave
362.2 255.3 59.67 51.12 clipbox
330.53385 19.2037 m
343.100439 19.2037 l
343.100439 179.355283 l
330.53385 179.355283 l
cl
gsave
0.000 1.000 1.000 setrgbcolor
fill
grestore
stroke
grestore
gsave
362.2 255.3 59.67 51.12 clipbox
366.43839 19.2037 m
379.004979 19.2037 l
379.004979 177.782125 l
366.43839 177.782125 l
cl
gsave
0.000 1.000 1.000 setrgbcolor
fill
grestore
stroke
grestore
gsave
362.2 255.3 59.67 51.12 clipbox
402.34293 19.2037 m
414.909519 19.2037 l
414.909519 178.858024 l
402.34293 178.858024 l
cl
gsave
0.000 1.000 1.000 setrgbcolor
fill
grestore
stroke
grestore
gsave
362.2 255.3 59.67 51.12 clipbox
66.635481 19.2037 m
79.20207 19.2037 l
79.20207 276.352392 l
66.635481 276.352392 l
cl
gsave
0.000 0.000 1.000 setrgbcolor
fill
grestore
stroke
grestore
gsave
362.2 255.3 59.67 51.12 clipbox
102.540021 19.2037 m
115.10661 19.2037 l
115.10661 255.565912 l
102.540021 255.565912 l
cl
gsave
0.000 0.000 1.000 setrgbcolor
fill
grestore
stroke
grestore
gsave
362.2 255.3 59.67 51.12 clipbox
138.444561 19.2037 m
151.01115 19.2037 l
151.01115 230.639397 l
138.444561 230.639397 l
cl
gsave
0.000 0.000 1.000 setrgbcolor
fill
grestore
stroke
grestore
gsave
362.2 255.3 59.67 51.12 clipbox
174.349101 19.2037 m
186.91569 19.2037 l
186.91569 212.986914 l
174.349101 212.986914 l
cl
gsave
0.000 0.000 1.000 setrgbcolor
fill
grestore
stroke
grestore
gsave
362.2 255.3 59.67 51.12 clipbox
210.253641 19.2037 m
222.82023 19.2037 l
222.82023 206.029759 l
210.253641 206.029759 l
cl
gsave
0.000 0.000 1.000 setrgbcolor
fill
grestore
stroke
grestore
gsave
362.2 255.3 59.67 51.12 clipbox
246.158181 19.2037 m
258.72477 19.2037 l
258.72477 197.090294 l
246.158181 197.090294 l
cl
gsave
0.000 0.000 1.000 setrgbcolor
fill
grestore
stroke
grestore
gsave
362.2 255.3 59.67 51.12 clipbox
282.062721 19.2037 m
294.62931 19.2037 l
294.62931 191.794971 l
282.062721 191.794971 l
cl
gsave
0.000 0.000 1.000 setrgbcolor
fill
grestore
stroke
grestore
gsave
362.2 255.3 59.67 51.12 clipbox
317.967261 19.2037 m
330.53385 19.2037 l
330.53385 187.031044 l
317.967261 187.031044 l
cl
gsave
0.000 0.000 1.000 setrgbcolor
fill
grestore
stroke
grestore
gsave
362.2 255.3 59.67 51.12 clipbox
353.871801 19.2037 m
366.43839 19.2037 l
366.43839 183.357224 l
353.871801 183.357224 l
cl
gsave
0.000 0.000 1.000 setrgbcolor
fill
grestore
stroke
grestore
gsave
362.2 255.3 59.67 51.12 clipbox
389.776341 19.2037 m
402.34293 19.2037 l
402.34293 178.7852 l
389.776341 178.7852 l
cl
gsave
0.000 0.000 1.000 setrgbcolor
fill
grestore
stroke
grestore
/DejaVuSans findfont
16.800 scalefont
setfont
gsave
48.858437 316.557008 translate
0.000000 rotate
0.000000 0.000000 m /M glyphshow
14.451782 0.000000 m /i glyphshow
19.105469 0.000000 m /n glyphshow
29.721436 0.000000 m /i glyphshow
34.375122 0.000000 m /f glyphshow
40.271973 0.000000 m /e glyphshow
50.577148 0.000000 m /space glyphshow
55.901489 0.000000 m /R glyphshow
67.539795 0.000000 m /u glyphshow
78.155762 0.000000 m /n glyphshow
88.771729 0.000000 m /t glyphshow
95.339233 0.000000 m /i glyphshow
99.992920 0.000000 m /m glyphshow
116.309448 0.000000 m /e glyphshow
126.614624 0.000000 m /space glyphshow
131.938965 0.000000 m /C glyphshow
143.634521 0.000000 m /o glyphshow
153.882446 0.000000 m /m glyphshow
170.198975 0.000000 m /p glyphshow
180.831299 0.000000 m /a glyphshow
191.095581 0.000000 m /r glyphshow
197.982056 0.000000 m /i glyphshow
202.635742 0.000000 m /s glyphshow
211.362427 0.000000 m /o glyphshow
221.610352 0.000000 m /n glyphshow
232.226318 0.000000 m /space glyphshow
237.550659 0.000000 m /hyphen glyphshow
243.594727 0.000000 m /space glyphshow
248.919067 0.000000 m /K glyphshow
259.903076 0.000000 m /n glyphshow
270.519043 0.000000 m /i glyphshow
275.172729 0.000000 m /g glyphshow
285.805054 0.000000 m /h glyphshow
296.421021 0.000000 m /t glyphshow
302.988525 0.000000 m /s glyphshow
311.715210 0.000000 m /space glyphshow
317.039551 0.000000 m /L glyphshow
326.371460 0.000000 m /a glyphshow
336.635742 0.000000 m /n glyphshow
347.251709 0.000000 m /d glyphshow
357.884033 0.000000 m /i glyphshow
362.537720 0.000000 m /n glyphshow
373.153687 0.000000 m /g glyphshow
grestore
0.300 setgray
gsave
260.36875 252.15665 m
414.075 252.15665 l
415.941667 252.15665 416.875 253.089983 416.875 254.95665 c
416.875 294.6504 l
416.875 296.517067 415.941667 297.4504 414.075 297.4504 c
260.36875 297.4504 l
258.502083 297.4504 257.56875 296.517067 257.56875 294.6504 c
257.56875 254.95665 l
257.56875 253.089983 258.502083 252.15665 260.36875 252.15665 c
cl
gsave
fill
grestore
stroke
grestore
0.000 setgray
gsave
258.36875 254.15665 m
412.075 254.15665 l
413.941667 254.15665 414.875 255.089983 414.875 256.95665 c
414.875 296.6504 l
414.875 298.517067 413.941667 299.4504 412.075 299.4504 c
258.36875 299.4504 l
256.502083 299.4504 255.56875 298.517067 255.56875 296.6504 c
255.56875 256.95665 l
255.56875 255.089983 256.502083 254.15665 258.36875 254.15665 c
cl
gsave
1.000 setgray
fill
grestore
stroke
grestore
gsave
261.16875 283.209775 m
289.16875 283.209775 l
289.16875 293.009775 l
261.16875 293.009775 l
cl
gsave
0.000 1.000 1.000 setrgbcolor
fill
grestore
stroke
grestore
/DejaVuSans findfont
14.000 scalefont
setfont
gsave
300.368750 283.209775 translate
0.000000 rotate
0.000000 0.000000 m /B glyphshow
9.604492 0.000000 m /a glyphshow
18.183594 0.000000 m /l glyphshow
22.073242 0.000000 m /a glyphshow
30.652344 0.000000 m /n glyphshow
39.525391 0.000000 m /c glyphshow
47.222656 0.000000 m /e glyphshow
55.835938 0.000000 m /r glyphshow
61.591797 0.000000 m /space glyphshow
66.041992 0.000000 m /P glyphshow
74.484375 0.000000 m /l glyphshow
78.374023 0.000000 m /u glyphshow
87.247070 0.000000 m /g glyphshow
96.133789 0.000000 m /i glyphshow
100.023438 0.000000 m /n glyphshow
grestore
gsave
261.16875 262.6629 m
289.16875 262.6629 l
289.16875 272.4629 l
261.16875 272.4629 l
cl
gsave
0.000 0.000 1.000 setrgbcolor
fill
grestore
stroke
grestore
gsave
300.368750 262.662900 translate
0.000000 rotate
0.000000 0.000000 m /B glyphshow
9.604492 0.000000 m /a glyphshow
18.183594 0.000000 m /s glyphshow
25.477539 0.000000 m /e glyphshow
34.090820 0.000000 m /l glyphshow
37.980469 0.000000 m /i glyphshow
41.870117 0.000000 m /n glyphshow
50.743164 0.000000 m /e glyphshow
grestore
2.000 setlinewidth
1 setlinejoin
[] 0 setdash
1.000 0.000 0.000 setrgbcolor
gsave
362.2 255.3 59.67 51.12 clipbox
85.485364 215.644178 m
85.485364 217.987092 l
stroke
grestore
gsave
362.2 255.3 59.67 51.12 clipbox
121.389904 206.540979 m
121.389904 208.208388 l
stroke
grestore
gsave
362.2 255.3 59.67 51.12 clipbox
157.294444 199.2185 m
157.294444 200.581713 l
stroke
grestore
gsave
362.2 255.3 59.67 51.12 clipbox
193.198984 194.387982 m
193.198984 195.935979 l
stroke
grestore
gsave
362.2 255.3 59.67 51.12 clipbox
229.103524 189.988044 m
229.103524 194.739245 l
stroke
grestore
gsave
362.2 255.3 59.67 51.12 clipbox
265.008065 184.920446 m
265.008065 189.728301 l
stroke
grestore
gsave
362.2 255.3 59.67 51.12 clipbox
300.912605 181.526358 m
300.912605 185.81037 l
stroke
grestore
gsave
362.2 255.3 59.67 51.12 clipbox
336.817145 178.716255 m
336.817145 179.833672 l
stroke
grestore
gsave
362.2 255.3 59.67 51.12 clipbox
372.721685 176.93815 m
372.721685 178.458255 l
stroke
grestore
gsave
362.2 255.3 59.67 51.12 clipbox
408.626225 175.944503 m
408.626225 185.079952 l
stroke
grestore
gsave
362.2 255.3 59.67 51.12 clipbox
72.918775 257.481936 m
72.918775 286.035335 l
stroke
grestore
gsave
362.2 255.3 59.67 51.12 clipbox
108.823315 252.291439 m
108.823315 259.441338 l
stroke
grestore
gsave
362.2 255.3 59.67 51.12 clipbox
144.727855 228.622599 m
144.727855 233.679738 l
stroke
grestore
gsave
362.2 255.3 59.67 51.12 clipbox
180.632395 209.276994 m
180.632395 214.887612 l
stroke
grestore
gsave
362.2 255.3 59.67 51.12 clipbox
216.536935 203.908687 m
216.536935 211.428152 l
stroke
grestore
gsave
362.2 255.3 59.67 51.12 clipbox
252.441476 194.474272 m
252.441476 200.873706 l
stroke
grestore
gsave
362.2 255.3 59.67 51.12 clipbox
288.346016 190.409037 m
288.346016 192.739748 l
stroke
grestore
gsave
362.2 255.3 59.67 51.12 clipbox
324.250556 186.417889 m
324.250556 187.498698 l
stroke
grestore
gsave
362.2 255.3 59.67 51.12 clipbox
360.155096 182.505187 m
360.155096 184.733047 l
stroke
grestore
gsave
362.2 255.3 59.67 51.12 clipbox
396.059636 177.675541 m
396.059636 179.170369 l
stroke
grestore
gsave
362.2 255.3 59.67 51.12 clipbox
/o {
gsave
newpath
translate
2.0 setlinewidth
1 setlinejoin
0 setlinecap
3 -0 m
-3 0 l

gsave
1.000 0.000 0.000 setrgbcolor
fill
grestore
stroke
grestore
} bind def
85.4854 215.644 o
121.39 206.541 o
157.294 199.218 o
193.199 194.388 o
229.104 189.988 o
265.008 184.92 o
300.913 181.526 o
336.817 178.716 o
372.722 176.938 o
408.626 175.945 o
grestore
gsave
362.2 255.3 59.67 51.12 clipbox
/o {
gsave
newpath
translate
2.0 setlinewidth
1 setlinejoin
0 setlinecap
3 -0 m
-3 0 l

gsave
1.000 0.000 0.000 setrgbcolor
fill
grestore
stroke
grestore
} bind def
85.4854 217.987 o
121.39 208.208 o
157.294 200.582 o
193.199 195.936 o
229.104 194.739 o
265.008 189.728 o
300.913 185.81 o
336.817 179.834 o
372.722 178.458 o
408.626 185.08 o
grestore
gsave
362.2 255.3 59.67 51.12 clipbox
/o {
gsave
newpath
translate
2.0 setlinewidth
1 setlinejoin
0 setlinecap
3 -0 m
-3 0 l

gsave
1.000 0.000 0.000 setrgbcolor
fill
grestore
stroke
grestore
} bind def
72.9188 257.482 o
108.823 252.291 o
144.728 228.623 o
180.632 209.277 o
216.537 203.909 o
252.441 194.474 o
288.346 190.409 o
324.251 186.418 o
360.155 182.505 o
396.06 177.676 o
grestore
gsave
362.2 255.3 59.67 51.12 clipbox
/o {
gsave
newpath
translate
2.0 setlinewidth
1 setlinejoin
0 setlinecap
3 -0 m
-3 0 l

gsave
1.000 0.000 0.000 setrgbcolor
fill
grestore
stroke
grestore
} bind def
72.9188 286.035 o
108.823 259.441 o
144.728 233.68 o
180.632 214.888 o
216.537 211.428 o
252.441 200.874 o
288.346 192.74 o
324.251 187.499 o
360.155 184.733 o
396.06 179.17 o
grestore

end
showpage
