%!PS-Adobe-3.0 EPSF-3.0
%%Title: figures/comd-12-node-new-governor/comd_runtime_comparison_mean.eps
%%Creator: matplotlib version 2.0.0, http://matplotlib.org/
%%CreationDate: Fri Mar 24 18:50:55 2017
%%Orientation: portrait
%%BoundingBox: 79 223 532 568
%%EndComments
%%BeginProlog
/mpldict 8 dict def
mpldict begin
/m { moveto } bind def
/l { lineto } bind def
/r { rlineto } bind def
/c { curveto } bind def
/cl { closepath } bind def
/box {
m
1 index 0 r
0 exch r
neg 0 r
cl
} bind def
/clipbox {
box
clip
newpath
} bind def
%!PS-Adobe-3.0 Resource-Font
%%Title: DejaVu Sans
%%Copyright: Copyright (c) 2003 by Bitstream, Inc. All Rights Reserved. Copyright (c) 2006 by Tavmjong Bah. All Rights Reserved. DejaVu changes are in public domain 
%%Creator: Converted from TrueType to type 3 by PPR
25 dict begin
/_d{bind def}bind def
/_m{moveto}_d
/_l{lineto}_d
/_cl{closepath eofill}_d
/_c{curveto}_d
/_sc{7 -1 roll{setcachedevice}{pop pop pop pop pop pop}ifelse}_d
/_e{exec}_d
/FontName /DejaVuSans def
/PaintType 0 def
/FontMatrix[.001 0 0 .001 0 0]def
/FontBBox[-1021 -463 1793 1232]def
/FontType 3 def
/Encoding [ /space /parenleft /parenright /plus /hyphen /period /zero /one /two /three /four /five /six /seven /eight /A /B /C /D /K /L /M /N /O /P /R /S /W /a /c /d /e /g /h /i /k /l /m /n /o /p /r /s /t /u /w /z ] def
/FontInfo 10 dict dup begin
/FamilyName (DejaVu Sans) def
/FullName (DejaVu Sans) def
/Notice (Copyright (c) 2003 by Bitstream, Inc. All Rights Reserved. Copyright (c) 2006 by Tavmjong Bah. All Rights Reserved. DejaVu changes are in public domain ) def
/Weight (Book) def
/Version (Version 2.35) def
/ItalicAngle 0.0 def
/isFixedPitch false def
/UnderlinePosition -130 def
/UnderlineThickness 90 def
end readonly def
/CharStrings 47 dict dup begin
/space{318 0 0 0 0 0 _sc
}_d
/parenleft{390 0 86 -131 310 759 _sc
310 759 _m
266 683 234 609 213 536 _c
191 463 181 389 181 314 _c
181 238 191 164 213 91 _c
234 17 266 -56 310 -131 _c
232 -131 _l
183 -54 146 20 122 94 _c
98 168 86 241 86 314 _c
86 386 98 459 122 533 _c
146 607 182 682 232 759 _c
310 759 _l
_cl}_d
/parenright{390 0 80 -131 304 759 _sc
80 759 _m
158 759 _l
206 682 243 607 267 533 _c
291 459 304 386 304 314 _c
304 241 291 168 267 94 _c
243 20 206 -54 158 -131 _c
80 -131 _l
123 -56 155 17 177 91 _c
198 164 209 238 209 314 _c
209 389 198 463 177 536 _c
155 609 123 683 80 759 _c
_cl}_d
/plus{838 0 106 0 732 627 _sc
460 627 _m
460 355 _l
732 355 _l
732 272 _l
460 272 _l
460 0 _l
378 0 _l
378 272 _l
106 272 _l
106 355 _l
378 355 _l
378 627 _l
460 627 _l
_cl}_d
/hyphen{361 0 49 234 312 314 _sc
49 314 _m
312 314 _l
312 234 _l
49 234 _l
49 314 _l
_cl}_d
/period{318 0 107 0 210 124 _sc
107 124 _m
210 124 _l
210 0 _l
107 0 _l
107 124 _l
_cl}_d
/zero{636 0 66 -13 570 742 _sc
318 664 _m
267 664 229 639 203 589 _c
177 539 165 464 165 364 _c
165 264 177 189 203 139 _c
229 89 267 64 318 64 _c
369 64 407 89 433 139 _c
458 189 471 264 471 364 _c
471 464 458 539 433 589 _c
407 639 369 664 318 664 _c
318 742 _m
399 742 461 709 505 645 _c
548 580 570 486 570 364 _c
570 241 548 147 505 83 _c
461 19 399 -13 318 -13 _c
236 -13 173 19 130 83 _c
87 147 66 241 66 364 _c
66 486 87 580 130 645 _c
173 709 236 742 318 742 _c
_cl}_d
/one{636 0 110 0 544 729 _sc
124 83 _m
285 83 _l
285 639 _l
110 604 _l
110 694 _l
284 729 _l
383 729 _l
383 83 _l
544 83 _l
544 0 _l
124 0 _l
124 83 _l
_cl}_d
/two{{636 0 73 0 536 742 _sc
192 83 _m
536 83 _l
536 0 _l
73 0 _l
73 83 _l
110 121 161 173 226 239 _c
290 304 331 346 348 365 _c
380 400 402 430 414 455 _c
426 479 433 504 433 528 _c
433 566 419 598 392 622 _c
365 646 330 659 286 659 _c
255 659 222 653 188 643 _c
154 632 117 616 78 594 _c
78 694 _l
118 710 155 722 189 730 _c
223 738 255 742 284 742 _c
}_e{359 742 419 723 464 685 _c
509 647 532 597 532 534 _c
532 504 526 475 515 449 _c
504 422 484 390 454 354 _c
446 344 420 317 376 272 _c
332 227 271 164 192 83 _c
_cl}_e}_d
/three{{636 0 76 -13 556 742 _sc
406 393 _m
453 383 490 362 516 330 _c
542 298 556 258 556 212 _c
556 140 531 84 482 45 _c
432 6 362 -13 271 -13 _c
240 -13 208 -10 176 -4 _c
144 1 110 10 76 22 _c
76 117 _l
103 101 133 89 166 81 _c
198 73 232 69 268 69 _c
330 69 377 81 409 105 _c
441 129 458 165 458 212 _c
458 254 443 288 413 312 _c
383 336 341 349 287 349 _c
}_e{202 349 _l
202 430 _l
291 430 _l
339 430 376 439 402 459 _c
428 478 441 506 441 543 _c
441 580 427 609 401 629 _c
374 649 336 659 287 659 _c
260 659 231 656 200 650 _c
169 644 135 635 98 623 _c
98 711 _l
135 721 170 729 203 734 _c
235 739 266 742 296 742 _c
370 742 429 725 473 691 _c
517 657 539 611 539 553 _c
539 513 527 479 504 451 _c
481 423 448 403 406 393 _c
_cl}_e}_d
/four{636 0 49 0 580 729 _sc
378 643 _m
129 254 _l
378 254 _l
378 643 _l
352 729 _m
476 729 _l
476 254 _l
580 254 _l
580 172 _l
476 172 _l
476 0 _l
378 0 _l
378 172 _l
49 172 _l
49 267 _l
352 729 _l
_cl}_d
/five{{636 0 77 -13 549 729 _sc
108 729 _m
495 729 _l
495 646 _l
198 646 _l
198 467 _l
212 472 227 476 241 478 _c
255 480 270 482 284 482 _c
365 482 429 459 477 415 _c
525 370 549 310 549 234 _c
549 155 524 94 475 51 _c
426 8 357 -13 269 -13 _c
238 -13 207 -10 175 -6 _c
143 -1 111 6 77 17 _c
77 116 _l
106 100 136 88 168 80 _c
199 72 232 69 267 69 _c
}_e{323 69 368 83 401 113 _c
433 143 450 183 450 234 _c
450 284 433 324 401 354 _c
368 384 323 399 267 399 _c
241 399 214 396 188 390 _c
162 384 135 375 108 363 _c
108 729 _l
_cl}_e}_d
/six{{636 0 70 -13 573 742 _sc
330 404 _m
286 404 251 388 225 358 _c
199 328 186 286 186 234 _c
186 181 199 139 225 109 _c
251 79 286 64 330 64 _c
374 64 409 79 435 109 _c
461 139 474 181 474 234 _c
474 286 461 328 435 358 _c
409 388 374 404 330 404 _c
526 713 _m
526 623 _l
501 635 476 644 451 650 _c
425 656 400 659 376 659 _c
310 659 260 637 226 593 _c
}_e{192 549 172 482 168 394 _c
187 422 211 444 240 459 _c
269 474 301 482 336 482 _c
409 482 467 459 509 415 _c
551 371 573 310 573 234 _c
573 159 550 99 506 54 _c
462 9 403 -13 330 -13 _c
246 -13 181 19 137 83 _c
92 147 70 241 70 364 _c
70 479 97 571 152 639 _c
206 707 280 742 372 742 _c
396 742 421 739 447 735 _c
472 730 498 723 526 713 _c
_cl}_e}_d
/seven{636 0 82 0 551 729 _sc
82 729 _m
551 729 _l
551 687 _l
286 0 _l
183 0 _l
432 646 _l
82 646 _l
82 729 _l
_cl}_d
/eight{{636 0 68 -13 568 742 _sc
318 346 _m
271 346 234 333 207 308 _c
180 283 167 249 167 205 _c
167 161 180 126 207 101 _c
234 76 271 64 318 64 _c
364 64 401 76 428 102 _c
455 127 469 161 469 205 _c
469 249 455 283 429 308 _c
402 333 365 346 318 346 _c
219 388 _m
177 398 144 418 120 447 _c
96 476 85 511 85 553 _c
85 611 105 657 147 691 _c
188 725 245 742 318 742 _c
}_e{390 742 447 725 489 691 _c
530 657 551 611 551 553 _c
551 511 539 476 515 447 _c
491 418 459 398 417 388 _c
464 377 501 355 528 323 _c
554 291 568 251 568 205 _c
568 134 546 80 503 43 _c
459 5 398 -13 318 -13 _c
237 -13 175 5 132 43 _c
89 80 68 134 68 205 _c
68 251 81 291 108 323 _c
134 355 171 377 219 388 _c
183 544 _m
183 506 194 476 218 455 _c
}_e{242 434 275 424 318 424 _c
360 424 393 434 417 455 _c
441 476 453 506 453 544 _c
453 582 441 611 417 632 _c
393 653 360 664 318 664 _c
275 664 242 653 218 632 _c
194 611 183 582 183 544 _c
_cl}_e}_d
/A{684 0 8 0 676 729 _sc
342 632 _m
208 269 _l
476 269 _l
342 632 _l
286 729 _m
398 729 _l
676 0 _l
573 0 _l
507 187 _l
178 187 _l
112 0 _l
8 0 _l
286 729 _l
_cl}_d
/B{{686 0 98 0 615 729 _sc
197 348 _m
197 81 _l
355 81 _l
408 81 447 92 473 114 _c
498 136 511 169 511 215 _c
511 260 498 293 473 315 _c
447 337 408 348 355 348 _c
197 348 _l
197 648 _m
197 428 _l
343 428 _l
391 428 426 437 450 455 _c
474 473 486 500 486 538 _c
486 574 474 602 450 620 _c
426 638 391 648 343 648 _c
197 648 _l
98 729 _m
350 729 _l
}_e{425 729 483 713 524 682 _c
564 650 585 606 585 549 _c
585 504 574 468 553 442 _c
532 416 502 399 462 393 _c
510 382 548 360 575 327 _c
601 294 615 253 615 204 _c
615 138 592 88 548 53 _c
504 17 441 0 360 0 _c
98 0 _l
98 729 _l
_cl}_e}_d
/C{{698 0 56 -13 644 742 _sc
644 673 _m
644 569 _l
610 599 575 622 537 638 _c
499 653 460 661 418 661 _c
334 661 270 635 226 584 _c
182 533 160 460 160 364 _c
160 268 182 194 226 143 _c
270 92 334 67 418 67 _c
460 67 499 74 537 90 _c
575 105 610 128 644 159 _c
644 56 _l
609 32 572 15 534 4 _c
496 -7 455 -13 412 -13 _c
302 -13 215 20 151 87 _c
}_e{87 154 56 246 56 364 _c
56 481 87 573 151 641 _c
215 708 302 742 412 742 _c
456 742 497 736 535 725 _c
573 713 610 696 644 673 _c
_cl}_e}_d
/D{770 0 98 0 711 729 _sc
197 648 _m
197 81 _l
316 81 _l
416 81 490 103 537 149 _c
583 195 607 267 607 365 _c
607 463 583 534 537 580 _c
490 625 416 648 316 648 _c
197 648 _l
98 729 _m
301 729 _l
442 729 546 699 612 641 _c
678 582 711 490 711 365 _c
711 239 677 147 611 88 _c
545 29 441 0 301 0 _c
98 0 _l
98 729 _l
_cl}_d
/K{656 0 98 0 677 729 _sc
98 729 _m
197 729 _l
197 421 _l
524 729 _l
651 729 _l
289 389 _l
677 0 _l
547 0 _l
197 351 _l
197 0 _l
98 0 _l
98 729 _l
_cl}_d
/L{557 0 98 0 552 729 _sc
98 729 _m
197 729 _l
197 83 _l
552 83 _l
552 0 _l
98 0 _l
98 729 _l
_cl}_d
/M{863 0 98 0 765 729 _sc
98 729 _m
245 729 _l
431 233 _l
618 729 _l
765 729 _l
765 0 _l
669 0 _l
669 640 _l
481 140 _l
382 140 _l
194 640 _l
194 0 _l
98 0 _l
98 729 _l
_cl}_d
/N{748 0 98 0 650 729 _sc
98 729 _m
231 729 _l
554 119 _l
554 729 _l
650 729 _l
650 0 _l
517 0 _l
194 610 _l
194 0 _l
98 0 _l
98 729 _l
_cl}_d
/O{787 0 56 -13 731 742 _sc
394 662 _m
322 662 265 635 223 582 _c
181 528 160 456 160 364 _c
160 272 181 199 223 146 _c
265 92 322 66 394 66 _c
465 66 522 92 564 146 _c
606 199 627 272 627 364 _c
627 456 606 528 564 582 _c
522 635 465 662 394 662 _c
394 742 _m
496 742 577 707 639 639 _c
700 571 731 479 731 364 _c
731 248 700 157 639 89 _c
577 21 496 -13 394 -13 _c
291 -13 209 21 148 89 _c
86 157 56 248 56 364 _c
56 479 86 571 148 639 _c
209 707 291 742 394 742 _c
_cl}_d
/P{603 0 98 0 569 729 _sc
197 648 _m
197 374 _l
321 374 _l
367 374 402 385 427 409 _c
452 433 465 467 465 511 _c
465 555 452 588 427 612 _c
402 636 367 648 321 648 _c
197 648 _l
98 729 _m
321 729 _l
402 729 464 710 506 673 _c
548 636 569 582 569 511 _c
569 439 548 384 506 348 _c
464 311 402 293 321 293 _c
197 293 _l
197 0 _l
98 0 _l
98 729 _l
_cl}_d
/R{{695 0 98 0 666 729 _sc
444 342 _m
465 334 486 319 506 296 _c
526 272 546 240 566 199 _c
666 0 _l
560 0 _l
467 187 _l
443 235 419 268 397 284 _c
374 300 343 308 304 308 _c
197 308 _l
197 0 _l
98 0 _l
98 729 _l
321 729 _l
404 729 466 711 507 677 _c
548 642 569 589 569 519 _c
569 473 558 434 537 404 _c
515 374 484 353 444 342 _c
197 648 _m
197 389 _l
321 389 _l
}_e{368 389 404 400 428 422 _c
452 444 465 476 465 519 _c
465 561 452 593 428 615 _c
404 637 368 648 321 648 _c
197 648 _l
_cl}_e}_d
/S{{635 0 66 -13 579 742 _sc
535 705 _m
535 609 _l
497 627 462 640 429 649 _c
395 657 363 662 333 662 _c
279 662 237 651 208 631 _c
179 610 165 580 165 542 _c
165 510 174 485 194 469 _c
213 452 250 439 304 429 _c
364 417 _l
437 403 491 378 526 343 _c
561 307 579 260 579 201 _c
579 130 555 77 508 41 _c
460 5 391 -13 300 -13 _c
265 -13 228 -9 189 -2 _c
}_e{150 5 110 16 69 32 _c
69 134 _l
109 111 148 94 186 83 _c
224 71 262 66 300 66 _c
356 66 399 77 430 99 _c
460 121 476 152 476 194 _c
476 230 465 258 443 278 _c
421 298 385 313 335 323 _c
275 335 _l
201 349 148 372 115 404 _c
82 435 66 478 66 534 _c
66 598 88 649 134 686 _c
179 723 242 742 322 742 _c
356 742 390 739 426 733 _c
461 727 497 717 535 705 _c
}_e{_cl}_e}_d
/W{989 0 33 0 956 729 _sc
33 729 _m
133 729 _l
286 113 _l
439 729 _l
550 729 _l
703 113 _l
856 729 _l
956 729 _l
773 0 _l
649 0 _l
495 633 _l
340 0 _l
216 0 _l
33 729 _l
_cl}_d
/a{{613 0 60 -13 522 560 _sc
343 275 _m
270 275 220 266 192 250 _c
164 233 150 205 150 165 _c
150 133 160 107 181 89 _c
202 70 231 61 267 61 _c
317 61 357 78 387 114 _c
417 149 432 196 432 255 _c
432 275 _l
343 275 _l
522 312 _m
522 0 _l
432 0 _l
432 83 _l
411 49 385 25 355 10 _c
325 -5 287 -13 243 -13 _c
187 -13 142 2 109 33 _c
76 64 60 106 60 159 _c
}_e{60 220 80 266 122 298 _c
163 329 224 345 306 345 _c
432 345 _l
432 354 _l
432 395 418 427 391 450 _c
364 472 326 484 277 484 _c
245 484 215 480 185 472 _c
155 464 127 453 100 439 _c
100 522 _l
132 534 164 544 195 550 _c
226 556 256 560 286 560 _c
365 560 424 539 463 498 _c
502 457 522 395 522 312 _c
_cl}_e}_d
/c{{550 0 55 -13 488 560 _sc
488 526 _m
488 442 _l
462 456 437 466 411 473 _c
385 480 360 484 334 484 _c
276 484 230 465 198 428 _c
166 391 150 339 150 273 _c
150 206 166 154 198 117 _c
230 80 276 62 334 62 _c
360 62 385 65 411 72 _c
437 79 462 90 488 104 _c
488 21 _l
462 9 436 0 410 -5 _c
383 -10 354 -13 324 -13 _c
242 -13 176 12 128 64 _c
}_e{79 115 55 185 55 273 _c
55 362 79 432 128 483 _c
177 534 244 560 330 560 _c
358 560 385 557 411 551 _c
437 545 463 537 488 526 _c
_cl}_e}_d
/d{{635 0 55 -13 544 760 _sc
454 464 _m
454 760 _l
544 760 _l
544 0 _l
454 0 _l
454 82 _l
435 49 411 25 382 10 _c
353 -5 319 -13 279 -13 _c
213 -13 159 13 117 65 _c
75 117 55 187 55 273 _c
55 359 75 428 117 481 _c
159 533 213 560 279 560 _c
319 560 353 552 382 536 _c
411 520 435 496 454 464 _c
148 273 _m
148 207 161 155 188 117 _c
215 79 253 61 301 61 _c
}_e{348 61 385 79 413 117 _c
440 155 454 207 454 273 _c
454 339 440 390 413 428 _c
385 466 348 485 301 485 _c
253 485 215 466 188 428 _c
161 390 148 339 148 273 _c
_cl}_e}_d
/e{{615 0 55 -13 562 560 _sc
562 296 _m
562 252 _l
149 252 _l
153 190 171 142 205 110 _c
238 78 284 62 344 62 _c
378 62 412 66 444 74 _c
476 82 509 95 541 113 _c
541 28 _l
509 14 476 3 442 -3 _c
408 -9 373 -13 339 -13 _c
251 -13 182 12 131 62 _c
80 112 55 181 55 268 _c
55 357 79 428 127 481 _c
175 533 241 560 323 560 _c
397 560 455 536 498 489 _c
}_e{540 441 562 377 562 296 _c
472 322 _m
471 371 457 410 431 440 _c
404 469 368 484 324 484 _c
274 484 234 469 204 441 _c
174 413 156 373 152 322 _c
472 322 _l
_cl}_e}_d
/g{{635 0 55 -207 544 560 _sc
454 280 _m
454 344 440 395 414 431 _c
387 467 349 485 301 485 _c
253 485 215 467 188 431 _c
161 395 148 344 148 280 _c
148 215 161 165 188 129 _c
215 93 253 75 301 75 _c
349 75 387 93 414 129 _c
440 165 454 215 454 280 _c
544 68 _m
544 -24 523 -93 482 -139 _c
440 -184 377 -207 292 -207 _c
260 -207 231 -204 203 -200 _c
175 -195 147 -188 121 -178 _c
}_e{121 -91 _l
147 -105 173 -115 199 -122 _c
225 -129 251 -133 278 -133 _c
336 -133 380 -117 410 -87 _c
439 -56 454 -10 454 52 _c
454 96 _l
435 64 411 40 382 24 _c
353 8 319 0 279 0 _c
211 0 157 25 116 76 _c
75 127 55 195 55 280 _c
55 364 75 432 116 483 _c
157 534 211 560 279 560 _c
319 560 353 552 382 536 _c
411 520 435 496 454 464 _c
454 547 _l
544 547 _l
}_e{544 68 _l
_cl}_e}_d
/h{634 0 91 0 549 760 _sc
549 330 _m
549 0 _l
459 0 _l
459 327 _l
459 379 448 417 428 443 _c
408 469 378 482 338 482 _c
289 482 251 466 223 435 _c
195 404 181 362 181 309 _c
181 0 _l
91 0 _l
91 760 _l
181 760 _l
181 462 _l
202 494 227 519 257 535 _c
286 551 320 560 358 560 _c
420 560 468 540 500 501 _c
532 462 549 405 549 330 _c
_cl}_d
/i{278 0 94 0 184 760 _sc
94 547 _m
184 547 _l
184 0 _l
94 0 _l
94 547 _l
94 760 _m
184 760 _l
184 646 _l
94 646 _l
94 760 _l
_cl}_d
/k{579 0 91 0 576 760 _sc
91 760 _m
181 760 _l
181 311 _l
449 547 _l
564 547 _l
274 291 _l
576 0 _l
459 0 _l
181 267 _l
181 0 _l
91 0 _l
91 760 _l
_cl}_d
/l{278 0 94 0 184 760 _sc
94 760 _m
184 760 _l
184 0 _l
94 0 _l
94 760 _l
_cl}_d
/m{{974 0 91 0 889 560 _sc
520 442 _m
542 482 569 511 600 531 _c
631 550 668 560 711 560 _c
767 560 811 540 842 500 _c
873 460 889 403 889 330 _c
889 0 _l
799 0 _l
799 327 _l
799 379 789 418 771 444 _c
752 469 724 482 686 482 _c
639 482 602 466 575 435 _c
548 404 535 362 535 309 _c
535 0 _l
445 0 _l
445 327 _l
445 379 435 418 417 444 _c
398 469 369 482 331 482 _c
}_e{285 482 248 466 221 435 _c
194 404 181 362 181 309 _c
181 0 _l
91 0 _l
91 547 _l
181 547 _l
181 462 _l
201 495 226 520 255 536 _c
283 552 317 560 357 560 _c
397 560 430 550 458 530 _c
486 510 506 480 520 442 _c
_cl}_e}_d
/n{634 0 91 0 549 560 _sc
549 330 _m
549 0 _l
459 0 _l
459 327 _l
459 379 448 417 428 443 _c
408 469 378 482 338 482 _c
289 482 251 466 223 435 _c
195 404 181 362 181 309 _c
181 0 _l
91 0 _l
91 547 _l
181 547 _l
181 462 _l
202 494 227 519 257 535 _c
286 551 320 560 358 560 _c
420 560 468 540 500 501 _c
532 462 549 405 549 330 _c
_cl}_d
/o{612 0 55 -13 557 560 _sc
306 484 _m
258 484 220 465 192 427 _c
164 389 150 338 150 273 _c
150 207 163 156 191 118 _c
219 80 257 62 306 62 _c
354 62 392 80 420 118 _c
448 156 462 207 462 273 _c
462 337 448 389 420 427 _c
392 465 354 484 306 484 _c
306 560 _m
384 560 445 534 490 484 _c
534 433 557 363 557 273 _c
557 183 534 113 490 63 _c
445 12 384 -13 306 -13 _c
227 -13 165 12 121 63 _c
77 113 55 183 55 273 _c
55 363 77 433 121 484 _c
165 534 227 560 306 560 _c
_cl}_d
/p{{635 0 91 -207 580 560 _sc
181 82 _m
181 -207 _l
91 -207 _l
91 547 _l
181 547 _l
181 464 _l
199 496 223 520 252 536 _c
281 552 316 560 356 560 _c
422 560 476 533 518 481 _c
559 428 580 359 580 273 _c
580 187 559 117 518 65 _c
476 13 422 -13 356 -13 _c
316 -13 281 -5 252 10 _c
223 25 199 49 181 82 _c
487 273 _m
487 339 473 390 446 428 _c
418 466 381 485 334 485 _c
}_e{286 485 249 466 222 428 _c
194 390 181 339 181 273 _c
181 207 194 155 222 117 _c
249 79 286 61 334 61 _c
381 61 418 79 446 117 _c
473 155 487 207 487 273 _c
_cl}_e}_d
/r{411 0 91 0 411 560 _sc
411 463 _m
401 469 390 473 378 476 _c
366 478 353 480 339 480 _c
288 480 249 463 222 430 _c
194 397 181 350 181 288 _c
181 0 _l
91 0 _l
91 547 _l
181 547 _l
181 462 _l
199 495 224 520 254 536 _c
284 552 321 560 365 560 _c
371 560 378 559 386 559 _c
393 558 401 557 411 555 _c
411 463 _l
_cl}_d
/s{{521 0 54 -13 472 560 _sc
443 531 _m
443 446 _l
417 458 391 468 364 475 _c
336 481 308 485 279 485 _c
234 485 200 478 178 464 _c
156 450 145 430 145 403 _c
145 382 153 366 169 354 _c
185 342 217 330 265 320 _c
296 313 _l
360 299 405 279 432 255 _c
458 230 472 195 472 151 _c
472 100 452 60 412 31 _c
372 1 316 -13 246 -13 _c
216 -13 186 -10 154 -5 _c
}_e{122 0 89 8 54 20 _c
54 113 _l
87 95 120 82 152 74 _c
184 65 216 61 248 61 _c
290 61 323 68 346 82 _c
368 96 380 117 380 144 _c
380 168 371 187 355 200 _c
339 213 303 226 247 238 _c
216 245 _l
160 257 119 275 95 299 _c
70 323 58 356 58 399 _c
58 450 76 490 112 518 _c
148 546 200 560 268 560 _c
301 560 332 557 362 552 _c
391 547 418 540 443 531 _c
}_e{_cl}_e}_d
/t{392 0 27 0 368 702 _sc
183 702 _m
183 547 _l
368 547 _l
368 477 _l
183 477 _l
183 180 _l
183 135 189 106 201 94 _c
213 81 238 75 276 75 _c
368 75 _l
368 0 _l
276 0 _l
206 0 158 13 132 39 _c
106 65 93 112 93 180 _c
93 477 _l
27 477 _l
27 547 _l
93 547 _l
93 702 _l
183 702 _l
_cl}_d
/u{634 0 85 -13 543 560 _sc
85 216 _m
85 547 _l
175 547 _l
175 219 _l
175 167 185 129 205 103 _c
225 77 255 64 296 64 _c
344 64 383 79 411 110 _c
439 141 453 183 453 237 _c
453 547 _l
543 547 _l
543 0 _l
453 0 _l
453 84 _l
431 50 405 26 377 10 _c
348 -5 315 -13 277 -13 _c
214 -13 166 6 134 45 _c
101 83 85 140 85 216 _c
311 560 _m
311 560 _l
_cl}_d
/w{818 0 42 0 776 547 _sc
42 547 _m
132 547 _l
244 120 _l
356 547 _l
462 547 _l
574 120 _l
686 547 _l
776 547 _l
633 0 _l
527 0 _l
409 448 _l
291 0 _l
185 0 _l
42 547 _l
_cl}_d
/z{525 0 43 0 482 547 _sc
55 547 _m
482 547 _l
482 465 _l
144 72 _l
482 72 _l
482 0 _l
43 0 _l
43 82 _l
381 475 _l
55 475 _l
55 547 _l
_cl}_d
end readonly def

/BuildGlyph
 {exch begin
 CharStrings exch
 2 copy known not{pop /.notdef}if
 true 3 1 roll get exec
 end}_d

/BuildChar {
 1 index /Encoding get exch get
 1 index /BuildGlyph get exec
}_d

FontName currentdict end definefont pop
end
%%EndProlog
mpldict begin
79.2 223.2 translate
453.6 345.6 0 0 clipbox
gsave
0 0 m
453.6 0 l
453.6 345.6 l
0 345.6 l
cl
1.000 setgray
fill
grestore
gsave
59.7825 51.12 m
420.975 51.12 l
420.975 306.4504 l
59.7825 306.4504 l
cl
1.000 setgray
fill
grestore
1.000 setlinewidth
0 setlinejoin
2 setlinecap
[] 0 setdash
0.000 setgray
gsave
59.7825 51.12 m
59.7825 306.4504 l
stroke
grestore
gsave
420.975 51.12 m
420.975 306.4504 l
stroke
grestore
gsave
59.7825 51.12 m
420.975 51.12 l
stroke
grestore
gsave
59.7825 306.4504 m
420.975 306.4504 l
stroke
grestore
0.500 setlinewidth
1 setlinejoin
0 setlinecap
[] 0 setdash
gsave
/o {
gsave
newpath
translate
0.5 setlinewidth
1 setlinejoin
0 setlinecap
0 0 m
0 4 l

gsave
0.000 setgray
fill
grestore
stroke
grestore
} bind def
79.26 51.12 o
grestore
gsave
/o {
gsave
newpath
translate
0.5 setlinewidth
1 setlinejoin
0 setlinecap
0 0 m
0 -4 l

gsave
0.000 setgray
fill
grestore
stroke
grestore
} bind def
79.26 306.45 o
grestore
/DejaVuSans findfont
14.000 scalefont
setfont
gsave
65.900595 36.479375 translate
0.000000 rotate
0.000000 0.000000 m /one glyphshow
8.907227 0.000000 m /three glyphshow
17.814453 0.000000 m /five glyphshow
grestore
gsave
/o {
gsave
newpath
translate
0.5 setlinewidth
1 setlinejoin
0 setlinecap
0 0 m
0 4 l

gsave
0.000 setgray
fill
grestore
stroke
grestore
} bind def
115.064 51.12 o
grestore
gsave
/o {
gsave
newpath
translate
0.5 setlinewidth
1 setlinejoin
0 setlinecap
0 0 m
0 -4 l

gsave
0.000 setgray
fill
grestore
stroke
grestore
} bind def
115.064 306.45 o
grestore
gsave
101.704769 36.479375 translate
0.000000 rotate
0.000000 0.000000 m /one glyphshow
8.907227 0.000000 m /four glyphshow
17.814453 0.000000 m /zero glyphshow
grestore
gsave
/o {
gsave
newpath
translate
0.5 setlinewidth
1 setlinejoin
0 setlinecap
0 0 m
0 4 l

gsave
0.000 setgray
fill
grestore
stroke
grestore
} bind def
150.868 51.12 o
grestore
gsave
/o {
gsave
newpath
translate
0.5 setlinewidth
1 setlinejoin
0 setlinecap
0 0 m
0 -4 l

gsave
0.000 setgray
fill
grestore
stroke
grestore
} bind def
150.868 306.45 o
grestore
gsave
137.508942 36.479375 translate
0.000000 rotate
0.000000 0.000000 m /one glyphshow
8.907227 0.000000 m /four glyphshow
17.814453 0.000000 m /five glyphshow
grestore
gsave
/o {
gsave
newpath
translate
0.5 setlinewidth
1 setlinejoin
0 setlinecap
0 0 m
0 4 l

gsave
0.000 setgray
fill
grestore
stroke
grestore
} bind def
186.672 51.12 o
grestore
gsave
/o {
gsave
newpath
translate
0.5 setlinewidth
1 setlinejoin
0 setlinecap
0 0 m
0 -4 l

gsave
0.000 setgray
fill
grestore
stroke
grestore
} bind def
186.672 306.45 o
grestore
gsave
173.313115 36.479375 translate
0.000000 rotate
0.000000 0.000000 m /one glyphshow
8.907227 0.000000 m /five glyphshow
17.814453 0.000000 m /zero glyphshow
grestore
gsave
/o {
gsave
newpath
translate
0.5 setlinewidth
1 setlinejoin
0 setlinecap
0 0 m
0 4 l

gsave
0.000 setgray
fill
grestore
stroke
grestore
} bind def
222.477 51.12 o
grestore
gsave
/o {
gsave
newpath
translate
0.5 setlinewidth
1 setlinejoin
0 setlinecap
0 0 m
0 -4 l

gsave
0.000 setgray
fill
grestore
stroke
grestore
} bind def
222.477 306.45 o
grestore
gsave
209.117288 36.479375 translate
0.000000 rotate
0.000000 0.000000 m /one glyphshow
8.907227 0.000000 m /five glyphshow
17.814453 0.000000 m /five glyphshow
grestore
gsave
/o {
gsave
newpath
translate
0.5 setlinewidth
1 setlinejoin
0 setlinecap
0 0 m
0 4 l

gsave
0.000 setgray
fill
grestore
stroke
grestore
} bind def
258.281 51.12 o
grestore
gsave
/o {
gsave
newpath
translate
0.5 setlinewidth
1 setlinejoin
0 setlinecap
0 0 m
0 -4 l

gsave
0.000 setgray
fill
grestore
stroke
grestore
} bind def
258.281 306.45 o
grestore
gsave
244.921462 36.479375 translate
0.000000 rotate
0.000000 0.000000 m /one glyphshow
8.907227 0.000000 m /six glyphshow
17.814453 0.000000 m /zero glyphshow
grestore
gsave
/o {
gsave
newpath
translate
0.5 setlinewidth
1 setlinejoin
0 setlinecap
0 0 m
0 4 l

gsave
0.000 setgray
fill
grestore
stroke
grestore
} bind def
294.085 51.12 o
grestore
gsave
/o {
gsave
newpath
translate
0.5 setlinewidth
1 setlinejoin
0 setlinecap
0 0 m
0 -4 l

gsave
0.000 setgray
fill
grestore
stroke
grestore
} bind def
294.085 306.45 o
grestore
gsave
280.725635 36.479375 translate
0.000000 rotate
0.000000 0.000000 m /one glyphshow
8.907227 0.000000 m /six glyphshow
17.814453 0.000000 m /five glyphshow
grestore
gsave
/o {
gsave
newpath
translate
0.5 setlinewidth
1 setlinejoin
0 setlinecap
0 0 m
0 4 l

gsave
0.000 setgray
fill
grestore
stroke
grestore
} bind def
329.889 51.12 o
grestore
gsave
/o {
gsave
newpath
translate
0.5 setlinewidth
1 setlinejoin
0 setlinecap
0 0 m
0 -4 l

gsave
0.000 setgray
fill
grestore
stroke
grestore
} bind def
329.889 306.45 o
grestore
gsave
316.529808 36.479375 translate
0.000000 rotate
0.000000 0.000000 m /one glyphshow
8.907227 0.000000 m /seven glyphshow
17.814453 0.000000 m /zero glyphshow
grestore
gsave
/o {
gsave
newpath
translate
0.5 setlinewidth
1 setlinejoin
0 setlinecap
0 0 m
0 4 l

gsave
0.000 setgray
fill
grestore
stroke
grestore
} bind def
365.693 51.12 o
grestore
gsave
/o {
gsave
newpath
translate
0.5 setlinewidth
1 setlinejoin
0 setlinecap
0 0 m
0 -4 l

gsave
0.000 setgray
fill
grestore
stroke
grestore
} bind def
365.693 306.45 o
grestore
gsave
352.333981 36.479375 translate
0.000000 rotate
0.000000 0.000000 m /one glyphshow
8.907227 0.000000 m /seven glyphshow
17.814453 0.000000 m /five glyphshow
grestore
gsave
/o {
gsave
newpath
translate
0.5 setlinewidth
1 setlinejoin
0 setlinecap
0 0 m
0 4 l

gsave
0.000 setgray
fill
grestore
stroke
grestore
} bind def
401.498 51.12 o
grestore
gsave
/o {
gsave
newpath
translate
0.5 setlinewidth
1 setlinejoin
0 setlinecap
0 0 m
0 -4 l

gsave
0.000 setgray
fill
grestore
stroke
grestore
} bind def
401.498 306.45 o
grestore
gsave
388.138155 36.479375 translate
0.000000 rotate
0.000000 0.000000 m /one glyphshow
8.907227 0.000000 m /eight glyphshow
17.814453 0.000000 m /zero glyphshow
grestore
gsave
97.503750 17.932500 translate
0.000000 rotate
0.000000 0.000000 m /P glyphshow
8.442383 0.000000 m /e glyphshow
17.055664 0.000000 m /r glyphshow
22.811523 0.000000 m /hyphen glyphshow
27.863281 0.000000 m /N glyphshow
38.335938 0.000000 m /o glyphshow
46.901367 0.000000 m /d glyphshow
55.788086 0.000000 m /e glyphshow
64.401367 0.000000 m /space glyphshow
68.851562 0.000000 m /S glyphshow
77.738281 0.000000 m /o glyphshow
86.303711 0.000000 m /c glyphshow
94.000977 0.000000 m /k glyphshow
102.108398 0.000000 m /e glyphshow
110.721680 0.000000 m /t glyphshow
116.210938 0.000000 m /plus glyphshow
127.941406 0.000000 m /D glyphshow
138.721680 0.000000 m /R glyphshow
148.449219 0.000000 m /A glyphshow
158.026367 0.000000 m /M glyphshow
170.105469 0.000000 m /space glyphshow
174.555664 0.000000 m /P glyphshow
182.998047 0.000000 m /o glyphshow
191.563477 0.000000 m /w glyphshow
203.013672 0.000000 m /e glyphshow
211.626953 0.000000 m /r glyphshow
217.382812 0.000000 m /space glyphshow
221.833008 0.000000 m /L glyphshow
229.632812 0.000000 m /i glyphshow
233.522461 0.000000 m /m glyphshow
247.160156 0.000000 m /i glyphshow
251.049805 0.000000 m /t glyphshow
256.539062 0.000000 m /space glyphshow
260.989258 0.000000 m /parenleft glyphshow
266.451172 0.000000 m /W glyphshow
280.293945 0.000000 m /parenright glyphshow
grestore
[6 6] 0 setdash
gsave
361.2 255.3 59.78 51.12 clipbox
59.7825 65.305022 m
420.975 65.305022 l
stroke
grestore
[] 0 setdash
gsave
/o {
gsave
newpath
translate
0.5 setlinewidth
1 setlinejoin
0 setlinecap
0 0 m
4 0 l

gsave
0.000 setgray
fill
grestore
stroke
grestore
} bind def
59.7825 65.305 o
grestore
gsave
/o {
gsave
newpath
translate
0.5 setlinewidth
1 setlinejoin
0 setlinecap
0 0 m
-4 0 l

gsave
0.000 setgray
fill
grestore
stroke
grestore
} bind def
420.975 65.305 o
grestore
gsave
33.516875 59.984710 translate
0.000000 rotate
0.000000 0.000000 m /zero glyphshow
8.907227 0.000000 m /period glyphshow
13.357422 0.000000 m /two glyphshow
grestore
[6 6] 0 setdash
gsave
361.2 255.3 59.78 51.12 clipbox
59.7825 93.675067 m
420.975 93.675067 l
stroke
grestore
[] 0 setdash
gsave
/o {
gsave
newpath
translate
0.5 setlinewidth
1 setlinejoin
0 setlinecap
0 0 m
4 0 l

gsave
0.000 setgray
fill
grestore
stroke
grestore
} bind def
59.7825 93.6751 o
grestore
gsave
/o {
gsave
newpath
translate
0.5 setlinewidth
1 setlinejoin
0 setlinecap
0 0 m
-4 0 l

gsave
0.000 setgray
fill
grestore
stroke
grestore
} bind def
420.975 93.6751 o
grestore
gsave
33.516875 88.354754 translate
0.000000 rotate
0.000000 0.000000 m /zero glyphshow
8.907227 0.000000 m /period glyphshow
13.357422 0.000000 m /four glyphshow
grestore
[6 6] 0 setdash
gsave
361.2 255.3 59.78 51.12 clipbox
59.7825 122.045111 m
420.975 122.045111 l
stroke
grestore
[] 0 setdash
gsave
/o {
gsave
newpath
translate
0.5 setlinewidth
1 setlinejoin
0 setlinecap
0 0 m
4 0 l

gsave
0.000 setgray
fill
grestore
stroke
grestore
} bind def
59.7825 122.045 o
grestore
gsave
/o {
gsave
newpath
translate
0.5 setlinewidth
1 setlinejoin
0 setlinecap
0 0 m
-4 0 l

gsave
0.000 setgray
fill
grestore
stroke
grestore
} bind def
420.975 122.045 o
grestore
gsave
33.516875 116.724799 translate
0.000000 rotate
0.000000 0.000000 m /zero glyphshow
8.907227 0.000000 m /period glyphshow
13.357422 0.000000 m /six glyphshow
grestore
[6 6] 0 setdash
gsave
361.2 255.3 59.78 51.12 clipbox
59.7825 150.415156 m
420.975 150.415156 l
stroke
grestore
[] 0 setdash
gsave
/o {
gsave
newpath
translate
0.5 setlinewidth
1 setlinejoin
0 setlinecap
0 0 m
4 0 l

gsave
0.000 setgray
fill
grestore
stroke
grestore
} bind def
59.7825 150.415 o
grestore
gsave
/o {
gsave
newpath
translate
0.5 setlinewidth
1 setlinejoin
0 setlinecap
0 0 m
-4 0 l

gsave
0.000 setgray
fill
grestore
stroke
grestore
} bind def
420.975 150.415 o
grestore
gsave
33.516875 145.094843 translate
0.000000 rotate
0.000000 0.000000 m /zero glyphshow
8.907227 0.000000 m /period glyphshow
13.357422 0.000000 m /eight glyphshow
grestore
[6 6] 0 setdash
gsave
361.2 255.3 59.78 51.12 clipbox
59.7825 178.7852 m
420.975 178.7852 l
stroke
grestore
[] 0 setdash
gsave
/o {
gsave
newpath
translate
0.5 setlinewidth
1 setlinejoin
0 setlinecap
0 0 m
4 0 l

gsave
0.000 setgray
fill
grestore
stroke
grestore
} bind def
59.7825 178.785 o
grestore
gsave
/o {
gsave
newpath
translate
0.5 setlinewidth
1 setlinejoin
0 setlinecap
0 0 m
-4 0 l

gsave
0.000 setgray
fill
grestore
stroke
grestore
} bind def
420.975 178.785 o
grestore
gsave
33.516875 173.464888 translate
0.000000 rotate
0.000000 0.000000 m /one glyphshow
8.907227 0.000000 m /period glyphshow
13.357422 0.000000 m /zero glyphshow
grestore
[6 6] 0 setdash
gsave
361.2 255.3 59.78 51.12 clipbox
59.7825 207.155244 m
420.975 207.155244 l
stroke
grestore
[] 0 setdash
gsave
/o {
gsave
newpath
translate
0.5 setlinewidth
1 setlinejoin
0 setlinecap
0 0 m
4 0 l

gsave
0.000 setgray
fill
grestore
stroke
grestore
} bind def
59.7825 207.155 o
grestore
gsave
/o {
gsave
newpath
translate
0.5 setlinewidth
1 setlinejoin
0 setlinecap
0 0 m
-4 0 l

gsave
0.000 setgray
fill
grestore
stroke
grestore
} bind def
420.975 207.155 o
grestore
gsave
33.516875 201.834932 translate
0.000000 rotate
0.000000 0.000000 m /one glyphshow
8.907227 0.000000 m /period glyphshow
13.357422 0.000000 m /two glyphshow
grestore
[6 6] 0 setdash
gsave
361.2 255.3 59.78 51.12 clipbox
59.7825 235.525289 m
420.975 235.525289 l
stroke
grestore
[] 0 setdash
gsave
/o {
gsave
newpath
translate
0.5 setlinewidth
1 setlinejoin
0 setlinecap
0 0 m
4 0 l

gsave
0.000 setgray
fill
grestore
stroke
grestore
} bind def
59.7825 235.525 o
grestore
gsave
/o {
gsave
newpath
translate
0.5 setlinewidth
1 setlinejoin
0 setlinecap
0 0 m
-4 0 l

gsave
0.000 setgray
fill
grestore
stroke
grestore
} bind def
420.975 235.525 o
grestore
gsave
33.516875 230.204976 translate
0.000000 rotate
0.000000 0.000000 m /one glyphshow
8.907227 0.000000 m /period glyphshow
13.357422 0.000000 m /four glyphshow
grestore
[6 6] 0 setdash
gsave
361.2 255.3 59.78 51.12 clipbox
59.7825 263.895333 m
420.975 263.895333 l
stroke
grestore
[] 0 setdash
gsave
/o {
gsave
newpath
translate
0.5 setlinewidth
1 setlinejoin
0 setlinecap
0 0 m
4 0 l

gsave
0.000 setgray
fill
grestore
stroke
grestore
} bind def
59.7825 263.895 o
grestore
gsave
/o {
gsave
newpath
translate
0.5 setlinewidth
1 setlinejoin
0 setlinecap
0 0 m
-4 0 l

gsave
0.000 setgray
fill
grestore
stroke
grestore
} bind def
420.975 263.895 o
grestore
gsave
33.516875 258.575021 translate
0.000000 rotate
0.000000 0.000000 m /one glyphshow
8.907227 0.000000 m /period glyphshow
13.357422 0.000000 m /six glyphshow
grestore
[6 6] 0 setdash
gsave
361.2 255.3 59.78 51.12 clipbox
59.7825 292.265378 m
420.975 292.265378 l
stroke
grestore
[] 0 setdash
gsave
/o {
gsave
newpath
translate
0.5 setlinewidth
1 setlinejoin
0 setlinecap
0 0 m
4 0 l

gsave
0.000 setgray
fill
grestore
stroke
grestore
} bind def
59.7825 292.265 o
grestore
gsave
/o {
gsave
newpath
translate
0.5 setlinewidth
1 setlinejoin
0 setlinecap
0 0 m
-4 0 l

gsave
0.000 setgray
fill
grestore
stroke
grestore
} bind def
420.975 292.265 o
grestore
gsave
33.516875 286.945065 translate
0.000000 rotate
0.000000 0.000000 m /one glyphshow
8.907227 0.000000 m /period glyphshow
13.357422 0.000000 m /eight glyphshow
grestore
gsave
25.610625 107.191450 translate
90.000000 rotate
0.000000 0.000000 m /N glyphshow
10.472656 0.000000 m /o glyphshow
19.038086 0.000000 m /r glyphshow
24.793945 0.000000 m /m glyphshow
38.431641 0.000000 m /a glyphshow
47.010742 0.000000 m /l glyphshow
50.900391 0.000000 m /i glyphshow
54.790039 0.000000 m /z glyphshow
62.138672 0.000000 m /e glyphshow
70.751953 0.000000 m /d glyphshow
79.638672 0.000000 m /space glyphshow
84.088867 0.000000 m /R glyphshow
93.816406 0.000000 m /u glyphshow
102.689453 0.000000 m /n glyphshow
111.562500 0.000000 m /t glyphshow
117.051758 0.000000 m /i glyphshow
120.941406 0.000000 m /m glyphshow
134.579102 0.000000 m /e glyphshow
grestore
1.000 setlinewidth
0 setlinejoin
[] 0 setdash
gsave
361.2 255.3 59.78 51.12 clipbox
79.25997 36.934978 m
91.791431 36.934978 l
91.791431 213.7885 l
79.25997 213.7885 l
cl
gsave
0.000 1.000 1.000 setrgbcolor
fill
grestore
stroke
grestore
gsave
361.2 255.3 59.78 51.12 clipbox
115.064144 36.934978 m
127.595604 36.934978 l
127.595604 207.569899 l
115.064144 207.569899 l
cl
gsave
0.000 1.000 1.000 setrgbcolor
fill
grestore
stroke
grestore
gsave
361.2 255.3 59.78 51.12 clipbox
150.868317 36.934978 m
163.399777 36.934978 l
163.399777 198.899939 l
150.868317 198.899939 l
cl
gsave
0.000 1.000 1.000 setrgbcolor
fill
grestore
stroke
grestore
gsave
361.2 255.3 59.78 51.12 clipbox
186.67249 36.934978 m
199.203951 36.934978 l
199.203951 195.810959 l
186.67249 195.810959 l
cl
gsave
0.000 1.000 1.000 setrgbcolor
fill
grestore
stroke
grestore
gsave
361.2 255.3 59.78 51.12 clipbox
222.476663 36.934978 m
235.008124 36.934978 l
235.008124 190.591049 l
222.476663 190.591049 l
cl
gsave
0.000 1.000 1.000 setrgbcolor
fill
grestore
stroke
grestore
gsave
361.2 255.3 59.78 51.12 clipbox
258.280837 36.934978 m
270.812297 36.934978 l
270.812297 186.906557 l
258.280837 186.906557 l
cl
gsave
0.000 1.000 1.000 setrgbcolor
fill
grestore
stroke
grestore
gsave
361.2 255.3 59.78 51.12 clipbox
294.08501 36.934978 m
306.616471 36.934978 l
306.616471 184.057084 l
294.08501 184.057084 l
cl
gsave
0.000 1.000 1.000 setrgbcolor
fill
grestore
stroke
grestore
gsave
361.2 255.3 59.78 51.12 clipbox
329.889183 36.934978 m
342.420644 36.934978 l
342.420644 177.387138 l
329.889183 177.387138 l
cl
gsave
0.000 1.000 1.000 setrgbcolor
fill
grestore
stroke
grestore
gsave
361.2 255.3 59.78 51.12 clipbox
365.693356 36.934978 m
378.224817 36.934978 l
378.224817 174.616393 l
365.693356 174.616393 l
cl
gsave
0.000 1.000 1.000 setrgbcolor
fill
grestore
stroke
grestore
gsave
361.2 255.3 59.78 51.12 clipbox
401.49753 36.934978 m
414.02899 36.934978 l
414.02899 173.316999 l
401.49753 173.316999 l
cl
gsave
0.000 1.000 1.000 setrgbcolor
fill
grestore
stroke
grestore
gsave
361.2 255.3 59.78 51.12 clipbox
66.72851 36.934978 m
79.25997 36.934978 l
79.25997 276.541432 l
66.72851 276.541432 l
cl
gsave
0.000 0.000 1.000 setrgbcolor
fill
grestore
stroke
grestore
gsave
361.2 255.3 59.78 51.12 clipbox
102.532683 36.934978 m
115.064144 36.934978 l
115.064144 247.442777 l
102.532683 247.442777 l
cl
gsave
0.000 0.000 1.000 setrgbcolor
fill
grestore
stroke
grestore
gsave
361.2 255.3 59.78 51.12 clipbox
138.336856 36.934978 m
150.868317 36.934978 l
150.868317 224.335693 l
138.336856 224.335693 l
cl
gsave
0.000 0.000 1.000 setrgbcolor
fill
grestore
stroke
grestore
gsave
361.2 255.3 59.78 51.12 clipbox
174.141029 36.934978 m
186.67249 36.934978 l
186.67249 216.034486 l
174.141029 216.034486 l
cl
gsave
0.000 0.000 1.000 setrgbcolor
fill
grestore
stroke
grestore
gsave
361.2 255.3 59.78 51.12 clipbox
209.945203 36.934978 m
222.476663 36.934978 l
222.476663 204.955947 l
209.945203 204.955947 l
cl
gsave
0.000 0.000 1.000 setrgbcolor
fill
grestore
stroke
grestore
gsave
361.2 255.3 59.78 51.12 clipbox
245.749376 36.934978 m
258.280837 36.934978 l
258.280837 201.375067 l
245.749376 201.375067 l
cl
gsave
0.000 0.000 1.000 setrgbcolor
fill
grestore
stroke
grestore
gsave
361.2 255.3 59.78 51.12 clipbox
281.553549 36.934978 m
294.08501 36.934978 l
294.08501 195.179879 l
281.553549 195.179879 l
cl
gsave
0.000 0.000 1.000 setrgbcolor
fill
grestore
stroke
grestore
gsave
361.2 255.3 59.78 51.12 clipbox
317.357723 36.934978 m
329.889183 36.934978 l
329.889183 189.058096 l
317.357723 189.058096 l
cl
gsave
0.000 0.000 1.000 setrgbcolor
fill
grestore
stroke
grestore
gsave
361.2 255.3 59.78 51.12 clipbox
353.161896 36.934978 m
365.693356 36.934978 l
365.693356 182.955114 l
353.161896 182.955114 l
cl
gsave
0.000 0.000 1.000 setrgbcolor
fill
grestore
stroke
grestore
gsave
361.2 255.3 59.78 51.12 clipbox
388.966069 36.934978 m
401.49753 36.934978 l
401.49753 178.7852 l
388.966069 178.7852 l
cl
gsave
0.000 0.000 1.000 setrgbcolor
fill
grestore
stroke
grestore
/DejaVuSans findfont
16.800 scalefont
setfont
gsave
47.628750 316.557008 translate
0.000000 rotate
0.000000 0.000000 m /C glyphshow
11.695557 0.000000 m /O glyphshow
24.879639 0.000000 m /M glyphshow
39.331421 0.000000 m /D glyphshow
52.229248 0.000000 m /space glyphshow
57.553589 0.000000 m /R glyphshow
69.191895 0.000000 m /u glyphshow
79.807861 0.000000 m /n glyphshow
90.423828 0.000000 m /t glyphshow
96.991333 0.000000 m /i glyphshow
101.645020 0.000000 m /m glyphshow
117.961548 0.000000 m /e glyphshow
128.266724 0.000000 m /space glyphshow
133.591064 0.000000 m /C glyphshow
145.286621 0.000000 m /o glyphshow
155.534546 0.000000 m /m glyphshow
171.851074 0.000000 m /p glyphshow
182.483398 0.000000 m /a glyphshow
192.747681 0.000000 m /r glyphshow
199.634155 0.000000 m /i glyphshow
204.287842 0.000000 m /s glyphshow
213.014526 0.000000 m /o glyphshow
223.262451 0.000000 m /n glyphshow
233.878418 0.000000 m /space glyphshow
239.202759 0.000000 m /hyphen glyphshow
245.246826 0.000000 m /space glyphshow
250.571167 0.000000 m /K glyphshow
261.555176 0.000000 m /n glyphshow
272.171143 0.000000 m /i glyphshow
276.824829 0.000000 m /g glyphshow
287.457153 0.000000 m /h glyphshow
298.073120 0.000000 m /t glyphshow
304.640625 0.000000 m /s glyphshow
313.367310 0.000000 m /space glyphshow
318.691650 0.000000 m /L glyphshow
328.023560 0.000000 m /a glyphshow
338.287842 0.000000 m /n glyphshow
348.903809 0.000000 m /d glyphshow
359.536133 0.000000 m /i glyphshow
364.189819 0.000000 m /n glyphshow
374.805786 0.000000 m /g glyphshow
grestore
0.300 setgray
gsave
259.46875 252.15665 m
413.175 252.15665 l
415.041667 252.15665 415.975 253.089983 415.975 254.95665 c
415.975 294.6504 l
415.975 296.517067 415.041667 297.4504 413.175 297.4504 c
259.46875 297.4504 l
257.602083 297.4504 256.66875 296.517067 256.66875 294.6504 c
256.66875 254.95665 l
256.66875 253.089983 257.602083 252.15665 259.46875 252.15665 c
cl
gsave
fill
grestore
stroke
grestore
0.000 setgray
gsave
257.46875 254.15665 m
411.175 254.15665 l
413.041667 254.15665 413.975 255.089983 413.975 256.95665 c
413.975 296.6504 l
413.975 298.517067 413.041667 299.4504 411.175 299.4504 c
257.46875 299.4504 l
255.602083 299.4504 254.66875 298.517067 254.66875 296.6504 c
254.66875 256.95665 l
254.66875 255.089983 255.602083 254.15665 257.46875 254.15665 c
cl
gsave
1.000 setgray
fill
grestore
stroke
grestore
gsave
260.26875 283.209775 m
288.26875 283.209775 l
288.26875 293.009775 l
260.26875 293.009775 l
cl
gsave
0.000 1.000 1.000 setrgbcolor
fill
grestore
stroke
grestore
/DejaVuSans findfont
14.000 scalefont
setfont
gsave
299.468750 283.209775 translate
0.000000 rotate
0.000000 0.000000 m /B glyphshow
9.604492 0.000000 m /a glyphshow
18.183594 0.000000 m /l glyphshow
22.073242 0.000000 m /a glyphshow
30.652344 0.000000 m /n glyphshow
39.525391 0.000000 m /c glyphshow
47.222656 0.000000 m /e glyphshow
55.835938 0.000000 m /r glyphshow
61.591797 0.000000 m /space glyphshow
66.041992 0.000000 m /P glyphshow
74.484375 0.000000 m /l glyphshow
78.374023 0.000000 m /u glyphshow
87.247070 0.000000 m /g glyphshow
96.133789 0.000000 m /i glyphshow
100.023438 0.000000 m /n glyphshow
grestore
gsave
260.26875 262.6629 m
288.26875 262.6629 l
288.26875 272.4629 l
260.26875 272.4629 l
cl
gsave
0.000 0.000 1.000 setrgbcolor
fill
grestore
stroke
grestore
gsave
299.468750 262.662900 translate
0.000000 rotate
0.000000 0.000000 m /B glyphshow
9.604492 0.000000 m /a glyphshow
18.183594 0.000000 m /s glyphshow
25.477539 0.000000 m /e glyphshow
34.090820 0.000000 m /l glyphshow
37.980469 0.000000 m /i glyphshow
41.870117 0.000000 m /n glyphshow
50.743164 0.000000 m /e glyphshow
grestore
2.000 setlinewidth
1 setlinejoin
[] 0 setdash
1.000 0.000 0.000 setrgbcolor
gsave
361.2 255.3 59.78 51.12 clipbox
85.525701 213.313726 m
85.525701 214.176442 l
stroke
grestore
gsave
361.2 255.3 59.78 51.12 clipbox
121.329874 206.598288 m
121.329874 209.067333 l
stroke
grestore
gsave
361.2 255.3 59.78 51.12 clipbox
157.134047 198.242926 m
157.134047 200.085931 l
stroke
grestore
gsave
361.2 255.3 59.78 51.12 clipbox
192.93822 194.854668 m
192.93822 196.572465 l
stroke
grestore
gsave
361.2 255.3 59.78 51.12 clipbox
228.742394 189.344588 m
228.742394 192.165744 l
stroke
grestore
gsave
361.2 255.3 59.78 51.12 clipbox
264.546567 186.273627 m
264.546567 187.739021 l
stroke
grestore
gsave
361.2 255.3 59.78 51.12 clipbox
300.35074 180.517558 m
300.35074 185.856775 l
stroke
grestore
gsave
361.2 255.3 59.78 51.12 clipbox
336.154914 176.24933 m
336.154914 180.333563 l
stroke
grestore
gsave
361.2 255.3 59.78 51.12 clipbox
371.959087 173.209518 m
371.959087 176.650302 l
stroke
grestore
gsave
361.2 255.3 59.78 51.12 clipbox
407.76326 172.408949 m
407.76326 174.673844 l
stroke
grestore
gsave
361.2 255.3 59.78 51.12 clipbox
72.99424 262.389259 m
72.99424 292.115534 l
stroke
grestore
gsave
361.2 255.3 59.78 51.12 clipbox
108.798413 242.878146 m
108.798413 254.029317 l
stroke
grestore
gsave
361.2 255.3 59.78 51.12 clipbox
144.602586 222.501264 m
144.602586 226.28347 l
stroke
grestore
gsave
361.2 255.3 59.78 51.12 clipbox
180.40676 213.238906 m
180.40676 217.874666 l
stroke
grestore
gsave
361.2 255.3 59.78 51.12 clipbox
216.210933 204.648398 m
216.210933 205.566083 l
stroke
grestore
gsave
361.2 255.3 59.78 51.12 clipbox
252.015106 198.723909 m
252.015106 204.636182 l
stroke
grestore
gsave
361.2 255.3 59.78 51.12 clipbox
287.81928 192.817743 m
287.81928 198.287207 l
stroke
grestore
gsave
361.2 255.3 59.78 51.12 clipbox
323.623453 188.299099 m
323.623453 190.773184 l
stroke
grestore
gsave
361.2 255.3 59.78 51.12 clipbox
359.427626 181.587173 m
359.427626 184.648515 l
stroke
grestore
gsave
361.2 255.3 59.78 51.12 clipbox
395.231799 177.849706 m
395.231799 179.901289 l
stroke
grestore
gsave
361.2 255.3 59.78 51.12 clipbox
/o {
gsave
newpath
translate
2.0 setlinewidth
1 setlinejoin
0 setlinecap
3 -0 m
-3 0 l

gsave
1.000 0.000 0.000 setrgbcolor
fill
grestore
stroke
grestore
} bind def
85.5257 213.314 o
121.33 206.598 o
157.134 198.243 o
192.938 194.855 o
228.742 189.345 o
264.547 186.274 o
300.351 180.518 o
336.155 176.249 o
371.959 173.21 o
407.763 172.409 o
grestore
gsave
361.2 255.3 59.78 51.12 clipbox
/o {
gsave
newpath
translate
2.0 setlinewidth
1 setlinejoin
0 setlinecap
3 -0 m
-3 0 l

gsave
1.000 0.000 0.000 setrgbcolor
fill
grestore
stroke
grestore
} bind def
85.5257 214.176 o
121.33 209.067 o
157.134 200.086 o
192.938 196.572 o
228.742 192.166 o
264.547 187.739 o
300.351 185.857 o
336.155 180.334 o
371.959 176.65 o
407.763 174.674 o
grestore
gsave
361.2 255.3 59.78 51.12 clipbox
/o {
gsave
newpath
translate
2.0 setlinewidth
1 setlinejoin
0 setlinecap
3 -0 m
-3 0 l

gsave
1.000 0.000 0.000 setrgbcolor
fill
grestore
stroke
grestore
} bind def
72.9942 262.389 o
108.798 242.878 o
144.603 222.501 o
180.407 213.239 o
216.211 204.648 o
252.015 198.724 o
287.819 192.818 o
323.623 188.299 o
359.428 181.587 o
395.232 177.85 o
grestore
gsave
361.2 255.3 59.78 51.12 clipbox
/o {
gsave
newpath
translate
2.0 setlinewidth
1 setlinejoin
0 setlinecap
3 -0 m
-3 0 l

gsave
1.000 0.000 0.000 setrgbcolor
fill
grestore
stroke
grestore
} bind def
72.9942 292.116 o
108.798 254.029 o
144.603 226.283 o
180.407 217.875 o
216.211 205.566 o
252.015 204.636 o
287.819 198.287 o
323.623 190.773 o
359.428 184.649 o
395.232 179.901 o
grestore

end
showpage
