%!PS-Adobe-3.0 EPSF-3.0
%%Title: figures/hacc-12-node-new-governor/hacc_135_balanced_iteration_power.eps
%%Creator: matplotlib version 2.0.0, http://matplotlib.org/
%%CreationDate: Tue Mar 21 14:16:52 2017
%%Orientation: portrait
%%BoundingBox: 54 180 558 612
%%EndComments
%%BeginProlog
/mpldict 8 dict def
mpldict begin
/m { moveto } bind def
/l { lineto } bind def
/r { rlineto } bind def
/c { curveto } bind def
/cl { closepath } bind def
/box {
m
1 index 0 r
0 exch r
neg 0 r
cl
} bind def
/clipbox {
box
clip
newpath
} bind def
%!PS-Adobe-3.0 Resource-Font
%%Title: DejaVu Sans
%%Copyright: Copyright (c) 2003 by Bitstream, Inc. All Rights Reserved. Copyright (c) 2006 by Tavmjong Bah. All Rights Reserved. DejaVu changes are in public domain 
%%Creator: Converted from TrueType to type 3 by PPR
25 dict begin
/_d{bind def}bind def
/_m{moveto}_d
/_l{lineto}_d
/_cl{closepath eofill}_d
/_c{curveto}_d
/_sc{7 -1 roll{setcachedevice}{pop pop pop pop pop pop}ifelse}_d
/_e{exec}_d
/FontName /DejaVuSans def
/PaintType 0 def
/FontMatrix[.001 0 0 .001 0 0]def
/FontBBox[-1021 -463 1793 1232]def
/FontType 3 def
/Encoding [ /space /numbersign /parenleft /parenright /plus /hyphen /zero /one /two /three /four /five /six /seven /eight /nine /at /A /C /D /H /I /K /L /M /N /P /R /S /W /a /c /d /e /g /h /i /k /l /m /n /o /p /r /s /t /w /z ] def
/FontInfo 10 dict dup begin
/FamilyName (DejaVu Sans) def
/FullName (DejaVu Sans) def
/Notice (Copyright (c) 2003 by Bitstream, Inc. All Rights Reserved. Copyright (c) 2006 by Tavmjong Bah. All Rights Reserved. DejaVu changes are in public domain ) def
/Weight (Book) def
/Version (Version 2.35) def
/ItalicAngle 0.0 def
/isFixedPitch false def
/UnderlinePosition -130 def
/UnderlineThickness 90 def
end readonly def
/CharStrings 48 dict dup begin
/space{318 0 0 0 0 0 _sc
}_d
/numbersign{{838 0 77 0 761 718 _sc
511 440 _m
369 440 _l
328 277 _l
471 277 _l
511 440 _l
438 718 _m
387 515 _l
530 515 _l
581 718 _l
659 718 _l
609 515 _l
761 515 _l
761 440 _l
590 440 _l
550 277 _l
705 277 _l
705 202 _l
531 202 _l
480 0 _l
402 0 _l
452 202 _l
309 202 _l
259 0 _l
180 0 _l
231 202 _l
77 202 _l
77 277 _l
249 277 _l
290 440 _l
133 440 _l
}_e{133 515 _l
309 515 _l
359 718 _l
438 718 _l
_cl}_e}_d
/parenleft{390 0 86 -131 310 759 _sc
310 759 _m
266 683 234 609 213 536 _c
191 463 181 389 181 314 _c
181 238 191 164 213 91 _c
234 17 266 -56 310 -131 _c
232 -131 _l
183 -54 146 20 122 94 _c
98 168 86 241 86 314 _c
86 386 98 459 122 533 _c
146 607 182 682 232 759 _c
310 759 _l
_cl}_d
/parenright{390 0 80 -131 304 759 _sc
80 759 _m
158 759 _l
206 682 243 607 267 533 _c
291 459 304 386 304 314 _c
304 241 291 168 267 94 _c
243 20 206 -54 158 -131 _c
80 -131 _l
123 -56 155 17 177 91 _c
198 164 209 238 209 314 _c
209 389 198 463 177 536 _c
155 609 123 683 80 759 _c
_cl}_d
/plus{838 0 106 0 732 627 _sc
460 627 _m
460 355 _l
732 355 _l
732 272 _l
460 272 _l
460 0 _l
378 0 _l
378 272 _l
106 272 _l
106 355 _l
378 355 _l
378 627 _l
460 627 _l
_cl}_d
/hyphen{361 0 49 234 312 314 _sc
49 314 _m
312 314 _l
312 234 _l
49 234 _l
49 314 _l
_cl}_d
/zero{636 0 66 -13 570 742 _sc
318 664 _m
267 664 229 639 203 589 _c
177 539 165 464 165 364 _c
165 264 177 189 203 139 _c
229 89 267 64 318 64 _c
369 64 407 89 433 139 _c
458 189 471 264 471 364 _c
471 464 458 539 433 589 _c
407 639 369 664 318 664 _c
318 742 _m
399 742 461 709 505 645 _c
548 580 570 486 570 364 _c
570 241 548 147 505 83 _c
461 19 399 -13 318 -13 _c
236 -13 173 19 130 83 _c
87 147 66 241 66 364 _c
66 486 87 580 130 645 _c
173 709 236 742 318 742 _c
_cl}_d
/one{636 0 110 0 544 729 _sc
124 83 _m
285 83 _l
285 639 _l
110 604 _l
110 694 _l
284 729 _l
383 729 _l
383 83 _l
544 83 _l
544 0 _l
124 0 _l
124 83 _l
_cl}_d
/two{{636 0 73 0 536 742 _sc
192 83 _m
536 83 _l
536 0 _l
73 0 _l
73 83 _l
110 121 161 173 226 239 _c
290 304 331 346 348 365 _c
380 400 402 430 414 455 _c
426 479 433 504 433 528 _c
433 566 419 598 392 622 _c
365 646 330 659 286 659 _c
255 659 222 653 188 643 _c
154 632 117 616 78 594 _c
78 694 _l
118 710 155 722 189 730 _c
223 738 255 742 284 742 _c
}_e{359 742 419 723 464 685 _c
509 647 532 597 532 534 _c
532 504 526 475 515 449 _c
504 422 484 390 454 354 _c
446 344 420 317 376 272 _c
332 227 271 164 192 83 _c
_cl}_e}_d
/three{{636 0 76 -13 556 742 _sc
406 393 _m
453 383 490 362 516 330 _c
542 298 556 258 556 212 _c
556 140 531 84 482 45 _c
432 6 362 -13 271 -13 _c
240 -13 208 -10 176 -4 _c
144 1 110 10 76 22 _c
76 117 _l
103 101 133 89 166 81 _c
198 73 232 69 268 69 _c
330 69 377 81 409 105 _c
441 129 458 165 458 212 _c
458 254 443 288 413 312 _c
383 336 341 349 287 349 _c
}_e{202 349 _l
202 430 _l
291 430 _l
339 430 376 439 402 459 _c
428 478 441 506 441 543 _c
441 580 427 609 401 629 _c
374 649 336 659 287 659 _c
260 659 231 656 200 650 _c
169 644 135 635 98 623 _c
98 711 _l
135 721 170 729 203 734 _c
235 739 266 742 296 742 _c
370 742 429 725 473 691 _c
517 657 539 611 539 553 _c
539 513 527 479 504 451 _c
481 423 448 403 406 393 _c
_cl}_e}_d
/four{636 0 49 0 580 729 _sc
378 643 _m
129 254 _l
378 254 _l
378 643 _l
352 729 _m
476 729 _l
476 254 _l
580 254 _l
580 172 _l
476 172 _l
476 0 _l
378 0 _l
378 172 _l
49 172 _l
49 267 _l
352 729 _l
_cl}_d
/five{{636 0 77 -13 549 729 _sc
108 729 _m
495 729 _l
495 646 _l
198 646 _l
198 467 _l
212 472 227 476 241 478 _c
255 480 270 482 284 482 _c
365 482 429 459 477 415 _c
525 370 549 310 549 234 _c
549 155 524 94 475 51 _c
426 8 357 -13 269 -13 _c
238 -13 207 -10 175 -6 _c
143 -1 111 6 77 17 _c
77 116 _l
106 100 136 88 168 80 _c
199 72 232 69 267 69 _c
}_e{323 69 368 83 401 113 _c
433 143 450 183 450 234 _c
450 284 433 324 401 354 _c
368 384 323 399 267 399 _c
241 399 214 396 188 390 _c
162 384 135 375 108 363 _c
108 729 _l
_cl}_e}_d
/six{{636 0 70 -13 573 742 _sc
330 404 _m
286 404 251 388 225 358 _c
199 328 186 286 186 234 _c
186 181 199 139 225 109 _c
251 79 286 64 330 64 _c
374 64 409 79 435 109 _c
461 139 474 181 474 234 _c
474 286 461 328 435 358 _c
409 388 374 404 330 404 _c
526 713 _m
526 623 _l
501 635 476 644 451 650 _c
425 656 400 659 376 659 _c
310 659 260 637 226 593 _c
}_e{192 549 172 482 168 394 _c
187 422 211 444 240 459 _c
269 474 301 482 336 482 _c
409 482 467 459 509 415 _c
551 371 573 310 573 234 _c
573 159 550 99 506 54 _c
462 9 403 -13 330 -13 _c
246 -13 181 19 137 83 _c
92 147 70 241 70 364 _c
70 479 97 571 152 639 _c
206 707 280 742 372 742 _c
396 742 421 739 447 735 _c
472 730 498 723 526 713 _c
_cl}_e}_d
/seven{636 0 82 0 551 729 _sc
82 729 _m
551 729 _l
551 687 _l
286 0 _l
183 0 _l
432 646 _l
82 646 _l
82 729 _l
_cl}_d
/eight{{636 0 68 -13 568 742 _sc
318 346 _m
271 346 234 333 207 308 _c
180 283 167 249 167 205 _c
167 161 180 126 207 101 _c
234 76 271 64 318 64 _c
364 64 401 76 428 102 _c
455 127 469 161 469 205 _c
469 249 455 283 429 308 _c
402 333 365 346 318 346 _c
219 388 _m
177 398 144 418 120 447 _c
96 476 85 511 85 553 _c
85 611 105 657 147 691 _c
188 725 245 742 318 742 _c
}_e{390 742 447 725 489 691 _c
530 657 551 611 551 553 _c
551 511 539 476 515 447 _c
491 418 459 398 417 388 _c
464 377 501 355 528 323 _c
554 291 568 251 568 205 _c
568 134 546 80 503 43 _c
459 5 398 -13 318 -13 _c
237 -13 175 5 132 43 _c
89 80 68 134 68 205 _c
68 251 81 291 108 323 _c
134 355 171 377 219 388 _c
183 544 _m
183 506 194 476 218 455 _c
}_e{242 434 275 424 318 424 _c
360 424 393 434 417 455 _c
441 476 453 506 453 544 _c
453 582 441 611 417 632 _c
393 653 360 664 318 664 _c
275 664 242 653 218 632 _c
194 611 183 582 183 544 _c
_cl}_e}_d
/nine{{636 0 63 -13 566 742 _sc
110 15 _m
110 105 _l
134 93 159 84 185 78 _c
210 72 235 69 260 69 _c
324 69 374 90 408 134 _c
442 178 462 244 468 334 _c
448 306 424 284 396 269 _c
367 254 335 247 300 247 _c
226 247 168 269 126 313 _c
84 357 63 417 63 494 _c
63 568 85 628 129 674 _c
173 719 232 742 306 742 _c
390 742 455 709 499 645 _c
543 580 566 486 566 364 _c
}_e{566 248 538 157 484 89 _c
429 21 356 -13 264 -13 _c
239 -13 214 -10 189 -6 _c
163 -2 137 5 110 15 _c
306 324 _m
350 324 385 339 411 369 _c
437 399 450 441 450 494 _c
450 546 437 588 411 618 _c
385 648 350 664 306 664 _c
262 664 227 648 201 618 _c
175 588 162 546 162 494 _c
162 441 175 399 201 369 _c
227 339 262 324 306 324 _c
_cl}_e}_d
/at{{1000 0 66 -173 930 704 _sc
372 262 _m
372 215 383 178 406 152 _c
429 126 461 113 502 113 _c
542 113 573 126 596 153 _c
619 179 631 216 631 262 _c
631 308 619 344 596 371 _c
572 397 541 411 501 411 _c
461 411 430 397 407 371 _c
383 344 372 308 372 262 _c
638 116 _m
618 91 596 73 571 61 _c
545 49 516 43 483 43 _c
427 43 381 63 346 104 _c
311 144 294 197 294 262 _c
}_e{294 327 311 380 346 421 _c
381 461 427 482 483 482 _c
516 482 545 475 571 463 _c
596 451 618 432 638 408 _c
638 472 _l
708 472 _l
708 113 _l
755 120 792 142 819 178 _c
846 214 860 261 860 319 _c
860 353 854 386 844 417 _c
834 447 818 476 798 502 _c
764 544 722 577 674 600 _c
625 622 572 634 515 634 _c
475 634 436 628 400 618 _c
363 607 329 591 298 571 _c
}_e{246 537 206 494 178 440 _c
149 386 135 327 135 265 _c
135 213 144 165 163 120 _c
181 74 208 34 244 0 _c
278 -33 317 -58 362 -76 _c
407 -94 455 -103 507 -103 _c
549 -103 590 -96 630 -82 _c
670 -68 708 -47 742 -21 _c
786 -75 _l
745 -107 701 -131 653 -148 _c
605 -164 556 -173 507 -173 _c
447 -173 390 -162 336 -141 _c
282 -119 235 -88 194 -48 _c
152 -8 120 38 98 92 _c
}_e{76 146 66 203 66 265 _c
66 324 77 380 99 434 _c
121 488 152 535 194 576 _c
236 617 284 649 339 671 _c
394 693 452 704 514 704 _c
583 704 647 689 706 661 _c
765 633 815 593 855 541 _c
879 509 898 474 911 437 _c
923 399 930 361 930 321 _c
930 235 904 167 852 118 _c
800 68 729 43 638 41 _c
638 116 _l
_cl}_e}_d
/A{684 0 8 0 676 729 _sc
342 632 _m
208 269 _l
476 269 _l
342 632 _l
286 729 _m
398 729 _l
676 0 _l
573 0 _l
507 187 _l
178 187 _l
112 0 _l
8 0 _l
286 729 _l
_cl}_d
/C{{698 0 56 -13 644 742 _sc
644 673 _m
644 569 _l
610 599 575 622 537 638 _c
499 653 460 661 418 661 _c
334 661 270 635 226 584 _c
182 533 160 460 160 364 _c
160 268 182 194 226 143 _c
270 92 334 67 418 67 _c
460 67 499 74 537 90 _c
575 105 610 128 644 159 _c
644 56 _l
609 32 572 15 534 4 _c
496 -7 455 -13 412 -13 _c
302 -13 215 20 151 87 _c
}_e{87 154 56 246 56 364 _c
56 481 87 573 151 641 _c
215 708 302 742 412 742 _c
456 742 497 736 535 725 _c
573 713 610 696 644 673 _c
_cl}_e}_d
/D{770 0 98 0 711 729 _sc
197 648 _m
197 81 _l
316 81 _l
416 81 490 103 537 149 _c
583 195 607 267 607 365 _c
607 463 583 534 537 580 _c
490 625 416 648 316 648 _c
197 648 _l
98 729 _m
301 729 _l
442 729 546 699 612 641 _c
678 582 711 490 711 365 _c
711 239 677 147 611 88 _c
545 29 441 0 301 0 _c
98 0 _l
98 729 _l
_cl}_d
/H{752 0 98 0 654 729 _sc
98 729 _m
197 729 _l
197 430 _l
555 430 _l
555 729 _l
654 729 _l
654 0 _l
555 0 _l
555 347 _l
197 347 _l
197 0 _l
98 0 _l
98 729 _l
_cl}_d
/I{295 0 98 0 197 729 _sc
98 729 _m
197 729 _l
197 0 _l
98 0 _l
98 729 _l
_cl}_d
/K{656 0 98 0 677 729 _sc
98 729 _m
197 729 _l
197 421 _l
524 729 _l
651 729 _l
289 389 _l
677 0 _l
547 0 _l
197 351 _l
197 0 _l
98 0 _l
98 729 _l
_cl}_d
/L{557 0 98 0 552 729 _sc
98 729 _m
197 729 _l
197 83 _l
552 83 _l
552 0 _l
98 0 _l
98 729 _l
_cl}_d
/M{863 0 98 0 765 729 _sc
98 729 _m
245 729 _l
431 233 _l
618 729 _l
765 729 _l
765 0 _l
669 0 _l
669 640 _l
481 140 _l
382 140 _l
194 640 _l
194 0 _l
98 0 _l
98 729 _l
_cl}_d
/N{748 0 98 0 650 729 _sc
98 729 _m
231 729 _l
554 119 _l
554 729 _l
650 729 _l
650 0 _l
517 0 _l
194 610 _l
194 0 _l
98 0 _l
98 729 _l
_cl}_d
/P{603 0 98 0 569 729 _sc
197 648 _m
197 374 _l
321 374 _l
367 374 402 385 427 409 _c
452 433 465 467 465 511 _c
465 555 452 588 427 612 _c
402 636 367 648 321 648 _c
197 648 _l
98 729 _m
321 729 _l
402 729 464 710 506 673 _c
548 636 569 582 569 511 _c
569 439 548 384 506 348 _c
464 311 402 293 321 293 _c
197 293 _l
197 0 _l
98 0 _l
98 729 _l
_cl}_d
/R{{695 0 98 0 666 729 _sc
444 342 _m
465 334 486 319 506 296 _c
526 272 546 240 566 199 _c
666 0 _l
560 0 _l
467 187 _l
443 235 419 268 397 284 _c
374 300 343 308 304 308 _c
197 308 _l
197 0 _l
98 0 _l
98 729 _l
321 729 _l
404 729 466 711 507 677 _c
548 642 569 589 569 519 _c
569 473 558 434 537 404 _c
515 374 484 353 444 342 _c
197 648 _m
197 389 _l
321 389 _l
}_e{368 389 404 400 428 422 _c
452 444 465 476 465 519 _c
465 561 452 593 428 615 _c
404 637 368 648 321 648 _c
197 648 _l
_cl}_e}_d
/S{{635 0 66 -13 579 742 _sc
535 705 _m
535 609 _l
497 627 462 640 429 649 _c
395 657 363 662 333 662 _c
279 662 237 651 208 631 _c
179 610 165 580 165 542 _c
165 510 174 485 194 469 _c
213 452 250 439 304 429 _c
364 417 _l
437 403 491 378 526 343 _c
561 307 579 260 579 201 _c
579 130 555 77 508 41 _c
460 5 391 -13 300 -13 _c
265 -13 228 -9 189 -2 _c
}_e{150 5 110 16 69 32 _c
69 134 _l
109 111 148 94 186 83 _c
224 71 262 66 300 66 _c
356 66 399 77 430 99 _c
460 121 476 152 476 194 _c
476 230 465 258 443 278 _c
421 298 385 313 335 323 _c
275 335 _l
201 349 148 372 115 404 _c
82 435 66 478 66 534 _c
66 598 88 649 134 686 _c
179 723 242 742 322 742 _c
356 742 390 739 426 733 _c
461 727 497 717 535 705 _c
}_e{_cl}_e}_d
/W{989 0 33 0 956 729 _sc
33 729 _m
133 729 _l
286 113 _l
439 729 _l
550 729 _l
703 113 _l
856 729 _l
956 729 _l
773 0 _l
649 0 _l
495 633 _l
340 0 _l
216 0 _l
33 729 _l
_cl}_d
/a{{613 0 60 -13 522 560 _sc
343 275 _m
270 275 220 266 192 250 _c
164 233 150 205 150 165 _c
150 133 160 107 181 89 _c
202 70 231 61 267 61 _c
317 61 357 78 387 114 _c
417 149 432 196 432 255 _c
432 275 _l
343 275 _l
522 312 _m
522 0 _l
432 0 _l
432 83 _l
411 49 385 25 355 10 _c
325 -5 287 -13 243 -13 _c
187 -13 142 2 109 33 _c
76 64 60 106 60 159 _c
}_e{60 220 80 266 122 298 _c
163 329 224 345 306 345 _c
432 345 _l
432 354 _l
432 395 418 427 391 450 _c
364 472 326 484 277 484 _c
245 484 215 480 185 472 _c
155 464 127 453 100 439 _c
100 522 _l
132 534 164 544 195 550 _c
226 556 256 560 286 560 _c
365 560 424 539 463 498 _c
502 457 522 395 522 312 _c
_cl}_e}_d
/c{{550 0 55 -13 488 560 _sc
488 526 _m
488 442 _l
462 456 437 466 411 473 _c
385 480 360 484 334 484 _c
276 484 230 465 198 428 _c
166 391 150 339 150 273 _c
150 206 166 154 198 117 _c
230 80 276 62 334 62 _c
360 62 385 65 411 72 _c
437 79 462 90 488 104 _c
488 21 _l
462 9 436 0 410 -5 _c
383 -10 354 -13 324 -13 _c
242 -13 176 12 128 64 _c
}_e{79 115 55 185 55 273 _c
55 362 79 432 128 483 _c
177 534 244 560 330 560 _c
358 560 385 557 411 551 _c
437 545 463 537 488 526 _c
_cl}_e}_d
/d{{635 0 55 -13 544 760 _sc
454 464 _m
454 760 _l
544 760 _l
544 0 _l
454 0 _l
454 82 _l
435 49 411 25 382 10 _c
353 -5 319 -13 279 -13 _c
213 -13 159 13 117 65 _c
75 117 55 187 55 273 _c
55 359 75 428 117 481 _c
159 533 213 560 279 560 _c
319 560 353 552 382 536 _c
411 520 435 496 454 464 _c
148 273 _m
148 207 161 155 188 117 _c
215 79 253 61 301 61 _c
}_e{348 61 385 79 413 117 _c
440 155 454 207 454 273 _c
454 339 440 390 413 428 _c
385 466 348 485 301 485 _c
253 485 215 466 188 428 _c
161 390 148 339 148 273 _c
_cl}_e}_d
/e{{615 0 55 -13 562 560 _sc
562 296 _m
562 252 _l
149 252 _l
153 190 171 142 205 110 _c
238 78 284 62 344 62 _c
378 62 412 66 444 74 _c
476 82 509 95 541 113 _c
541 28 _l
509 14 476 3 442 -3 _c
408 -9 373 -13 339 -13 _c
251 -13 182 12 131 62 _c
80 112 55 181 55 268 _c
55 357 79 428 127 481 _c
175 533 241 560 323 560 _c
397 560 455 536 498 489 _c
}_e{540 441 562 377 562 296 _c
472 322 _m
471 371 457 410 431 440 _c
404 469 368 484 324 484 _c
274 484 234 469 204 441 _c
174 413 156 373 152 322 _c
472 322 _l
_cl}_e}_d
/g{{635 0 55 -207 544 560 _sc
454 280 _m
454 344 440 395 414 431 _c
387 467 349 485 301 485 _c
253 485 215 467 188 431 _c
161 395 148 344 148 280 _c
148 215 161 165 188 129 _c
215 93 253 75 301 75 _c
349 75 387 93 414 129 _c
440 165 454 215 454 280 _c
544 68 _m
544 -24 523 -93 482 -139 _c
440 -184 377 -207 292 -207 _c
260 -207 231 -204 203 -200 _c
175 -195 147 -188 121 -178 _c
}_e{121 -91 _l
147 -105 173 -115 199 -122 _c
225 -129 251 -133 278 -133 _c
336 -133 380 -117 410 -87 _c
439 -56 454 -10 454 52 _c
454 96 _l
435 64 411 40 382 24 _c
353 8 319 0 279 0 _c
211 0 157 25 116 76 _c
75 127 55 195 55 280 _c
55 364 75 432 116 483 _c
157 534 211 560 279 560 _c
319 560 353 552 382 536 _c
411 520 435 496 454 464 _c
454 547 _l
544 547 _l
}_e{544 68 _l
_cl}_e}_d
/h{634 0 91 0 549 760 _sc
549 330 _m
549 0 _l
459 0 _l
459 327 _l
459 379 448 417 428 443 _c
408 469 378 482 338 482 _c
289 482 251 466 223 435 _c
195 404 181 362 181 309 _c
181 0 _l
91 0 _l
91 760 _l
181 760 _l
181 462 _l
202 494 227 519 257 535 _c
286 551 320 560 358 560 _c
420 560 468 540 500 501 _c
532 462 549 405 549 330 _c
_cl}_d
/i{278 0 94 0 184 760 _sc
94 547 _m
184 547 _l
184 0 _l
94 0 _l
94 547 _l
94 760 _m
184 760 _l
184 646 _l
94 646 _l
94 760 _l
_cl}_d
/k{579 0 91 0 576 760 _sc
91 760 _m
181 760 _l
181 311 _l
449 547 _l
564 547 _l
274 291 _l
576 0 _l
459 0 _l
181 267 _l
181 0 _l
91 0 _l
91 760 _l
_cl}_d
/l{278 0 94 0 184 760 _sc
94 760 _m
184 760 _l
184 0 _l
94 0 _l
94 760 _l
_cl}_d
/m{{974 0 91 0 889 560 _sc
520 442 _m
542 482 569 511 600 531 _c
631 550 668 560 711 560 _c
767 560 811 540 842 500 _c
873 460 889 403 889 330 _c
889 0 _l
799 0 _l
799 327 _l
799 379 789 418 771 444 _c
752 469 724 482 686 482 _c
639 482 602 466 575 435 _c
548 404 535 362 535 309 _c
535 0 _l
445 0 _l
445 327 _l
445 379 435 418 417 444 _c
398 469 369 482 331 482 _c
}_e{285 482 248 466 221 435 _c
194 404 181 362 181 309 _c
181 0 _l
91 0 _l
91 547 _l
181 547 _l
181 462 _l
201 495 226 520 255 536 _c
283 552 317 560 357 560 _c
397 560 430 550 458 530 _c
486 510 506 480 520 442 _c
_cl}_e}_d
/n{634 0 91 0 549 560 _sc
549 330 _m
549 0 _l
459 0 _l
459 327 _l
459 379 448 417 428 443 _c
408 469 378 482 338 482 _c
289 482 251 466 223 435 _c
195 404 181 362 181 309 _c
181 0 _l
91 0 _l
91 547 _l
181 547 _l
181 462 _l
202 494 227 519 257 535 _c
286 551 320 560 358 560 _c
420 560 468 540 500 501 _c
532 462 549 405 549 330 _c
_cl}_d
/o{612 0 55 -13 557 560 _sc
306 484 _m
258 484 220 465 192 427 _c
164 389 150 338 150 273 _c
150 207 163 156 191 118 _c
219 80 257 62 306 62 _c
354 62 392 80 420 118 _c
448 156 462 207 462 273 _c
462 337 448 389 420 427 _c
392 465 354 484 306 484 _c
306 560 _m
384 560 445 534 490 484 _c
534 433 557 363 557 273 _c
557 183 534 113 490 63 _c
445 12 384 -13 306 -13 _c
227 -13 165 12 121 63 _c
77 113 55 183 55 273 _c
55 363 77 433 121 484 _c
165 534 227 560 306 560 _c
_cl}_d
/p{{635 0 91 -207 580 560 _sc
181 82 _m
181 -207 _l
91 -207 _l
91 547 _l
181 547 _l
181 464 _l
199 496 223 520 252 536 _c
281 552 316 560 356 560 _c
422 560 476 533 518 481 _c
559 428 580 359 580 273 _c
580 187 559 117 518 65 _c
476 13 422 -13 356 -13 _c
316 -13 281 -5 252 10 _c
223 25 199 49 181 82 _c
487 273 _m
487 339 473 390 446 428 _c
418 466 381 485 334 485 _c
}_e{286 485 249 466 222 428 _c
194 390 181 339 181 273 _c
181 207 194 155 222 117 _c
249 79 286 61 334 61 _c
381 61 418 79 446 117 _c
473 155 487 207 487 273 _c
_cl}_e}_d
/r{411 0 91 0 411 560 _sc
411 463 _m
401 469 390 473 378 476 _c
366 478 353 480 339 480 _c
288 480 249 463 222 430 _c
194 397 181 350 181 288 _c
181 0 _l
91 0 _l
91 547 _l
181 547 _l
181 462 _l
199 495 224 520 254 536 _c
284 552 321 560 365 560 _c
371 560 378 559 386 559 _c
393 558 401 557 411 555 _c
411 463 _l
_cl}_d
/s{{521 0 54 -13 472 560 _sc
443 531 _m
443 446 _l
417 458 391 468 364 475 _c
336 481 308 485 279 485 _c
234 485 200 478 178 464 _c
156 450 145 430 145 403 _c
145 382 153 366 169 354 _c
185 342 217 330 265 320 _c
296 313 _l
360 299 405 279 432 255 _c
458 230 472 195 472 151 _c
472 100 452 60 412 31 _c
372 1 316 -13 246 -13 _c
216 -13 186 -10 154 -5 _c
}_e{122 0 89 8 54 20 _c
54 113 _l
87 95 120 82 152 74 _c
184 65 216 61 248 61 _c
290 61 323 68 346 82 _c
368 96 380 117 380 144 _c
380 168 371 187 355 200 _c
339 213 303 226 247 238 _c
216 245 _l
160 257 119 275 95 299 _c
70 323 58 356 58 399 _c
58 450 76 490 112 518 _c
148 546 200 560 268 560 _c
301 560 332 557 362 552 _c
391 547 418 540 443 531 _c
}_e{_cl}_e}_d
/t{392 0 27 0 368 702 _sc
183 702 _m
183 547 _l
368 547 _l
368 477 _l
183 477 _l
183 180 _l
183 135 189 106 201 94 _c
213 81 238 75 276 75 _c
368 75 _l
368 0 _l
276 0 _l
206 0 158 13 132 39 _c
106 65 93 112 93 180 _c
93 477 _l
27 477 _l
27 547 _l
93 547 _l
93 702 _l
183 702 _l
_cl}_d
/w{818 0 42 0 776 547 _sc
42 547 _m
132 547 _l
244 120 _l
356 547 _l
462 547 _l
574 120 _l
686 547 _l
776 547 _l
633 0 _l
527 0 _l
409 448 _l
291 0 _l
185 0 _l
42 547 _l
_cl}_d
/z{525 0 43 0 482 547 _sc
55 547 _m
482 547 _l
482 465 _l
144 72 _l
482 72 _l
482 0 _l
43 0 _l
43 82 _l
381 475 _l
55 475 _l
55 547 _l
_cl}_d
end readonly def

/BuildGlyph
 {exch begin
 CharStrings exch
 2 copy known not{pop /.notdef}if
 true 3 1 roll get exec
 end}_d

/BuildChar {
 1 index /Encoding get exch get
 1 index /BuildGlyph get exec
}_d

FontName currentdict end definefont pop
end
%%EndProlog
mpldict begin
54 180 translate
504 432 0 0 clipbox
gsave
0 0 m
504 0 l
504 432 l
0 432 l
cl
1.000 setgray
fill
grestore
gsave
72.9675 58.68 m
471.47625 58.68 l
471.47625 367.528 l
72.9675 367.528 l
cl
1.000 setgray
fill
grestore
1.000 setlinewidth
1 setlinejoin
2 setlinecap
[] 0 setdash
0.050 0.030 0.528 setrgbcolor
gsave
398.5 308.8 72.97 58.68 clipbox
72.9675 246.835542 m
76.992841 195.721315 l
81.018182 193.61951 l
85.043523 175.918887 l
89.068864 171.983946 l
93.094205 175.873479 l
97.119545 166.269403 l
101.144886 174.373891 l
105.170227 175.596607 l
109.195568 168.678616 l
113.220909 168.466767 l
117.24625 167.060687 l
121.271591 162.208321 l
125.296932 170.638059 l
129.322273 170.694167 l
133.347614 165.190527 l
137.372955 173.756332 l
141.398295 178.20082 l
145.423636 174.105966 l
149.448977 159.529139 l
153.474318 164.145819 l
157.499659 160.854982 l
161.525 157.859489 l
165.550341 178.149321 l
169.575682 159.12707 l
173.601023 159.019126 l
177.626364 155.653038 l
181.651705 165.929051 l
185.677045 171.705876 l
189.702386 167.305464 l
193.727727 166.728859 l
197.753068 176.018725 l
201.778409 167.750238 l
205.80375 167.900076 l
209.829091 166.982011 l
213.854432 164.839497 l
217.879773 158.088191 l
221.905114 157.730518 l
225.930455 157.689477 l
229.955795 157.69308 l
233.981136 165.991428 l
238.006477 170.9753 l
242.031818 163.646608 l
246.057159 160.830563 l
250.0825 165.487411 l
254.107841 153.492793 l
258.133182 149.740482 l
262.158523 149.670834 l
266.183864 155.04057 l
270.209205 155.608475 l
274.234545 160.00082 l
278.259886 159.036194 l
282.285227 171.938514 l
286.310568 172.960629 l
290.335909 158.667758 l
294.36125 157.737189 l
298.386591 159.364567 l
302.411932 162.633094 l
306.437273 163.37394 l
310.462614 160.246156 l
314.487955 159.174233 l
318.513295 163.158452 l
322.538636 158.936791 l
326.563977 158.167861 l
330.589318 165.847106 l
334.614659 162.330979 l
338.64 165.757713 l
342.665341 165.863431 l
346.690682 170.567617 l
350.716023 159.448332 l
354.741364 160.42176 l
358.766705 162.350762 l
362.792045 156.425108 l
366.817386 153.541094 l
370.842727 152.77901 l
374.868068 156.55956 l
378.893409 152.410736 l
382.91875 152.978599 l
386.944091 153.65234 l
390.969432 155.656135 l
394.994773 153.06649 l
399.020114 154.188489 l
403.045455 157.834258 l
407.070795 170.659905 l
411.096136 163.993156 l
415.121477 163.661402 l
419.146818 161.241009 l
423.172159 160.784259 l
427.1975 164.104571 l
431.222841 163.573251 l
435.248182 164.052366 l
439.273523 165.664997 l
443.298864 165.281448 l
447.324205 160.99972 l
451.349545 160.123906 l
455.374886 161.915517 l
459.400227 165.729411 l
463.425568 165.371354 l
467.450909 166.94509 l
471.47625 161.35622 l
stroke
grestore
0.228 0.016 0.605 setrgbcolor
gsave
398.5 308.8 72.97 58.68 clipbox
72.9675 241.332646 m
76.992841 180.155727 l
81.018182 183.348632 l
85.043523 173.785086 l
89.068864 172.067275 l
93.094205 173.083468 l
97.119545 154.999265 l
101.144886 162.353402 l
105.170227 155.003281 l
109.195568 145.371208 l
113.220909 146.124347 l
117.24625 145.085406 l
121.271591 145.488628 l
125.296932 151.132188 l
129.322273 147.687739 l
133.347614 160.392517 l
137.372955 155.558891 l
141.398295 156.514037 l
145.423636 159.743668 l
149.448977 150.265584 l
153.474318 157.245122 l
157.499659 157.127665 l
161.525 153.205 l
165.550341 154.097139 l
169.575682 155.791612 l
173.601023 155.532165 l
177.626364 155.609596 l
181.651705 157.855095 l
185.677045 155.084041 l
189.702386 154.760331 l
193.727727 155.488767 l
197.753068 154.764287 l
201.778409 158.811673 l
205.80375 148.671875 l
209.829091 161.254121 l
213.854432 153.796887 l
217.879773 151.358173 l
221.905114 148.258993 l
225.930455 147.647306 l
229.955795 148.523897 l
233.981136 147.593305 l
238.006477 146.927715 l
242.031818 148.117445 l
246.057159 148.530969 l
250.0825 154.331381 l
254.107841 152.654007 l
258.133182 158.035424 l
262.158523 154.06774 l
266.183864 155.412787 l
270.209205 147.608865 l
274.234545 150.354984 l
278.259886 143.915308 l
282.285227 145.894095 l
286.310568 144.004458 l
290.335909 144.492701 l
294.36125 144.184464 l
298.386591 144.378107 l
302.411932 144.353539 l
306.437273 143.765676 l
310.462614 144.268916 l
314.487955 145.04563 l
318.513295 147.764314 l
322.538636 148.003237 l
326.563977 153.58398 l
330.589318 153.761306 l
334.614659 160.824761 l
338.64 150.871362 l
342.665341 148.644177 l
346.690682 152.07336 l
350.716023 151.363944 l
354.741364 156.181517 l
358.766705 153.150867 l
362.792045 152.255369 l
366.817386 150.785914 l
370.842727 152.774528 l
374.868068 155.358178 l
378.893409 152.65931 l
382.91875 153.210065 l
386.944091 152.746692 l
390.969432 150.708614 l
394.994773 148.303038 l
399.020114 149.840625 l
403.045455 148.883368 l
407.070795 149.460944 l
411.096136 149.247772 l
415.121477 149.242283 l
419.146818 148.562032 l
423.172159 148.782027 l
427.1975 148.897084 l
431.222841 152.384256 l
435.248182 148.51563 l
439.273523 145.899304 l
443.298864 143.501006 l
447.324205 147.303732 l
451.349545 150.951583 l
455.374886 149.716162 l
459.400227 150.910187 l
463.425568 151.048806 l
467.450909 150.971669 l
471.47625 150.289047 l
stroke
grestore
0.363 0.003 0.649 setrgbcolor
gsave
398.5 308.8 72.97 58.68 clipbox
72.9675 242.945779 m
76.992841 191.350646 l
81.018182 190.53399 l
85.043523 169.663801 l
89.068864 169.407217 l
93.094205 172.801015 l
97.119545 161.584176 l
101.144886 154.468368 l
105.170227 154.000398 l
109.195568 153.751022 l
113.220909 155.098994 l
117.24625 153.197289 l
121.271591 158.432888 l
125.296932 156.541128 l
129.322273 158.476547 l
133.347614 166.095892 l
137.372955 162.143855 l
141.398295 162.669001 l
145.423636 156.32088 l
149.448977 150.344458 l
153.474318 152.321115 l
157.499659 152.578266 l
161.525 151.748115 l
165.550341 150.71697 l
169.575682 153.976151 l
173.601023 156.976194 l
177.626364 150.222313 l
181.651705 150.637329 l
185.677045 153.944864 l
189.702386 156.735562 l
193.727727 152.766869 l
197.753068 157.40502 l
201.778409 160.392296 l
205.80375 157.427806 l
209.829091 153.417457 l
213.854432 154.995506 l
217.879773 153.288266 l
221.905114 155.8473 l
225.930455 152.992194 l
229.955795 151.791976 l
233.981136 156.26079 l
238.006477 160.79653 l
242.031818 153.372044 l
246.057159 154.363031 l
250.0825 153.954974 l
254.107841 156.994427 l
258.133182 152.098196 l
262.158523 154.201443 l
266.183864 154.421386 l
270.209205 153.190182 l
274.234545 153.969221 l
278.259886 157.348527 l
282.285227 149.401102 l
286.310568 148.561604 l
290.335909 148.057372 l
294.36125 150.993475 l
298.386591 149.508142 l
302.411932 147.617068 l
306.437273 148.756018 l
310.462614 145.622994 l
314.487955 150.20008 l
318.513295 150.594769 l
322.538636 149.084902 l
326.563977 146.861953 l
330.589318 148.510898 l
334.614659 147.331215 l
338.64 147.529785 l
342.665341 146.433559 l
346.690682 152.766253 l
350.716023 154.810644 l
354.741364 152.090543 l
358.766705 153.5848 l
362.792045 153.287505 l
366.817386 154.37387 l
370.842727 155.824501 l
374.868068 155.485985 l
378.893409 152.057318 l
382.91875 152.115522 l
386.944091 154.731214 l
390.969432 151.66105 l
394.994773 153.622531 l
399.020114 151.76165 l
403.045455 153.605643 l
407.070795 151.507804 l
411.096136 151.254872 l
415.121477 152.066799 l
419.146818 152.954571 l
423.172159 152.053081 l
427.1975 150.41331 l
431.222841 152.139033 l
435.248182 153.004288 l
439.273523 154.450486 l
443.298864 147.344536 l
447.324205 148.891393 l
451.349545 163.113957 l
455.374886 163.59764 l
459.400227 146.993863 l
463.425568 152.79985 l
467.450909 153.0734 l
471.47625 152.769218 l
stroke
grestore
0.495 0.012 0.658 setrgbcolor
gsave
398.5 308.8 72.97 58.68 clipbox
72.9675 232.915729 m
76.992841 187.018622 l
81.018182 185.849166 l
85.043523 185.253023 l
89.068864 179.029237 l
93.094205 182.000154 l
97.119545 178.702137 l
101.144886 179.999603 l
105.170227 182.208902 l
109.195568 163.602893 l
113.220909 179.265705 l
117.24625 178.016553 l
121.271591 180.645675 l
125.296932 184.852981 l
129.322273 185.522075 l
133.347614 170.429593 l
137.372955 166.24537 l
141.398295 168.623658 l
145.423636 175.044962 l
149.448977 176.602496 l
153.474318 187.431823 l
157.499659 178.322185 l
161.525 172.814292 l
165.550341 174.963666 l
169.575682 164.782135 l
173.601023 163.86126 l
177.626364 159.501299 l
181.651705 165.012565 l
185.677045 165.430554 l
189.702386 164.743155 l
193.727727 155.163038 l
197.753068 155.710165 l
201.778409 158.468627 l
205.80375 160.280433 l
209.829091 157.379048 l
213.854432 159.284631 l
217.879773 152.67647 l
221.905114 152.167268 l
225.930455 152.532267 l
229.955795 151.147436 l
233.981136 149.789817 l
238.006477 153.754854 l
242.031818 162.072905 l
246.057159 157.714476 l
250.0825 160.840952 l
254.107841 157.874293 l
258.133182 157.009234 l
262.158523 161.860475 l
266.183864 155.629714 l
270.209205 157.1501 l
274.234545 157.741457 l
278.259886 146.719401 l
282.285227 146.847332 l
286.310568 151.019082 l
290.335909 155.391777 l
294.36125 156.944311 l
298.386591 159.554277 l
302.411932 151.376423 l
306.437273 157.580197 l
310.462614 154.956166 l
314.487955 157.286903 l
318.513295 157.28118 l
322.538636 153.433319 l
326.563977 152.66928 l
330.589318 151.10502 l
334.614659 152.378829 l
338.64 152.936794 l
342.665341 153.03927 l
346.690682 152.307275 l
350.716023 151.381123 l
354.741364 151.733109 l
358.766705 153.752424 l
362.792045 155.005499 l
366.817386 156.651594 l
370.842727 153.500377 l
374.868068 155.440005 l
378.893409 154.133929 l
382.91875 155.363093 l
386.944091 155.814829 l
390.969432 154.288915 l
394.994773 152.430217 l
399.020114 150.568589 l
403.045455 153.137859 l
407.070795 152.670549 l
411.096136 153.11187 l
415.121477 153.349748 l
419.146818 152.122517 l
423.172159 152.566212 l
427.1975 152.854438 l
431.222841 153.655744 l
435.248182 147.3727 l
439.273523 149.950085 l
443.298864 144.539092 l
447.324205 151.97805 l
451.349545 149.865558 l
455.374886 152.88528 l
459.400227 151.75086 l
463.425568 151.546699 l
467.450909 152.899357 l
471.47625 149.931295 l
stroke
grestore
0.611 0.090 0.620 setrgbcolor
gsave
398.5 308.8 72.97 58.68 clipbox
72.9675 235.56957 m
76.992841 189.052652 l
81.018182 188.29563 l
85.043523 177.919781 l
89.068864 176.199447 l
93.094205 181.746204 l
97.119545 182.373448 l
101.144886 185.06655 l
105.170227 184.298621 l
109.195568 176.361128 l
113.220909 177.141977 l
117.24625 180.901302 l
121.271591 175.984361 l
125.296932 174.714049 l
129.322273 173.726302 l
133.347614 170.335905 l
137.372955 162.945092 l
141.398295 159.988209 l
145.423636 177.568376 l
149.448977 178.746656 l
153.474318 172.03819 l
157.499659 171.814389 l
161.525 173.717856 l
165.550341 173.134877 l
169.575682 175.708426 l
173.601023 180.217827 l
177.626364 179.868834 l
181.651705 171.412322 l
185.677045 173.323426 l
189.702386 176.151497 l
193.727727 165.656287 l
197.753068 165.173016 l
201.778409 165.849974 l
205.80375 169.818722 l
209.829091 171.990081 l
213.854432 170.647503 l
217.879773 163.912355 l
221.905114 163.228544 l
225.930455 166.904179 l
229.955795 165.966407 l
233.981136 163.033297 l
238.006477 162.014157 l
242.031818 160.245099 l
246.057159 160.350915 l
250.0825 161.827893 l
254.107841 165.988698 l
258.133182 169.851307 l
262.158523 164.413209 l
266.183864 171.409851 l
270.209205 171.00686 l
274.234545 171.81314 l
278.259886 163.058741 l
282.285227 158.941827 l
286.310568 159.832886 l
290.335909 163.393938 l
294.36125 164.044845 l
298.386591 164.281213 l
302.411932 157.815105 l
306.437273 154.200096 l
310.462614 153.452769 l
314.487955 162.681091 l
318.513295 164.122044 l
322.538636 161.715673 l
326.563977 159.884742 l
330.589318 160.318944 l
334.614659 164.25647 l
338.64 149.957075 l
342.665341 149.634601 l
346.690682 151.232282 l
350.716023 152.600441 l
354.741364 156.024589 l
358.766705 154.146953 l
362.792045 165.714764 l
366.817386 167.658594 l
370.842727 164.05114 l
374.868068 159.59219 l
378.893409 157.47874 l
382.91875 158.950285 l
386.944091 156.679707 l
390.969432 159.017926 l
394.994773 159.849634 l
399.020114 161.647458 l
403.045455 161.096756 l
407.070795 159.772042 l
411.096136 157.255727 l
415.121477 159.262199 l
419.146818 157.941574 l
423.172159 150.611009 l
427.1975 150.871662 l
431.222841 156.6234 l
435.248182 162.862216 l
439.273523 162.491632 l
443.298864 160.397041 l
447.324205 166.902188 l
451.349545 165.481613 l
455.374886 166.089187 l
459.400227 163.016866 l
463.425568 172.157095 l
467.450909 172.079306 l
471.47625 159.397687 l
stroke
grestore
0.711 0.183 0.550 setrgbcolor
gsave
398.5 308.8 72.97 58.68 clipbox
72.9675 235.31821 m
76.992841 190.386165 l
81.018182 184.380408 l
85.043523 183.317472 l
89.068864 180.585845 l
93.094205 185.367492 l
97.119545 173.013095 l
101.144886 173.937431 l
105.170227 174.977386 l
109.195568 178.676034 l
113.220909 184.185039 l
117.24625 182.671669 l
121.271591 181.306422 l
125.296932 185.740153 l
129.322273 180.277127 l
133.347614 175.863812 l
137.372955 174.984241 l
141.398295 184.400908 l
145.423636 182.553581 l
149.448977 184.199555 l
153.474318 192.519085 l
157.499659 186.69427 l
161.525 170.764739 l
165.550341 169.689469 l
169.575682 179.659764 l
173.601023 181.930293 l
177.626364 181.956152 l
181.651705 181.389564 l
185.677045 183.347978 l
189.702386 177.800896 l
193.727727 182.420439 l
197.753068 183.813479 l
201.778409 188.021013 l
205.80375 184.32167 l
209.829091 181.834817 l
213.854432 183.742408 l
217.879773 186.458568 l
221.905114 183.024712 l
225.930455 187.267377 l
229.955795 187.077977 l
233.981136 187.762318 l
238.006477 191.394628 l
242.031818 186.700797 l
246.057159 185.522589 l
250.0825 188.615903 l
254.107841 188.56754 l
258.133182 184.988751 l
262.158523 186.323764 l
266.183864 192.171789 l
270.209205 193.879203 l
274.234545 192.709146 l
278.259886 196.695949 l
282.285227 196.946884 l
286.310568 195.116956 l
290.335909 184.2423 l
294.36125 183.031084 l
298.386591 181.978302 l
302.411932 187.89153 l
306.437273 189.838584 l
310.462614 187.129487 l
314.487955 191.754599 l
318.513295 197.201322 l
322.538636 193.050727 l
326.563977 200.800743 l
330.589318 191.76533 l
334.614659 203.180844 l
338.64 196.757729 l
342.665341 196.22855 l
346.690682 197.606517 l
350.716023 199.36972 l
354.741364 199.772959 l
358.766705 201.313982 l
362.792045 189.646708 l
366.817386 188.944833 l
370.842727 189.095598 l
374.868068 190.356774 l
378.893409 185.277875 l
382.91875 190.768836 l
386.944091 194.501362 l
390.969432 194.220013 l
394.994773 190.495974 l
399.020114 198.54074 l
403.045455 196.492795 l
407.070795 196.783083 l
411.096136 195.956145 l
415.121477 194.659288 l
419.146818 189.476649 l
423.172159 204.325061 l
427.1975 199.491486 l
431.222841 199.498894 l
435.248182 191.884668 l
439.273523 194.991508 l
443.298864 211.667783 l
447.324205 204.678322 l
451.349545 208.14239 l
455.374886 204.471508 l
459.400227 202.891431 l
463.425568 203.282421 l
467.450909 203.247381 l
471.47625 199.309764 l
stroke
grestore
0.798 0.280 0.470 setrgbcolor
gsave
398.5 308.8 72.97 58.68 clipbox
72.9675 238.330273 m
76.992841 190.314969 l
81.018182 189.842651 l
85.043523 182.448634 l
89.068864 180.016493 l
93.094205 180.624611 l
97.119545 180.358092 l
101.144886 182.176449 l
105.170227 182.9296 l
109.195568 176.588243 l
113.220909 170.445977 l
117.24625 178.046146 l
121.271591 178.942915 l
125.296932 178.212492 l
129.322273 176.831031 l
133.347614 170.953789 l
137.372955 168.281795 l
141.398295 174.545227 l
145.423636 173.275327 l
149.448977 171.502938 l
153.474318 176.136882 l
157.499659 163.9087 l
161.525 161.368283 l
165.550341 166.671376 l
169.575682 174.42096 l
173.601023 174.11752 l
177.626364 172.986632 l
181.651705 167.361881 l
185.677045 170.9445 l
189.702386 165.647192 l
193.727727 175.091987 l
197.753068 178.397633 l
201.778409 180.496644 l
205.80375 179.589919 l
209.829091 179.739417 l
213.854432 178.521202 l
217.879773 171.029866 l
221.905114 174.019111 l
225.930455 171.541388 l
229.955795 173.72022 l
233.981136 172.813831 l
238.006477 175.088545 l
242.031818 179.523462 l
246.057159 181.235166 l
250.0825 181.697457 l
254.107841 184.048138 l
258.133182 182.576291 l
262.158523 185.823443 l
266.183864 185.765887 l
270.209205 183.287168 l
274.234545 186.249079 l
278.259886 190.645756 l
282.285227 189.49041 l
286.310568 191.053587 l
290.335909 178.493881 l
294.36125 176.724934 l
298.386591 180.343282 l
302.411932 186.602029 l
306.437273 187.83837 l
310.462614 187.161562 l
314.487955 194.848821 l
318.513295 197.806535 l
322.538636 196.103014 l
326.563977 192.088648 l
330.589318 190.970184 l
334.614659 191.630406 l
338.64 190.746455 l
342.665341 193.625379 l
346.690682 198.24165 l
350.716023 178.407247 l
354.741364 193.616489 l
358.766705 194.980057 l
362.792045 180.830307 l
366.817386 180.7665 l
370.842727 179.099748 l
374.868068 184.075798 l
378.893409 187.148412 l
382.91875 188.893859 l
386.944091 183.781696 l
390.969432 191.761566 l
394.994773 190.407596 l
399.020114 186.196178 l
403.045455 189.46353 l
407.070795 201.67612 l
411.096136 192.444294 l
415.121477 194.581318 l
419.146818 194.220353 l
423.172159 191.51936 l
427.1975 189.240646 l
431.222841 191.279597 l
435.248182 190.183266 l
439.273523 191.734157 l
443.298864 194.603921 l
447.324205 191.120915 l
451.349545 191.611685 l
455.374886 192.955949 l
459.400227 184.720178 l
463.425568 185.580432 l
467.450909 194.635698 l
471.47625 189.357385 l
stroke
grestore
0.869 0.374 0.397 setrgbcolor
gsave
398.5 308.8 72.97 58.68 clipbox
72.9675 212.058036 m
76.992841 190.098407 l
81.018182 186.867131 l
85.043523 194.747654 l
89.068864 199.555195 l
93.094205 187.670305 l
97.119545 190.214104 l
101.144886 192.202456 l
105.170227 189.918967 l
109.195568 200.524974 l
113.220909 204.409392 l
117.24625 204.758416 l
121.271591 198.473276 l
125.296932 199.947459 l
129.322273 201.700893 l
133.347614 195.003842 l
137.372955 187.119655 l
141.398295 197.660691 l
145.423636 201.464471 l
149.448977 203.535876 l
153.474318 207.280564 l
157.499659 201.731265 l
161.525 199.087303 l
165.550341 197.770354 l
169.575682 199.572666 l
173.601023 200.165901 l
177.626364 197.321323 l
181.651705 200.915052 l
185.677045 204.441532 l
189.702386 199.256199 l
193.727727 202.426437 l
197.753068 203.066303 l
201.778409 203.876808 l
205.80375 204.491067 l
209.829091 204.590499 l
213.854432 204.50591 l
217.879773 206.088061 l
221.905114 211.370461 l
225.930455 203.582939 l
229.955795 207.055994 l
233.981136 210.842745 l
238.006477 206.209859 l
242.031818 211.637921 l
246.057159 210.036058 l
250.0825 207.93749 l
254.107841 210.842977 l
258.133182 211.435067 l
262.158523 211.222032 l
266.183864 211.855244 l
270.209205 209.098035 l
274.234545 218.00135 l
278.259886 209.815548 l
282.285227 209.451285 l
286.310568 208.847139 l
290.335909 215.26889 l
294.36125 212.950855 l
298.386591 211.917376 l
302.411932 213.749133 l
306.437273 210.704605 l
310.462614 208.705357 l
314.487955 216.36845 l
318.513295 215.668413 l
322.538636 218.501826 l
326.563977 212.753714 l
330.589318 213.6752 l
334.614659 218.096507 l
338.64 214.498163 l
342.665341 215.439487 l
346.690682 213.297746 l
350.716023 225.742308 l
354.741364 228.800587 l
358.766705 226.847354 l
362.792045 216.930403 l
366.817386 217.046079 l
370.842727 216.534508 l
374.868068 221.51306 l
378.893409 224.581808 l
382.91875 222.676295 l
386.944091 224.778876 l
390.969432 225.373368 l
394.994773 223.429633 l
399.020114 220.028675 l
403.045455 217.093217 l
407.070795 218.13894 l
411.096136 220.547479 l
415.121477 219.513777 l
419.146818 220.748762 l
423.172159 223.037215 l
427.1975 226.913417 l
431.222841 230.624351 l
435.248182 231.138361 l
439.273523 231.985077 l
443.298864 228.359012 l
447.324205 229.034143 l
451.349545 230.546738 l
455.374886 231.712096 l
459.400227 230.601854 l
463.425568 229.839035 l
467.450909 230.933009 l
471.47625 230.293231 l
stroke
grestore
0.928 0.473 0.326 setrgbcolor
gsave
398.5 308.8 72.97 58.68 clipbox
72.9675 212.660996 m
76.992841 192.7472 l
81.018182 187.230336 l
85.043523 189.557569 l
89.068864 187.257929 l
93.094205 185.258534 l
97.119545 192.661224 l
101.144886 196.392309 l
105.170227 195.949298 l
109.195568 192.769446 l
113.220909 195.118321 l
117.24625 194.271943 l
121.271591 200.609848 l
125.296932 203.297875 l
129.322273 196.536675 l
133.347614 196.522447 l
137.372955 192.883334 l
141.398295 186.78234 l
145.423636 201.789161 l
149.448977 194.161499 l
153.474318 198.091305 l
157.499659 191.033767 l
161.525 184.837659 l
165.550341 196.057927 l
169.575682 192.23982 l
173.601023 191.571437 l
177.626364 184.005428 l
181.651705 196.819671 l
185.677045 195.764089 l
189.702386 196.626896 l
193.727727 199.489694 l
197.753068 199.030813 l
201.778409 199.736926 l
205.80375 195.943946 l
209.829091 196.756094 l
213.854432 193.305965 l
217.879773 200.185465 l
221.905114 198.071299 l
225.930455 197.242412 l
229.955795 194.62559 l
233.981136 195.588541 l
238.006477 196.401314 l
242.031818 192.116178 l
246.057159 192.037278 l
250.0825 191.429332 l
254.107841 199.169805 l
258.133182 193.092783 l
262.158523 195.881359 l
266.183864 191.392004 l
270.209205 189.503957 l
274.234545 192.832645 l
278.259886 185.605667 l
282.285227 186.466977 l
286.310568 189.235384 l
290.335909 194.040817 l
294.36125 192.890116 l
298.386591 195.97263 l
302.411932 191.624641 l
306.437273 193.004305 l
310.462614 191.676028 l
314.487955 189.422559 l
318.513295 192.514094 l
322.538636 192.040727 l
326.563977 190.767868 l
330.589318 194.650242 l
334.614659 193.838915 l
338.64 186.994982 l
342.665341 203.81117 l
346.690682 184.964352 l
350.716023 187.367526 l
354.741364 180.046495 l
358.766705 180.255753 l
362.792045 184.911614 l
366.817386 184.246535 l
370.842727 181.595196 l
374.868068 180.763038 l
378.893409 177.441703 l
382.91875 176.058299 l
386.944091 193.245565 l
390.969432 189.581496 l
394.994773 193.162773 l
399.020114 176.940676 l
403.045455 177.440144 l
407.070795 175.633899 l
411.096136 181.527457 l
415.121477 182.388104 l
419.146818 179.994929 l
423.172159 182.994047 l
427.1975 193.651464 l
431.222841 190.010812 l
435.248182 174.768221 l
439.273523 174.473881 l
443.298864 175.26921 l
447.324205 179.655825 l
451.349545 180.709291 l
455.374886 181.332839 l
459.400227 175.852299 l
463.425568 175.906569 l
467.450909 175.339046 l
471.47625 172.800798 l
stroke
grestore
0.973 0.586 0.252 setrgbcolor
gsave
398.5 308.8 72.97 58.68 clipbox
72.9675 225.734876 m
76.992841 187.974325 l
81.018182 189.817306 l
85.043523 181.150871 l
89.068864 176.78799 l
93.094205 182.763398 l
97.119545 185.60429 l
101.144886 188.014331 l
105.170227 187.638447 l
109.195568 183.975753 l
113.220909 189.992254 l
117.24625 184.618521 l
121.271591 182.04303 l
125.296932 180.40834 l
129.322273 179.468944 l
133.347614 185.620258 l
137.372955 182.512885 l
141.398295 183.886357 l
145.423636 181.6472 l
149.448977 183.005085 l
153.474318 186.014291 l
157.499659 175.17031 l
161.525 170.079373 l
165.550341 170.681076 l
169.575682 178.728439 l
173.601023 185.697724 l
177.626364 179.799094 l
181.651705 177.833321 l
185.677045 176.998939 l
189.702386 179.575731 l
193.727727 167.072805 l
197.753068 166.031562 l
201.778409 163.061675 l
205.80375 168.919986 l
209.829091 171.840276 l
213.854432 168.570132 l
217.879773 167.375666 l
221.905114 171.277713 l
225.930455 170.892151 l
229.955795 172.584288 l
233.981136 174.539308 l
238.006477 172.193714 l
242.031818 169.737718 l
246.057159 170.300451 l
250.0825 164.516389 l
254.107841 175.18844 l
258.133182 174.816842 l
262.158523 177.579911 l
266.183864 170.775192 l
270.209205 165.654682 l
274.234545 174.081673 l
278.259886 162.516137 l
282.285227 161.710987 l
286.310568 167.093397 l
290.335909 157.332196 l
294.36125 158.287889 l
298.386591 172.775281 l
302.411932 164.663353 l
306.437273 166.794561 l
310.462614 171.408073 l
314.487955 162.611404 l
318.513295 162.627922 l
322.538636 159.318604 l
326.563977 161.022667 l
330.589318 160.023291 l
334.614659 160.099998 l
338.64 165.260344 l
342.665341 165.778562 l
346.690682 165.64413 l
350.716023 162.23768 l
354.741364 162.890486 l
358.766705 163.064551 l
362.792045 157.894383 l
366.817386 159.515885 l
370.842727 150.865481 l
374.868068 167.772063 l
378.893409 166.39816 l
382.91875 163.849246 l
386.944091 160.603869 l
390.969432 161.46295 l
394.994773 159.56643 l
399.020114 168.871238 l
403.045455 166.503735 l
407.070795 158.952418 l
411.096136 167.11124 l
415.121477 162.689826 l
419.146818 161.479767 l
423.172159 157.872425 l
427.1975 155.383796 l
431.222841 155.662218 l
435.248182 154.732833 l
439.273523 156.95041 l
443.298864 156.058494 l
447.324205 155.132006 l
451.349545 156.442851 l
455.374886 154.265285 l
459.400227 160.315685 l
463.425568 159.730355 l
467.450909 158.193597 l
471.47625 160.24193 l
stroke
grestore
0.994 0.705 0.183 setrgbcolor
gsave
398.5 308.8 72.97 58.68 clipbox
72.9675 208.122085 m
76.992841 186.471198 l
81.018182 187.427379 l
85.043523 190.365042 l
89.068864 186.019949 l
93.094205 205.26062 l
97.119545 201.913518 l
101.144886 199.766025 l
105.170227 200.337896 l
109.195568 209.413233 l
113.220909 208.733236 l
117.24625 206.801243 l
121.271591 205.101876 l
125.296932 205.418311 l
129.322273 204.270658 l
133.347614 203.540064 l
137.372955 217.116913 l
141.398295 208.83612 l
145.423636 209.649508 l
149.448977 206.842852 l
153.474318 208.981482 l
157.499659 207.744844 l
161.525 211.797044 l
165.550341 206.980755 l
169.575682 203.096704 l
173.601023 204.645709 l
177.626364 202.37986 l
181.651705 201.823512 l
185.677045 206.426125 l
189.702386 208.742039 l
193.727727 204.879601 l
197.753068 205.019127 l
201.778409 203.83735 l
205.80375 208.309528 l
209.829091 205.390387 l
213.854432 206.229258 l
217.879773 207.453945 l
221.905114 210.06325 l
225.930455 210.768855 l
229.955795 207.120035 l
233.981136 208.47912 l
238.006477 208.612094 l
242.031818 198.558975 l
246.057159 197.277324 l
250.0825 194.804846 l
254.107841 205.242498 l
258.133182 206.032129 l
262.158523 209.432706 l
266.183864 204.500872 l
270.209205 203.325463 l
274.234545 204.318731 l
278.259886 206.413154 l
282.285227 206.182811 l
286.310568 205.842913 l
290.335909 205.582185 l
294.36125 202.247562 l
298.386591 204.767208 l
302.411932 211.495629 l
306.437273 212.974301 l
310.462614 211.696615 l
314.487955 215.249382 l
318.513295 213.398277 l
322.538636 210.222601 l
326.563977 207.524068 l
330.589318 207.497271 l
334.614659 209.28144 l
338.64 209.871036 l
342.665341 207.647259 l
346.690682 210.993201 l
350.716023 215.801739 l
354.741364 219.613343 l
358.766705 218.50595 l
362.792045 203.909275 l
366.817386 201.647576 l
370.842727 208.985677 l
374.868068 208.012324 l
378.893409 205.473592 l
382.91875 206.216004 l
386.944091 211.168579 l
390.969432 210.119006 l
394.994773 216.187725 l
399.020114 206.069533 l
403.045455 212.124158 l
407.070795 204.345975 l
411.096136 207.887697 l
415.121477 203.76047 l
419.146818 214.806862 l
423.172159 207.644214 l
427.1975 221.879749 l
431.222841 212.599635 l
435.248182 208.026815 l
439.273523 207.19127 l
443.298864 205.650872 l
447.324205 203.794654 l
451.349545 201.47445 l
455.374886 203.495305 l
459.400227 199.26452 l
463.425568 199.169559 l
467.450909 196.512488 l
471.47625 212.782822 l
stroke
grestore
0 setlinejoin
[] 0 setdash
0.000 setgray
gsave
72.9675 58.68 m
72.9675 367.528 l
stroke
grestore
gsave
471.47625 58.68 m
471.47625 367.528 l
stroke
grestore
gsave
72.9675 58.68 m
471.47625 58.68 l
stroke
grestore
gsave
72.9675 367.528 m
471.47625 367.528 l
stroke
grestore
0.500 setlinewidth
1 setlinejoin
0 setlinecap
[] 0 setdash
gsave
/o {
gsave
newpath
translate
0.5 setlinewidth
1 setlinejoin
0 setlinecap
0 0 m
0 4 l

gsave
0.000 setgray
fill
grestore
stroke
grestore
} bind def
72.9675 58.68 o
grestore
gsave
/o {
gsave
newpath
translate
0.5 setlinewidth
1 setlinejoin
0 setlinecap
0 0 m
0 -4 l

gsave
0.000 setgray
fill
grestore
stroke
grestore
} bind def
72.9675 367.528 o
grestore
/DejaVuSans findfont
16.000 scalefont
setfont
gsave
67.873750 42.523750 translate
0.000000 rotate
0.000000 0.000000 m /zero glyphshow
grestore
gsave
/o {
gsave
newpath
translate
0.5 setlinewidth
1 setlinejoin
0 setlinecap
0 0 m
0 4 l

gsave
0.000 setgray
fill
grestore
stroke
grestore
} bind def
152.669 58.68 o
grestore
gsave
/o {
gsave
newpath
translate
0.5 setlinewidth
1 setlinejoin
0 setlinecap
0 0 m
0 -4 l

gsave
0.000 setgray
fill
grestore
stroke
grestore
} bind def
152.669 367.528 o
grestore
gsave
142.481750 42.523750 translate
0.000000 rotate
0.000000 0.000000 m /two glyphshow
10.179688 0.000000 m /zero glyphshow
grestore
gsave
/o {
gsave
newpath
translate
0.5 setlinewidth
1 setlinejoin
0 setlinecap
0 0 m
0 4 l

gsave
0.000 setgray
fill
grestore
stroke
grestore
} bind def
232.371 58.68 o
grestore
gsave
/o {
gsave
newpath
translate
0.5 setlinewidth
1 setlinejoin
0 setlinecap
0 0 m
0 -4 l

gsave
0.000 setgray
fill
grestore
stroke
grestore
} bind def
232.371 367.528 o
grestore
gsave
222.183500 42.523750 translate
0.000000 rotate
0.000000 0.000000 m /four glyphshow
10.179688 0.000000 m /zero glyphshow
grestore
gsave
/o {
gsave
newpath
translate
0.5 setlinewidth
1 setlinejoin
0 setlinecap
0 0 m
0 4 l

gsave
0.000 setgray
fill
grestore
stroke
grestore
} bind def
312.073 58.68 o
grestore
gsave
/o {
gsave
newpath
translate
0.5 setlinewidth
1 setlinejoin
0 setlinecap
0 0 m
0 -4 l

gsave
0.000 setgray
fill
grestore
stroke
grestore
} bind def
312.073 367.528 o
grestore
gsave
301.885250 42.523750 translate
0.000000 rotate
0.000000 0.000000 m /six glyphshow
10.179688 0.000000 m /zero glyphshow
grestore
gsave
/o {
gsave
newpath
translate
0.5 setlinewidth
1 setlinejoin
0 setlinecap
0 0 m
0 4 l

gsave
0.000 setgray
fill
grestore
stroke
grestore
} bind def
391.775 58.68 o
grestore
gsave
/o {
gsave
newpath
translate
0.5 setlinewidth
1 setlinejoin
0 setlinecap
0 0 m
0 -4 l

gsave
0.000 setgray
fill
grestore
stroke
grestore
} bind def
391.775 367.528 o
grestore
gsave
381.587000 42.523750 translate
0.000000 rotate
0.000000 0.000000 m /eight glyphshow
10.179688 0.000000 m /zero glyphshow
grestore
gsave
/o {
gsave
newpath
translate
0.5 setlinewidth
1 setlinejoin
0 setlinecap
0 0 m
0 4 l

gsave
0.000 setgray
fill
grestore
stroke
grestore
} bind def
471.476 58.68 o
grestore
gsave
/o {
gsave
newpath
translate
0.5 setlinewidth
1 setlinejoin
0 setlinecap
0 0 m
0 -4 l

gsave
0.000 setgray
fill
grestore
stroke
grestore
} bind def
471.476 367.528 o
grestore
gsave
456.195000 42.523750 translate
0.000000 rotate
0.000000 0.000000 m /one glyphshow
10.179688 0.000000 m /zero glyphshow
20.359375 0.000000 m /zero glyphshow
grestore
gsave
174.690625 22.039375 translate
0.000000 rotate
0.000000 0.000000 m /I glyphshow
4.718750 0.000000 m /t glyphshow
10.992188 0.000000 m /e glyphshow
20.835938 0.000000 m /r glyphshow
27.414062 0.000000 m /a glyphshow
37.218750 0.000000 m /t glyphshow
43.492188 0.000000 m /i glyphshow
47.937500 0.000000 m /o glyphshow
57.726562 0.000000 m /n glyphshow
67.867188 0.000000 m /space glyphshow
72.953125 0.000000 m /numbersign glyphshow
86.359375 0.000000 m /space glyphshow
91.445312 0.000000 m /parenleft glyphshow
97.687500 0.000000 m /N glyphshow
109.656250 0.000000 m /o glyphshow
119.445312 0.000000 m /r glyphshow
126.023438 0.000000 m /m glyphshow
141.609375 0.000000 m /a glyphshow
151.414062 0.000000 m /l glyphshow
155.859375 0.000000 m /i glyphshow
160.304688 0.000000 m /z glyphshow
168.703125 0.000000 m /e glyphshow
178.546875 0.000000 m /d glyphshow
188.703125 0.000000 m /parenright glyphshow
grestore
gsave
/o {
gsave
newpath
translate
0.5 setlinewidth
1 setlinejoin
0 setlinecap
0 0 m
4 0 l

gsave
0.000 setgray
fill
grestore
stroke
grestore
} bind def
72.9675 85.1527 o
grestore
gsave
/o {
gsave
newpath
translate
0.5 setlinewidth
1 setlinejoin
0 setlinecap
0 0 m
-4 0 l

gsave
0.000 setgray
fill
grestore
stroke
grestore
} bind def
471.476 85.1527 o
grestore
gsave
38.405000 79.074561 translate
0.000000 rotate
0.000000 0.000000 m /one glyphshow
10.179688 0.000000 m /two glyphshow
20.359375 0.000000 m /zero glyphshow
grestore
gsave
/o {
gsave
newpath
translate
0.5 setlinewidth
1 setlinejoin
0 setlinecap
0 0 m
4 0 l

gsave
0.000 setgray
fill
grestore
stroke
grestore
} bind def
72.9675 120.45 o
grestore
gsave
/o {
gsave
newpath
translate
0.5 setlinewidth
1 setlinejoin
0 setlinecap
0 0 m
-4 0 l

gsave
0.000 setgray
fill
grestore
stroke
grestore
} bind def
471.476 120.45 o
grestore
gsave
38.405000 114.371475 translate
0.000000 rotate
0.000000 0.000000 m /one glyphshow
10.179688 0.000000 m /two glyphshow
20.359375 0.000000 m /five glyphshow
grestore
gsave
/o {
gsave
newpath
translate
0.5 setlinewidth
1 setlinejoin
0 setlinecap
0 0 m
4 0 l

gsave
0.000 setgray
fill
grestore
stroke
grestore
} bind def
72.9675 155.747 o
grestore
gsave
/o {
gsave
newpath
translate
0.5 setlinewidth
1 setlinejoin
0 setlinecap
0 0 m
-4 0 l

gsave
0.000 setgray
fill
grestore
stroke
grestore
} bind def
471.476 155.747 o
grestore
gsave
38.405000 149.668389 translate
0.000000 rotate
0.000000 0.000000 m /one glyphshow
10.179688 0.000000 m /three glyphshow
20.359375 0.000000 m /zero glyphshow
grestore
gsave
/o {
gsave
newpath
translate
0.5 setlinewidth
1 setlinejoin
0 setlinecap
0 0 m
4 0 l

gsave
0.000 setgray
fill
grestore
stroke
grestore
} bind def
72.9675 191.043 o
grestore
gsave
/o {
gsave
newpath
translate
0.5 setlinewidth
1 setlinejoin
0 setlinecap
0 0 m
-4 0 l

gsave
0.000 setgray
fill
grestore
stroke
grestore
} bind def
471.476 191.043 o
grestore
gsave
38.405000 184.965304 translate
0.000000 rotate
0.000000 0.000000 m /one glyphshow
10.179688 0.000000 m /three glyphshow
20.359375 0.000000 m /five glyphshow
grestore
gsave
/o {
gsave
newpath
translate
0.5 setlinewidth
1 setlinejoin
0 setlinecap
0 0 m
4 0 l

gsave
0.000 setgray
fill
grestore
stroke
grestore
} bind def
72.9675 226.34 o
grestore
gsave
/o {
gsave
newpath
translate
0.5 setlinewidth
1 setlinejoin
0 setlinecap
0 0 m
-4 0 l

gsave
0.000 setgray
fill
grestore
stroke
grestore
} bind def
471.476 226.34 o
grestore
gsave
38.405000 220.262218 translate
0.000000 rotate
0.000000 0.000000 m /one glyphshow
10.179688 0.000000 m /four glyphshow
20.359375 0.000000 m /zero glyphshow
grestore
gsave
/o {
gsave
newpath
translate
0.5 setlinewidth
1 setlinejoin
0 setlinecap
0 0 m
4 0 l

gsave
0.000 setgray
fill
grestore
stroke
grestore
} bind def
72.9675 261.637 o
grestore
gsave
/o {
gsave
newpath
translate
0.5 setlinewidth
1 setlinejoin
0 setlinecap
0 0 m
-4 0 l

gsave
0.000 setgray
fill
grestore
stroke
grestore
} bind def
471.476 261.637 o
grestore
gsave
38.405000 255.559132 translate
0.000000 rotate
0.000000 0.000000 m /one glyphshow
10.179688 0.000000 m /four glyphshow
20.359375 0.000000 m /five glyphshow
grestore
gsave
/o {
gsave
newpath
translate
0.5 setlinewidth
1 setlinejoin
0 setlinecap
0 0 m
4 0 l

gsave
0.000 setgray
fill
grestore
stroke
grestore
} bind def
72.9675 296.934 o
grestore
gsave
/o {
gsave
newpath
translate
0.5 setlinewidth
1 setlinejoin
0 setlinecap
0 0 m
-4 0 l

gsave
0.000 setgray
fill
grestore
stroke
grestore
} bind def
471.476 296.934 o
grestore
gsave
38.405000 290.856046 translate
0.000000 rotate
0.000000 0.000000 m /one glyphshow
10.179688 0.000000 m /five glyphshow
20.359375 0.000000 m /zero glyphshow
grestore
gsave
/o {
gsave
newpath
translate
0.5 setlinewidth
1 setlinejoin
0 setlinecap
0 0 m
4 0 l

gsave
0.000 setgray
fill
grestore
stroke
grestore
} bind def
72.9675 332.231 o
grestore
gsave
/o {
gsave
newpath
translate
0.5 setlinewidth
1 setlinejoin
0 setlinecap
0 0 m
-4 0 l

gsave
0.000 setgray
fill
grestore
stroke
grestore
} bind def
471.476 332.231 o
grestore
gsave
38.405000 326.152961 translate
0.000000 rotate
0.000000 0.000000 m /one glyphshow
10.179688 0.000000 m /five glyphshow
20.359375 0.000000 m /five glyphshow
grestore
gsave
/o {
gsave
newpath
translate
0.5 setlinewidth
1 setlinejoin
0 setlinecap
0 0 m
4 0 l

gsave
0.000 setgray
fill
grestore
stroke
grestore
} bind def
72.9675 367.528 o
grestore
gsave
/o {
gsave
newpath
translate
0.5 setlinewidth
1 setlinejoin
0 setlinecap
0 0 m
-4 0 l

gsave
0.000 setgray
fill
grestore
stroke
grestore
} bind def
471.476 367.528 o
grestore
gsave
38.405000 361.449875 translate
0.000000 rotate
0.000000 0.000000 m /one glyphshow
10.179688 0.000000 m /six glyphshow
20.359375 0.000000 m /zero glyphshow
grestore
gsave
30.076875 111.479000 translate
90.000000 rotate
0.000000 0.000000 m /S glyphshow
10.156250 0.000000 m /o glyphshow
19.945312 0.000000 m /c glyphshow
28.742188 0.000000 m /k glyphshow
38.007812 0.000000 m /e glyphshow
47.851562 0.000000 m /t glyphshow
54.125000 0.000000 m /plus glyphshow
67.531250 0.000000 m /D glyphshow
79.851562 0.000000 m /R glyphshow
90.968750 0.000000 m /A glyphshow
101.914062 0.000000 m /M glyphshow
115.718750 0.000000 m /space glyphshow
120.804688 0.000000 m /P glyphshow
130.453125 0.000000 m /o glyphshow
140.242188 0.000000 m /w glyphshow
153.328125 0.000000 m /e glyphshow
163.171875 0.000000 m /r glyphshow
169.750000 0.000000 m /space glyphshow
174.835938 0.000000 m /parenleft glyphshow
181.078125 0.000000 m /W glyphshow
196.898438 0.000000 m /parenright glyphshow
grestore
/DejaVuSans findfont
19.200 scalefont
setfont
gsave
142.245313 399.983085 translate
0.000000 rotate
0.000000 0.000000 m /H glyphshow
14.475098 0.000000 m /A glyphshow
27.643677 0.000000 m /C glyphshow
41.084839 0.000000 m /C glyphshow
54.526001 0.000000 m /space glyphshow
60.645020 0.000000 m /I glyphshow
66.322266 0.000000 m /t glyphshow
73.869995 0.000000 m /e glyphshow
85.713257 0.000000 m /r glyphshow
93.627563 0.000000 m /a glyphshow
105.423828 0.000000 m /t glyphshow
112.971558 0.000000 m /i glyphshow
118.319824 0.000000 m /o glyphshow
130.097290 0.000000 m /n glyphshow
142.297729 0.000000 m /space glyphshow
148.416748 0.000000 m /L glyphshow
159.141479 0.000000 m /o glyphshow
170.918945 0.000000 m /o glyphshow
182.696411 0.000000 m /p glyphshow
194.915649 0.000000 m /space glyphshow
201.034668 0.000000 m /P glyphshow
212.642944 0.000000 m /o glyphshow
224.420410 0.000000 m /w glyphshow
240.164429 0.000000 m /e glyphshow
252.007690 0.000000 m /r glyphshow
grestore
gsave
141.479688 378.704960 translate
0.000000 rotate
0.000000 0.000000 m /at glyphshow
19.250000 0.000000 m /space glyphshow
25.369019 0.000000 m /one glyphshow
37.616455 0.000000 m /three glyphshow
49.863892 0.000000 m /five glyphshow
62.111328 0.000000 m /space glyphshow
68.230347 0.000000 m /W glyphshow
87.264160 0.000000 m /space glyphshow
93.383179 0.000000 m /hyphen glyphshow
100.329346 0.000000 m /space glyphshow
106.448364 0.000000 m /K glyphshow
119.071777 0.000000 m /n glyphshow
131.272217 0.000000 m /i glyphshow
136.620483 0.000000 m /g glyphshow
148.839722 0.000000 m /h glyphshow
161.040161 0.000000 m /t glyphshow
168.587891 0.000000 m /s glyphshow
178.617065 0.000000 m /space glyphshow
184.736084 0.000000 m /L glyphshow
195.460815 0.000000 m /a glyphshow
207.257080 0.000000 m /n glyphshow
219.457520 0.000000 m /d glyphshow
231.676758 0.000000 m /i glyphshow
237.025024 0.000000 m /n glyphshow
249.225464 0.000000 m /g glyphshow
grestore
3.000 setlinewidth
2 setlinecap
gsave
398.5 308.8 72.97 58.68 clipbox
72.9675 214.968687 m
76.992841 192.046808 l
81.018182 194.846915 l
85.043523 250.80656 l
89.068864 250.963253 l
93.094205 253.614335 l
97.119545 279.754 l
101.144886 283.233706 l
105.170227 283.040323 l
109.195568 301.969511 l
113.220909 300.668944 l
117.24625 300.156108 l
121.271591 301.241138 l
125.296932 302.606232 l
129.322273 302.196596 l
133.347614 303.135417 l
137.372955 300.859826 l
141.398295 302.201339 l
145.423636 302.016773 l
149.448977 306.317734 l
153.474318 323.497094 l
157.499659 317.212299 l
161.525 317.278101 l
165.550341 314.56793 l
169.575682 315.09272 l
173.601023 326.002492 l
177.626364 318.818218 l
181.651705 321.780428 l
185.677045 316.754913 l
189.702386 321.828998 l
193.727727 310.83828 l
197.753068 332.716709 l
201.778409 322.914522 l
205.80375 316.356843 l
209.829091 329.965709 l
213.854432 327.956706 l
217.879773 325.017497 l
221.905114 324.094518 l
225.930455 323.30478 l
229.955795 323.022292 l
233.981136 320.525781 l
238.006477 321.953433 l
242.031818 314.381623 l
246.057159 313.223952 l
250.0825 311.964032 l
254.107841 315.882822 l
258.133182 316.405478 l
262.158523 317.516231 l
266.183864 312.400676 l
270.209205 307.426349 l
274.234545 309.910403 l
278.259886 304.759938 l
282.285227 313.499175 l
286.310568 312.760415 l
290.335909 315.609701 l
294.36125 315.98004 l
298.386591 316.489723 l
302.411932 313.813203 l
306.437273 305.457466 l
310.462614 315.075913 l
314.487955 313.589846 l
318.513295 312.984511 l
322.538636 309.677626 l
326.563977 308.620472 l
330.589318 308.156229 l
334.614659 312.958683 l
338.64 310.012744 l
342.665341 310.419954 l
346.690682 309.135139 l
350.716023 304.885048 l
354.741364 305.537604 l
358.766705 305.257932 l
362.792045 314.570922 l
366.817386 314.648994 l
370.842727 316.916598 l
374.868068 314.426558 l
378.893409 316.4537 l
382.91875 314.268382 l
386.944091 310.211167 l
390.969432 308.458174 l
394.994773 311.907535 l
399.020114 299.2447 l
403.045455 302.726981 l
407.070795 312.229295 l
411.096136 300.819045 l
415.121477 303.060976 l
419.146818 302.288465 l
423.172159 291.271981 l
427.1975 289.773173 l
431.222841 308.71624 l
435.248182 288.495598 l
439.273523 288.99006 l
443.298864 290.2815 l
447.324205 294.193006 l
451.349545 295.751216 l
455.374886 296.104266 l
459.400227 287.105126 l
463.425568 291.956011 l
467.450909 289.693142 l
471.47625 288.919218 l
stroke
grestore
1.000 setlinewidth
1.000 0.000 0.000 setrgbcolor
gsave
398.5 308.8 72.97 58.68 clipbox
72.9675 214.968687 m
76.992841 192.046808 l
81.018182 194.846915 l
85.043523 250.80656 l
89.068864 250.963253 l
93.094205 253.614335 l
97.119545 279.754 l
101.144886 283.233706 l
105.170227 283.040323 l
109.195568 301.969511 l
113.220909 300.668944 l
117.24625 300.156108 l
121.271591 301.241138 l
125.296932 302.606232 l
129.322273 302.196596 l
133.347614 303.135417 l
137.372955 300.859826 l
141.398295 302.201339 l
145.423636 302.016773 l
149.448977 306.317734 l
153.474318 323.497094 l
157.499659 317.212299 l
161.525 317.278101 l
165.550341 314.56793 l
169.575682 315.09272 l
173.601023 326.002492 l
177.626364 318.818218 l
181.651705 321.780428 l
185.677045 316.754913 l
189.702386 321.828998 l
193.727727 310.83828 l
197.753068 332.716709 l
201.778409 322.914522 l
205.80375 316.356843 l
209.829091 329.965709 l
213.854432 327.956706 l
217.879773 325.017497 l
221.905114 324.094518 l
225.930455 323.30478 l
229.955795 323.022292 l
233.981136 320.525781 l
238.006477 321.953433 l
242.031818 314.381623 l
246.057159 313.223952 l
250.0825 311.964032 l
254.107841 315.882822 l
258.133182 316.405478 l
262.158523 317.516231 l
266.183864 312.400676 l
270.209205 307.426349 l
274.234545 309.910403 l
278.259886 304.759938 l
282.285227 313.499175 l
286.310568 312.760415 l
290.335909 315.609701 l
294.36125 315.98004 l
298.386591 316.489723 l
302.411932 313.813203 l
306.437273 305.457466 l
310.462614 315.075913 l
314.487955 313.589846 l
318.513295 312.984511 l
322.538636 309.677626 l
326.563977 308.620472 l
330.589318 308.156229 l
334.614659 312.958683 l
338.64 310.012744 l
342.665341 310.419954 l
346.690682 309.135139 l
350.716023 304.885048 l
354.741364 305.537604 l
358.766705 305.257932 l
362.792045 314.570922 l
366.817386 314.648994 l
370.842727 316.916598 l
374.868068 314.426558 l
378.893409 316.4537 l
382.91875 314.268382 l
386.944091 310.211167 l
390.969432 308.458174 l
394.994773 311.907535 l
399.020114 299.2447 l
403.045455 302.726981 l
407.070795 312.229295 l
411.096136 300.819045 l
415.121477 303.060976 l
419.146818 302.288465 l
423.172159 291.271981 l
427.1975 289.773173 l
431.222841 308.71624 l
435.248182 288.495598 l
439.273523 288.99006 l
443.298864 290.2815 l
447.324205 294.193006 l
451.349545 295.751216 l
455.374886 296.104266 l
459.400227 287.105126 l
463.425568 291.956011 l
467.450909 289.693142 l
471.47625 288.919218 l
stroke
grestore
0 setlinejoin
0 setlinecap
[] 0 setdash
0.300 setgray
gsave
129.40625 62.68 m
419.0375 62.68 l
420.6375 62.68 421.4375 63.48 421.4375 65.08 c
421.4375 121.78 l
421.4375 123.38 420.6375 124.18 419.0375 124.18 c
129.40625 124.18 l
127.80625 124.18 127.00625 123.38 127.00625 121.78 c
127.00625 65.08 l
127.00625 63.48 127.80625 62.68 129.40625 62.68 c
cl
gsave
fill
grestore
stroke
grestore
0.000 setgray
gsave
127.40625 64.68 m
417.0375 64.68 l
418.6375 64.68 419.4375 65.48 419.4375 67.08 c
419.4375 123.78 l
419.4375 125.38 418.6375 126.18 417.0375 126.18 c
127.40625 126.18 l
125.80625 126.18 125.00625 125.38 125.00625 123.78 c
125.00625 67.08 l
125.00625 65.48 125.80625 64.68 127.40625 64.68 c
cl
gsave
1.000 setgray
fill
grestore
stroke
grestore
2.000 setlinewidth
1 setlinejoin
2 setlinecap
[] 0 setdash
0.050 0.030 0.528 setrgbcolor
gsave
133.40625 116.455 m
150.20625 116.455 l
stroke
grestore
0.000 setgray
/DejaVuSans findfont
12.000 scalefont
setfont
gsave
163.406250 112.255000 translate
0.000000 rotate
0.000000 0.000000 m /N glyphshow
8.976562 0.000000 m /o glyphshow
16.318359 0.000000 m /d glyphshow
23.935547 0.000000 m /e glyphshow
31.318359 0.000000 m /space glyphshow
35.132812 0.000000 m /one glyphshow
grestore
0.228 0.016 0.605 setrgbcolor
gsave
133.40625 103.03 m
150.20625 103.03 l
stroke
grestore
0.000 setgray
gsave
163.406250 98.830000 translate
0.000000 rotate
0.000000 0.000000 m /N glyphshow
8.976562 0.000000 m /o glyphshow
16.318359 0.000000 m /d glyphshow
23.935547 0.000000 m /e glyphshow
31.318359 0.000000 m /space glyphshow
35.132812 0.000000 m /two glyphshow
grestore
0.363 0.003 0.649 setrgbcolor
gsave
133.40625 89.605 m
150.20625 89.605 l
stroke
grestore
0.000 setgray
gsave
163.406250 85.405000 translate
0.000000 rotate
0.000000 0.000000 m /N glyphshow
8.976562 0.000000 m /o glyphshow
16.318359 0.000000 m /d glyphshow
23.935547 0.000000 m /e glyphshow
31.318359 0.000000 m /space glyphshow
35.132812 0.000000 m /three glyphshow
grestore
0.495 0.012 0.658 setrgbcolor
gsave
133.40625 76.18 m
150.20625 76.18 l
stroke
grestore
0.000 setgray
gsave
163.406250 71.980000 translate
0.000000 rotate
0.000000 0.000000 m /N glyphshow
8.976562 0.000000 m /o glyphshow
16.318359 0.000000 m /d glyphshow
23.935547 0.000000 m /e glyphshow
31.318359 0.000000 m /space glyphshow
35.132812 0.000000 m /four glyphshow
grestore
0.611 0.090 0.620 setrgbcolor
gsave
233.803125 116.455 m
250.603125 116.455 l
stroke
grestore
0.000 setgray
gsave
263.803125 112.255000 translate
0.000000 rotate
0.000000 0.000000 m /N glyphshow
8.976562 0.000000 m /o glyphshow
16.318359 0.000000 m /d glyphshow
23.935547 0.000000 m /e glyphshow
31.318359 0.000000 m /space glyphshow
35.132812 0.000000 m /five glyphshow
grestore
0.711 0.183 0.550 setrgbcolor
gsave
233.803125 103.03 m
250.603125 103.03 l
stroke
grestore
0.000 setgray
gsave
263.803125 98.830000 translate
0.000000 rotate
0.000000 0.000000 m /N glyphshow
8.976562 0.000000 m /o glyphshow
16.318359 0.000000 m /d glyphshow
23.935547 0.000000 m /e glyphshow
31.318359 0.000000 m /space glyphshow
35.132812 0.000000 m /six glyphshow
grestore
0.798 0.280 0.470 setrgbcolor
gsave
233.803125 89.605 m
250.603125 89.605 l
stroke
grestore
0.000 setgray
gsave
263.803125 85.405000 translate
0.000000 rotate
0.000000 0.000000 m /N glyphshow
8.976562 0.000000 m /o glyphshow
16.318359 0.000000 m /d glyphshow
23.935547 0.000000 m /e glyphshow
31.318359 0.000000 m /space glyphshow
35.132812 0.000000 m /seven glyphshow
grestore
3.000 setlinewidth
gsave
233.803125 76.18 m
250.603125 76.18 l
stroke
grestore
2.000 setlinewidth
1.000 0.000 0.000 setrgbcolor
gsave
233.803125 76.18 m
250.603125 76.18 l
stroke
grestore
0.000 setgray
gsave
263.803125 71.980000 translate
0.000000 rotate
0.000000 0.000000 m /N glyphshow
8.976562 0.000000 m /o glyphshow
16.318359 0.000000 m /d glyphshow
23.935547 0.000000 m /e glyphshow
31.318359 0.000000 m /space glyphshow
35.132812 0.000000 m /eight glyphshow
grestore
0.869 0.374 0.397 setrgbcolor
gsave
334.2 116.455 m
351 116.455 l
stroke
grestore
0.000 setgray
gsave
364.200000 112.255000 translate
0.000000 rotate
0.000000 0.000000 m /N glyphshow
8.976562 0.000000 m /o glyphshow
16.318359 0.000000 m /d glyphshow
23.935547 0.000000 m /e glyphshow
31.318359 0.000000 m /space glyphshow
35.132812 0.000000 m /nine glyphshow
grestore
0.928 0.473 0.326 setrgbcolor
gsave
334.2 103.03 m
351 103.03 l
stroke
grestore
0.000 setgray
gsave
364.200000 98.830000 translate
0.000000 rotate
0.000000 0.000000 m /N glyphshow
8.976562 0.000000 m /o glyphshow
16.318359 0.000000 m /d glyphshow
23.935547 0.000000 m /e glyphshow
31.318359 0.000000 m /space glyphshow
35.132812 0.000000 m /one glyphshow
42.767578 0.000000 m /zero glyphshow
grestore
0.973 0.586 0.252 setrgbcolor
gsave
334.2 89.605 m
351 89.605 l
stroke
grestore
0.000 setgray
gsave
364.200000 85.405000 translate
0.000000 rotate
0.000000 0.000000 m /N glyphshow
8.976562 0.000000 m /o glyphshow
16.318359 0.000000 m /d glyphshow
23.935547 0.000000 m /e glyphshow
31.318359 0.000000 m /space glyphshow
35.132812 0.000000 m /one glyphshow
42.767578 0.000000 m /one glyphshow
grestore
0.994 0.705 0.183 setrgbcolor
gsave
334.2 76.18 m
351 76.18 l
stroke
grestore
0.000 setgray
gsave
364.200000 71.980000 translate
0.000000 rotate
0.000000 0.000000 m /N glyphshow
8.976562 0.000000 m /o glyphshow
16.318359 0.000000 m /d glyphshow
23.935547 0.000000 m /e glyphshow
31.318359 0.000000 m /space glyphshow
35.132812 0.000000 m /one glyphshow
42.767578 0.000000 m /two glyphshow
grestore

end
showpage
