%!PS-Adobe-3.0 EPSF-3.0
%%Title: figures/nekbone-12-node-new-governor/nekbone_150_balanced_iteration_power.eps
%%Creator: matplotlib version 2.0.0, http://matplotlib.org/
%%CreationDate: Tue Mar 21 13:48:59 2017
%%Orientation: portrait
%%BoundingBox: 54 180 558 612
%%EndComments
%%BeginProlog
/mpldict 8 dict def
mpldict begin
/m { moveto } bind def
/l { lineto } bind def
/r { rlineto } bind def
/c { curveto } bind def
/cl { closepath } bind def
/box {
m
1 index 0 r
0 exch r
neg 0 r
cl
} bind def
/clipbox {
box
clip
newpath
} bind def
%!PS-Adobe-3.0 Resource-Font
%%Title: DejaVu Sans
%%Copyright: Copyright (c) 2003 by Bitstream, Inc. All Rights Reserved. Copyright (c) 2006 by Tavmjong Bah. All Rights Reserved. DejaVu changes are in public domain 
%%Creator: Converted from TrueType to type 3 by PPR
25 dict begin
/_d{bind def}bind def
/_m{moveto}_d
/_l{lineto}_d
/_cl{closepath eofill}_d
/_c{curveto}_d
/_sc{7 -1 roll{setcachedevice}{pop pop pop pop pop pop}ifelse}_d
/_e{exec}_d
/FontName /DejaVuSans def
/PaintType 0 def
/FontMatrix[.001 0 0 .001 0 0]def
/FontBBox[-1021 -463 1793 1232]def
/FontType 3 def
/Encoding [ /space /numbersign /parenleft /parenright /plus /hyphen /zero /one /two /three /four /five /six /seven /eight /nine /at /A /D /I /K /L /M /N /P /R /S /W /a /b /c /d /e /g /h /i /k /l /m /n /o /p /r /s /t /w /z ] def
/FontInfo 10 dict dup begin
/FamilyName (DejaVu Sans) def
/FullName (DejaVu Sans) def
/Notice (Copyright (c) 2003 by Bitstream, Inc. All Rights Reserved. Copyright (c) 2006 by Tavmjong Bah. All Rights Reserved. DejaVu changes are in public domain ) def
/Weight (Book) def
/Version (Version 2.35) def
/ItalicAngle 0.0 def
/isFixedPitch false def
/UnderlinePosition -130 def
/UnderlineThickness 90 def
end readonly def
/CharStrings 47 dict dup begin
/space{318 0 0 0 0 0 _sc
}_d
/numbersign{{838 0 77 0 761 718 _sc
511 440 _m
369 440 _l
328 277 _l
471 277 _l
511 440 _l
438 718 _m
387 515 _l
530 515 _l
581 718 _l
659 718 _l
609 515 _l
761 515 _l
761 440 _l
590 440 _l
550 277 _l
705 277 _l
705 202 _l
531 202 _l
480 0 _l
402 0 _l
452 202 _l
309 202 _l
259 0 _l
180 0 _l
231 202 _l
77 202 _l
77 277 _l
249 277 _l
290 440 _l
133 440 _l
}_e{133 515 _l
309 515 _l
359 718 _l
438 718 _l
_cl}_e}_d
/parenleft{390 0 86 -131 310 759 _sc
310 759 _m
266 683 234 609 213 536 _c
191 463 181 389 181 314 _c
181 238 191 164 213 91 _c
234 17 266 -56 310 -131 _c
232 -131 _l
183 -54 146 20 122 94 _c
98 168 86 241 86 314 _c
86 386 98 459 122 533 _c
146 607 182 682 232 759 _c
310 759 _l
_cl}_d
/parenright{390 0 80 -131 304 759 _sc
80 759 _m
158 759 _l
206 682 243 607 267 533 _c
291 459 304 386 304 314 _c
304 241 291 168 267 94 _c
243 20 206 -54 158 -131 _c
80 -131 _l
123 -56 155 17 177 91 _c
198 164 209 238 209 314 _c
209 389 198 463 177 536 _c
155 609 123 683 80 759 _c
_cl}_d
/plus{838 0 106 0 732 627 _sc
460 627 _m
460 355 _l
732 355 _l
732 272 _l
460 272 _l
460 0 _l
378 0 _l
378 272 _l
106 272 _l
106 355 _l
378 355 _l
378 627 _l
460 627 _l
_cl}_d
/hyphen{361 0 49 234 312 314 _sc
49 314 _m
312 314 _l
312 234 _l
49 234 _l
49 314 _l
_cl}_d
/zero{636 0 66 -13 570 742 _sc
318 664 _m
267 664 229 639 203 589 _c
177 539 165 464 165 364 _c
165 264 177 189 203 139 _c
229 89 267 64 318 64 _c
369 64 407 89 433 139 _c
458 189 471 264 471 364 _c
471 464 458 539 433 589 _c
407 639 369 664 318 664 _c
318 742 _m
399 742 461 709 505 645 _c
548 580 570 486 570 364 _c
570 241 548 147 505 83 _c
461 19 399 -13 318 -13 _c
236 -13 173 19 130 83 _c
87 147 66 241 66 364 _c
66 486 87 580 130 645 _c
173 709 236 742 318 742 _c
_cl}_d
/one{636 0 110 0 544 729 _sc
124 83 _m
285 83 _l
285 639 _l
110 604 _l
110 694 _l
284 729 _l
383 729 _l
383 83 _l
544 83 _l
544 0 _l
124 0 _l
124 83 _l
_cl}_d
/two{{636 0 73 0 536 742 _sc
192 83 _m
536 83 _l
536 0 _l
73 0 _l
73 83 _l
110 121 161 173 226 239 _c
290 304 331 346 348 365 _c
380 400 402 430 414 455 _c
426 479 433 504 433 528 _c
433 566 419 598 392 622 _c
365 646 330 659 286 659 _c
255 659 222 653 188 643 _c
154 632 117 616 78 594 _c
78 694 _l
118 710 155 722 189 730 _c
223 738 255 742 284 742 _c
}_e{359 742 419 723 464 685 _c
509 647 532 597 532 534 _c
532 504 526 475 515 449 _c
504 422 484 390 454 354 _c
446 344 420 317 376 272 _c
332 227 271 164 192 83 _c
_cl}_e}_d
/three{{636 0 76 -13 556 742 _sc
406 393 _m
453 383 490 362 516 330 _c
542 298 556 258 556 212 _c
556 140 531 84 482 45 _c
432 6 362 -13 271 -13 _c
240 -13 208 -10 176 -4 _c
144 1 110 10 76 22 _c
76 117 _l
103 101 133 89 166 81 _c
198 73 232 69 268 69 _c
330 69 377 81 409 105 _c
441 129 458 165 458 212 _c
458 254 443 288 413 312 _c
383 336 341 349 287 349 _c
}_e{202 349 _l
202 430 _l
291 430 _l
339 430 376 439 402 459 _c
428 478 441 506 441 543 _c
441 580 427 609 401 629 _c
374 649 336 659 287 659 _c
260 659 231 656 200 650 _c
169 644 135 635 98 623 _c
98 711 _l
135 721 170 729 203 734 _c
235 739 266 742 296 742 _c
370 742 429 725 473 691 _c
517 657 539 611 539 553 _c
539 513 527 479 504 451 _c
481 423 448 403 406 393 _c
_cl}_e}_d
/four{636 0 49 0 580 729 _sc
378 643 _m
129 254 _l
378 254 _l
378 643 _l
352 729 _m
476 729 _l
476 254 _l
580 254 _l
580 172 _l
476 172 _l
476 0 _l
378 0 _l
378 172 _l
49 172 _l
49 267 _l
352 729 _l
_cl}_d
/five{{636 0 77 -13 549 729 _sc
108 729 _m
495 729 _l
495 646 _l
198 646 _l
198 467 _l
212 472 227 476 241 478 _c
255 480 270 482 284 482 _c
365 482 429 459 477 415 _c
525 370 549 310 549 234 _c
549 155 524 94 475 51 _c
426 8 357 -13 269 -13 _c
238 -13 207 -10 175 -6 _c
143 -1 111 6 77 17 _c
77 116 _l
106 100 136 88 168 80 _c
199 72 232 69 267 69 _c
}_e{323 69 368 83 401 113 _c
433 143 450 183 450 234 _c
450 284 433 324 401 354 _c
368 384 323 399 267 399 _c
241 399 214 396 188 390 _c
162 384 135 375 108 363 _c
108 729 _l
_cl}_e}_d
/six{{636 0 70 -13 573 742 _sc
330 404 _m
286 404 251 388 225 358 _c
199 328 186 286 186 234 _c
186 181 199 139 225 109 _c
251 79 286 64 330 64 _c
374 64 409 79 435 109 _c
461 139 474 181 474 234 _c
474 286 461 328 435 358 _c
409 388 374 404 330 404 _c
526 713 _m
526 623 _l
501 635 476 644 451 650 _c
425 656 400 659 376 659 _c
310 659 260 637 226 593 _c
}_e{192 549 172 482 168 394 _c
187 422 211 444 240 459 _c
269 474 301 482 336 482 _c
409 482 467 459 509 415 _c
551 371 573 310 573 234 _c
573 159 550 99 506 54 _c
462 9 403 -13 330 -13 _c
246 -13 181 19 137 83 _c
92 147 70 241 70 364 _c
70 479 97 571 152 639 _c
206 707 280 742 372 742 _c
396 742 421 739 447 735 _c
472 730 498 723 526 713 _c
_cl}_e}_d
/seven{636 0 82 0 551 729 _sc
82 729 _m
551 729 _l
551 687 _l
286 0 _l
183 0 _l
432 646 _l
82 646 _l
82 729 _l
_cl}_d
/eight{{636 0 68 -13 568 742 _sc
318 346 _m
271 346 234 333 207 308 _c
180 283 167 249 167 205 _c
167 161 180 126 207 101 _c
234 76 271 64 318 64 _c
364 64 401 76 428 102 _c
455 127 469 161 469 205 _c
469 249 455 283 429 308 _c
402 333 365 346 318 346 _c
219 388 _m
177 398 144 418 120 447 _c
96 476 85 511 85 553 _c
85 611 105 657 147 691 _c
188 725 245 742 318 742 _c
}_e{390 742 447 725 489 691 _c
530 657 551 611 551 553 _c
551 511 539 476 515 447 _c
491 418 459 398 417 388 _c
464 377 501 355 528 323 _c
554 291 568 251 568 205 _c
568 134 546 80 503 43 _c
459 5 398 -13 318 -13 _c
237 -13 175 5 132 43 _c
89 80 68 134 68 205 _c
68 251 81 291 108 323 _c
134 355 171 377 219 388 _c
183 544 _m
183 506 194 476 218 455 _c
}_e{242 434 275 424 318 424 _c
360 424 393 434 417 455 _c
441 476 453 506 453 544 _c
453 582 441 611 417 632 _c
393 653 360 664 318 664 _c
275 664 242 653 218 632 _c
194 611 183 582 183 544 _c
_cl}_e}_d
/nine{{636 0 63 -13 566 742 _sc
110 15 _m
110 105 _l
134 93 159 84 185 78 _c
210 72 235 69 260 69 _c
324 69 374 90 408 134 _c
442 178 462 244 468 334 _c
448 306 424 284 396 269 _c
367 254 335 247 300 247 _c
226 247 168 269 126 313 _c
84 357 63 417 63 494 _c
63 568 85 628 129 674 _c
173 719 232 742 306 742 _c
390 742 455 709 499 645 _c
543 580 566 486 566 364 _c
}_e{566 248 538 157 484 89 _c
429 21 356 -13 264 -13 _c
239 -13 214 -10 189 -6 _c
163 -2 137 5 110 15 _c
306 324 _m
350 324 385 339 411 369 _c
437 399 450 441 450 494 _c
450 546 437 588 411 618 _c
385 648 350 664 306 664 _c
262 664 227 648 201 618 _c
175 588 162 546 162 494 _c
162 441 175 399 201 369 _c
227 339 262 324 306 324 _c
_cl}_e}_d
/at{{1000 0 66 -173 930 704 _sc
372 262 _m
372 215 383 178 406 152 _c
429 126 461 113 502 113 _c
542 113 573 126 596 153 _c
619 179 631 216 631 262 _c
631 308 619 344 596 371 _c
572 397 541 411 501 411 _c
461 411 430 397 407 371 _c
383 344 372 308 372 262 _c
638 116 _m
618 91 596 73 571 61 _c
545 49 516 43 483 43 _c
427 43 381 63 346 104 _c
311 144 294 197 294 262 _c
}_e{294 327 311 380 346 421 _c
381 461 427 482 483 482 _c
516 482 545 475 571 463 _c
596 451 618 432 638 408 _c
638 472 _l
708 472 _l
708 113 _l
755 120 792 142 819 178 _c
846 214 860 261 860 319 _c
860 353 854 386 844 417 _c
834 447 818 476 798 502 _c
764 544 722 577 674 600 _c
625 622 572 634 515 634 _c
475 634 436 628 400 618 _c
363 607 329 591 298 571 _c
}_e{246 537 206 494 178 440 _c
149 386 135 327 135 265 _c
135 213 144 165 163 120 _c
181 74 208 34 244 0 _c
278 -33 317 -58 362 -76 _c
407 -94 455 -103 507 -103 _c
549 -103 590 -96 630 -82 _c
670 -68 708 -47 742 -21 _c
786 -75 _l
745 -107 701 -131 653 -148 _c
605 -164 556 -173 507 -173 _c
447 -173 390 -162 336 -141 _c
282 -119 235 -88 194 -48 _c
152 -8 120 38 98 92 _c
}_e{76 146 66 203 66 265 _c
66 324 77 380 99 434 _c
121 488 152 535 194 576 _c
236 617 284 649 339 671 _c
394 693 452 704 514 704 _c
583 704 647 689 706 661 _c
765 633 815 593 855 541 _c
879 509 898 474 911 437 _c
923 399 930 361 930 321 _c
930 235 904 167 852 118 _c
800 68 729 43 638 41 _c
638 116 _l
_cl}_e}_d
/A{684 0 8 0 676 729 _sc
342 632 _m
208 269 _l
476 269 _l
342 632 _l
286 729 _m
398 729 _l
676 0 _l
573 0 _l
507 187 _l
178 187 _l
112 0 _l
8 0 _l
286 729 _l
_cl}_d
/D{770 0 98 0 711 729 _sc
197 648 _m
197 81 _l
316 81 _l
416 81 490 103 537 149 _c
583 195 607 267 607 365 _c
607 463 583 534 537 580 _c
490 625 416 648 316 648 _c
197 648 _l
98 729 _m
301 729 _l
442 729 546 699 612 641 _c
678 582 711 490 711 365 _c
711 239 677 147 611 88 _c
545 29 441 0 301 0 _c
98 0 _l
98 729 _l
_cl}_d
/I{295 0 98 0 197 729 _sc
98 729 _m
197 729 _l
197 0 _l
98 0 _l
98 729 _l
_cl}_d
/K{656 0 98 0 677 729 _sc
98 729 _m
197 729 _l
197 421 _l
524 729 _l
651 729 _l
289 389 _l
677 0 _l
547 0 _l
197 351 _l
197 0 _l
98 0 _l
98 729 _l
_cl}_d
/L{557 0 98 0 552 729 _sc
98 729 _m
197 729 _l
197 83 _l
552 83 _l
552 0 _l
98 0 _l
98 729 _l
_cl}_d
/M{863 0 98 0 765 729 _sc
98 729 _m
245 729 _l
431 233 _l
618 729 _l
765 729 _l
765 0 _l
669 0 _l
669 640 _l
481 140 _l
382 140 _l
194 640 _l
194 0 _l
98 0 _l
98 729 _l
_cl}_d
/N{748 0 98 0 650 729 _sc
98 729 _m
231 729 _l
554 119 _l
554 729 _l
650 729 _l
650 0 _l
517 0 _l
194 610 _l
194 0 _l
98 0 _l
98 729 _l
_cl}_d
/P{603 0 98 0 569 729 _sc
197 648 _m
197 374 _l
321 374 _l
367 374 402 385 427 409 _c
452 433 465 467 465 511 _c
465 555 452 588 427 612 _c
402 636 367 648 321 648 _c
197 648 _l
98 729 _m
321 729 _l
402 729 464 710 506 673 _c
548 636 569 582 569 511 _c
569 439 548 384 506 348 _c
464 311 402 293 321 293 _c
197 293 _l
197 0 _l
98 0 _l
98 729 _l
_cl}_d
/R{{695 0 98 0 666 729 _sc
444 342 _m
465 334 486 319 506 296 _c
526 272 546 240 566 199 _c
666 0 _l
560 0 _l
467 187 _l
443 235 419 268 397 284 _c
374 300 343 308 304 308 _c
197 308 _l
197 0 _l
98 0 _l
98 729 _l
321 729 _l
404 729 466 711 507 677 _c
548 642 569 589 569 519 _c
569 473 558 434 537 404 _c
515 374 484 353 444 342 _c
197 648 _m
197 389 _l
321 389 _l
}_e{368 389 404 400 428 422 _c
452 444 465 476 465 519 _c
465 561 452 593 428 615 _c
404 637 368 648 321 648 _c
197 648 _l
_cl}_e}_d
/S{{635 0 66 -13 579 742 _sc
535 705 _m
535 609 _l
497 627 462 640 429 649 _c
395 657 363 662 333 662 _c
279 662 237 651 208 631 _c
179 610 165 580 165 542 _c
165 510 174 485 194 469 _c
213 452 250 439 304 429 _c
364 417 _l
437 403 491 378 526 343 _c
561 307 579 260 579 201 _c
579 130 555 77 508 41 _c
460 5 391 -13 300 -13 _c
265 -13 228 -9 189 -2 _c
}_e{150 5 110 16 69 32 _c
69 134 _l
109 111 148 94 186 83 _c
224 71 262 66 300 66 _c
356 66 399 77 430 99 _c
460 121 476 152 476 194 _c
476 230 465 258 443 278 _c
421 298 385 313 335 323 _c
275 335 _l
201 349 148 372 115 404 _c
82 435 66 478 66 534 _c
66 598 88 649 134 686 _c
179 723 242 742 322 742 _c
356 742 390 739 426 733 _c
461 727 497 717 535 705 _c
}_e{_cl}_e}_d
/W{989 0 33 0 956 729 _sc
33 729 _m
133 729 _l
286 113 _l
439 729 _l
550 729 _l
703 113 _l
856 729 _l
956 729 _l
773 0 _l
649 0 _l
495 633 _l
340 0 _l
216 0 _l
33 729 _l
_cl}_d
/a{{613 0 60 -13 522 560 _sc
343 275 _m
270 275 220 266 192 250 _c
164 233 150 205 150 165 _c
150 133 160 107 181 89 _c
202 70 231 61 267 61 _c
317 61 357 78 387 114 _c
417 149 432 196 432 255 _c
432 275 _l
343 275 _l
522 312 _m
522 0 _l
432 0 _l
432 83 _l
411 49 385 25 355 10 _c
325 -5 287 -13 243 -13 _c
187 -13 142 2 109 33 _c
76 64 60 106 60 159 _c
}_e{60 220 80 266 122 298 _c
163 329 224 345 306 345 _c
432 345 _l
432 354 _l
432 395 418 427 391 450 _c
364 472 326 484 277 484 _c
245 484 215 480 185 472 _c
155 464 127 453 100 439 _c
100 522 _l
132 534 164 544 195 550 _c
226 556 256 560 286 560 _c
365 560 424 539 463 498 _c
502 457 522 395 522 312 _c
_cl}_e}_d
/b{{635 0 91 -13 580 760 _sc
487 273 _m
487 339 473 390 446 428 _c
418 466 381 485 334 485 _c
286 485 249 466 222 428 _c
194 390 181 339 181 273 _c
181 207 194 155 222 117 _c
249 79 286 61 334 61 _c
381 61 418 79 446 117 _c
473 155 487 207 487 273 _c
181 464 _m
199 496 223 520 252 536 _c
281 552 316 560 356 560 _c
422 560 476 533 518 481 _c
559 428 580 359 580 273 _c
}_e{580 187 559 117 518 65 _c
476 13 422 -13 356 -13 _c
316 -13 281 -5 252 10 _c
223 25 199 49 181 82 _c
181 0 _l
91 0 _l
91 760 _l
181 760 _l
181 464 _l
_cl}_e}_d
/c{{550 0 55 -13 488 560 _sc
488 526 _m
488 442 _l
462 456 437 466 411 473 _c
385 480 360 484 334 484 _c
276 484 230 465 198 428 _c
166 391 150 339 150 273 _c
150 206 166 154 198 117 _c
230 80 276 62 334 62 _c
360 62 385 65 411 72 _c
437 79 462 90 488 104 _c
488 21 _l
462 9 436 0 410 -5 _c
383 -10 354 -13 324 -13 _c
242 -13 176 12 128 64 _c
}_e{79 115 55 185 55 273 _c
55 362 79 432 128 483 _c
177 534 244 560 330 560 _c
358 560 385 557 411 551 _c
437 545 463 537 488 526 _c
_cl}_e}_d
/d{{635 0 55 -13 544 760 _sc
454 464 _m
454 760 _l
544 760 _l
544 0 _l
454 0 _l
454 82 _l
435 49 411 25 382 10 _c
353 -5 319 -13 279 -13 _c
213 -13 159 13 117 65 _c
75 117 55 187 55 273 _c
55 359 75 428 117 481 _c
159 533 213 560 279 560 _c
319 560 353 552 382 536 _c
411 520 435 496 454 464 _c
148 273 _m
148 207 161 155 188 117 _c
215 79 253 61 301 61 _c
}_e{348 61 385 79 413 117 _c
440 155 454 207 454 273 _c
454 339 440 390 413 428 _c
385 466 348 485 301 485 _c
253 485 215 466 188 428 _c
161 390 148 339 148 273 _c
_cl}_e}_d
/e{{615 0 55 -13 562 560 _sc
562 296 _m
562 252 _l
149 252 _l
153 190 171 142 205 110 _c
238 78 284 62 344 62 _c
378 62 412 66 444 74 _c
476 82 509 95 541 113 _c
541 28 _l
509 14 476 3 442 -3 _c
408 -9 373 -13 339 -13 _c
251 -13 182 12 131 62 _c
80 112 55 181 55 268 _c
55 357 79 428 127 481 _c
175 533 241 560 323 560 _c
397 560 455 536 498 489 _c
}_e{540 441 562 377 562 296 _c
472 322 _m
471 371 457 410 431 440 _c
404 469 368 484 324 484 _c
274 484 234 469 204 441 _c
174 413 156 373 152 322 _c
472 322 _l
_cl}_e}_d
/g{{635 0 55 -207 544 560 _sc
454 280 _m
454 344 440 395 414 431 _c
387 467 349 485 301 485 _c
253 485 215 467 188 431 _c
161 395 148 344 148 280 _c
148 215 161 165 188 129 _c
215 93 253 75 301 75 _c
349 75 387 93 414 129 _c
440 165 454 215 454 280 _c
544 68 _m
544 -24 523 -93 482 -139 _c
440 -184 377 -207 292 -207 _c
260 -207 231 -204 203 -200 _c
175 -195 147 -188 121 -178 _c
}_e{121 -91 _l
147 -105 173 -115 199 -122 _c
225 -129 251 -133 278 -133 _c
336 -133 380 -117 410 -87 _c
439 -56 454 -10 454 52 _c
454 96 _l
435 64 411 40 382 24 _c
353 8 319 0 279 0 _c
211 0 157 25 116 76 _c
75 127 55 195 55 280 _c
55 364 75 432 116 483 _c
157 534 211 560 279 560 _c
319 560 353 552 382 536 _c
411 520 435 496 454 464 _c
454 547 _l
544 547 _l
}_e{544 68 _l
_cl}_e}_d
/h{634 0 91 0 549 760 _sc
549 330 _m
549 0 _l
459 0 _l
459 327 _l
459 379 448 417 428 443 _c
408 469 378 482 338 482 _c
289 482 251 466 223 435 _c
195 404 181 362 181 309 _c
181 0 _l
91 0 _l
91 760 _l
181 760 _l
181 462 _l
202 494 227 519 257 535 _c
286 551 320 560 358 560 _c
420 560 468 540 500 501 _c
532 462 549 405 549 330 _c
_cl}_d
/i{278 0 94 0 184 760 _sc
94 547 _m
184 547 _l
184 0 _l
94 0 _l
94 547 _l
94 760 _m
184 760 _l
184 646 _l
94 646 _l
94 760 _l
_cl}_d
/k{579 0 91 0 576 760 _sc
91 760 _m
181 760 _l
181 311 _l
449 547 _l
564 547 _l
274 291 _l
576 0 _l
459 0 _l
181 267 _l
181 0 _l
91 0 _l
91 760 _l
_cl}_d
/l{278 0 94 0 184 760 _sc
94 760 _m
184 760 _l
184 0 _l
94 0 _l
94 760 _l
_cl}_d
/m{{974 0 91 0 889 560 _sc
520 442 _m
542 482 569 511 600 531 _c
631 550 668 560 711 560 _c
767 560 811 540 842 500 _c
873 460 889 403 889 330 _c
889 0 _l
799 0 _l
799 327 _l
799 379 789 418 771 444 _c
752 469 724 482 686 482 _c
639 482 602 466 575 435 _c
548 404 535 362 535 309 _c
535 0 _l
445 0 _l
445 327 _l
445 379 435 418 417 444 _c
398 469 369 482 331 482 _c
}_e{285 482 248 466 221 435 _c
194 404 181 362 181 309 _c
181 0 _l
91 0 _l
91 547 _l
181 547 _l
181 462 _l
201 495 226 520 255 536 _c
283 552 317 560 357 560 _c
397 560 430 550 458 530 _c
486 510 506 480 520 442 _c
_cl}_e}_d
/n{634 0 91 0 549 560 _sc
549 330 _m
549 0 _l
459 0 _l
459 327 _l
459 379 448 417 428 443 _c
408 469 378 482 338 482 _c
289 482 251 466 223 435 _c
195 404 181 362 181 309 _c
181 0 _l
91 0 _l
91 547 _l
181 547 _l
181 462 _l
202 494 227 519 257 535 _c
286 551 320 560 358 560 _c
420 560 468 540 500 501 _c
532 462 549 405 549 330 _c
_cl}_d
/o{612 0 55 -13 557 560 _sc
306 484 _m
258 484 220 465 192 427 _c
164 389 150 338 150 273 _c
150 207 163 156 191 118 _c
219 80 257 62 306 62 _c
354 62 392 80 420 118 _c
448 156 462 207 462 273 _c
462 337 448 389 420 427 _c
392 465 354 484 306 484 _c
306 560 _m
384 560 445 534 490 484 _c
534 433 557 363 557 273 _c
557 183 534 113 490 63 _c
445 12 384 -13 306 -13 _c
227 -13 165 12 121 63 _c
77 113 55 183 55 273 _c
55 363 77 433 121 484 _c
165 534 227 560 306 560 _c
_cl}_d
/p{{635 0 91 -207 580 560 _sc
181 82 _m
181 -207 _l
91 -207 _l
91 547 _l
181 547 _l
181 464 _l
199 496 223 520 252 536 _c
281 552 316 560 356 560 _c
422 560 476 533 518 481 _c
559 428 580 359 580 273 _c
580 187 559 117 518 65 _c
476 13 422 -13 356 -13 _c
316 -13 281 -5 252 10 _c
223 25 199 49 181 82 _c
487 273 _m
487 339 473 390 446 428 _c
418 466 381 485 334 485 _c
}_e{286 485 249 466 222 428 _c
194 390 181 339 181 273 _c
181 207 194 155 222 117 _c
249 79 286 61 334 61 _c
381 61 418 79 446 117 _c
473 155 487 207 487 273 _c
_cl}_e}_d
/r{411 0 91 0 411 560 _sc
411 463 _m
401 469 390 473 378 476 _c
366 478 353 480 339 480 _c
288 480 249 463 222 430 _c
194 397 181 350 181 288 _c
181 0 _l
91 0 _l
91 547 _l
181 547 _l
181 462 _l
199 495 224 520 254 536 _c
284 552 321 560 365 560 _c
371 560 378 559 386 559 _c
393 558 401 557 411 555 _c
411 463 _l
_cl}_d
/s{{521 0 54 -13 472 560 _sc
443 531 _m
443 446 _l
417 458 391 468 364 475 _c
336 481 308 485 279 485 _c
234 485 200 478 178 464 _c
156 450 145 430 145 403 _c
145 382 153 366 169 354 _c
185 342 217 330 265 320 _c
296 313 _l
360 299 405 279 432 255 _c
458 230 472 195 472 151 _c
472 100 452 60 412 31 _c
372 1 316 -13 246 -13 _c
216 -13 186 -10 154 -5 _c
}_e{122 0 89 8 54 20 _c
54 113 _l
87 95 120 82 152 74 _c
184 65 216 61 248 61 _c
290 61 323 68 346 82 _c
368 96 380 117 380 144 _c
380 168 371 187 355 200 _c
339 213 303 226 247 238 _c
216 245 _l
160 257 119 275 95 299 _c
70 323 58 356 58 399 _c
58 450 76 490 112 518 _c
148 546 200 560 268 560 _c
301 560 332 557 362 552 _c
391 547 418 540 443 531 _c
}_e{_cl}_e}_d
/t{392 0 27 0 368 702 _sc
183 702 _m
183 547 _l
368 547 _l
368 477 _l
183 477 _l
183 180 _l
183 135 189 106 201 94 _c
213 81 238 75 276 75 _c
368 75 _l
368 0 _l
276 0 _l
206 0 158 13 132 39 _c
106 65 93 112 93 180 _c
93 477 _l
27 477 _l
27 547 _l
93 547 _l
93 702 _l
183 702 _l
_cl}_d
/w{818 0 42 0 776 547 _sc
42 547 _m
132 547 _l
244 120 _l
356 547 _l
462 547 _l
574 120 _l
686 547 _l
776 547 _l
633 0 _l
527 0 _l
409 448 _l
291 0 _l
185 0 _l
42 547 _l
_cl}_d
/z{525 0 43 0 482 547 _sc
55 547 _m
482 547 _l
482 465 _l
144 72 _l
482 72 _l
482 0 _l
43 0 _l
43 82 _l
381 475 _l
55 475 _l
55 547 _l
_cl}_d
end readonly def

/BuildGlyph
 {exch begin
 CharStrings exch
 2 copy known not{pop /.notdef}if
 true 3 1 roll get exec
 end}_d

/BuildChar {
 1 index /Encoding get exch get
 1 index /BuildGlyph get exec
}_d

FontName currentdict end definefont pop
end
%%EndProlog
mpldict begin
54 180 translate
504 432 0 0 clipbox
gsave
0 0 m
504 0 l
504 432 l
0 432 l
cl
1.000 setgray
fill
grestore
gsave
72.9675 58.68 m
471.47625 58.68 l
471.47625 367.528 l
72.9675 367.528 l
cl
1.000 setgray
fill
grestore
1.000 setlinewidth
1 setlinejoin
2 setlinecap
[] 0 setdash
0.050 0.030 0.528 setrgbcolor
gsave
398.5 308.8 72.97 58.68 clipbox
72.9675 302.433871 m
74.98017 308.167654 l
76.992841 305.583343 l
79.005511 308.60729 l
81.018182 310.214622 l
83.030852 310.175173 l
85.043523 309.907121 l
87.056193 307.446091 l
89.068864 308.125432 l
91.081534 309.528308 l
93.094205 306.94874 l
97.119545 256.91122 l
99.132216 254.297324 l
101.144886 257.585835 l
103.157557 257.053942 l
107.182898 305.499753 l
109.195568 273.445419 l
111.208239 274.222008 l
113.220909 228.518966 l
115.23358 215.955313 l
117.24625 215.53856 l
119.25892 216.52963 l
121.271591 212.643758 l
123.284261 216.480227 l
125.296932 215.241995 l
127.309602 217.018567 l
129.322273 216.809692 l
131.334943 213.132767 l
133.347614 216.390292 l
135.360284 216.38352 l
137.372955 216.239325 l
139.385625 218.57244 l
141.398295 212.411909 l
143.410966 213.541291 l
145.423636 212.530294 l
147.436307 214.564466 l
149.448977 212.941078 l
151.461648 212.103956 l
153.474318 213.34896 l
155.486989 212.67017 l
157.499659 212.134435 l
159.51233 214.208434 l
161.525 212.59006 l
163.53767 213.395103 l
165.550341 213.577232 l
167.563011 212.064974 l
169.575682 215.946346 l
171.588352 211.776633 l
173.601023 216.007817 l
175.613693 212.254869 l
177.626364 214.064924 l
179.639034 213.538524 l
181.651705 212.487203 l
183.664375 214.298304 l
185.677045 215.734298 l
187.689716 213.309188 l
189.702386 213.912822 l
191.715057 212.584905 l
193.727727 212.84257 l
195.740398 213.477979 l
197.753068 214.586072 l
199.765739 211.985253 l
201.778409 213.260506 l
203.79108 214.829961 l
207.81642 211.911721 l
209.829091 215.037437 l
211.841761 212.296197 l
213.854432 215.524823 l
215.867102 213.394664 l
217.879773 212.360631 l
219.892443 213.080396 l
221.905114 211.549506 l
223.917784 213.517873 l
225.930455 212.794223 l
227.943125 213.672723 l
229.955795 212.316902 l
231.968466 212.608383 l
233.981136 212.725497 l
235.993807 214.111224 l
238.006477 210.434859 l
240.019148 214.543107 l
242.031818 214.519678 l
244.044489 213.732829 l
246.057159 217.154497 l
248.06983 212.491081 l
250.0825 215.709656 l
252.09517 213.722174 l
254.107841 215.684048 l
256.120511 216.097982 l
258.133182 214.541143 l
260.145852 214.666466 l
262.158523 213.094412 l
264.171193 216.602181 l
266.183864 213.346091 l
268.196534 212.508998 l
270.209205 221.555523 l
272.221875 109.774593 l
274.234545 290.469341 l
276.247216 295.658449 l
278.259886 294.349654 l
280.272557 296.777381 l
282.285227 293.214525 l
284.297898 297.114674 l
286.310568 298.1064 l
288.323239 295.841789 l
290.335909 298.051132 l
292.34858 298.055638 l
294.36125 297.08079 l
296.37392 296.700294 l
298.386591 295.824512 l
300.399261 279.706306 l
302.411932 268.301628 l
304.424602 215.447505 l
306.437273 209.440972 l
308.449943 219.523512 l
310.462614 217.10794 l
312.475284 206.245952 l
314.487955 199.138306 l
316.500625 199.614789 l
318.513295 199.382762 l
320.525966 201.882634 l
322.538636 201.667177 l
324.551307 201.072658 l
326.563977 200.295836 l
328.576648 200.138454 l
330.589318 210.276423 l
332.601989 214.868451 l
334.614659 215.120097 l
336.62733 214.782095 l
338.64 214.195636 l
340.65267 215.315339 l
342.665341 216.002396 l
344.678011 215.469773 l
346.690682 209.959829 l
348.703352 209.10192 l
350.716023 210.568519 l
352.728693 209.490999 l
356.754034 209.146546 l
358.766705 209.365622 l
360.779375 210.941722 l
362.792045 209.946439 l
364.804716 208.081359 l
366.817386 212.349204 l
368.830057 208.918387 l
370.842727 208.496125 l
372.855398 213.041469 l
374.868068 211.791338 l
376.880739 211.910825 l
380.90608 212.575119 l
382.91875 210.815783 l
384.93142 212.785468 l
386.944091 211.891486 l
388.956761 211.819872 l
390.969432 211.987167 l
392.982102 211.816206 l
394.994773 212.750128 l
397.007443 212.968387 l
399.020114 211.25953 l
401.032784 213.563834 l
405.058125 212.971379 l
407.070795 211.697358 l
409.083466 213.212443 l
411.096136 212.537058 l
413.108807 212.127412 l
415.121477 212.149241 l
417.134148 213.248471 l
419.146818 212.50382 l
421.159489 213.623178 l
423.172159 214.572636 l
425.18483 214.011045 l
427.1975 212.93169 l
429.21017 213.052065 l
431.222841 215.055632 l
433.235511 213.464467 l
435.248182 213.287872 l
437.260852 214.488343 l
439.273523 213.598627 l
441.286193 213.817531 l
443.298864 212.92273 l
445.311534 214.348223 l
447.324205 216.546832 l
449.336875 216.614053 l
451.349545 218.179349 l
453.362216 217.123732 l
455.374886 215.257605 l
457.387557 217.834439 l
461.412898 217.181001 l
463.425568 215.26703 l
467.450909 220.850969 l
469.46358 221.500972 l
471.47625 215.620012 l
471.47625 215.620012 l
stroke
grestore
0.228 0.016 0.605 setrgbcolor
gsave
398.5 308.8 72.97 58.68 clipbox
72.9675 290.960278 m
74.970057 298.698688 l
76.972613 297.770256 l
78.97517 295.919814 l
80.977726 298.71624 l
82.980283 298.6462 l
84.982839 299.402366 l
86.985396 293.44284 l
88.987952 298.372024 l
90.990509 299.659008 l
92.993065 295.004534 l
94.995622 268.424831 l
96.998178 244.736965 l
99.000735 246.212098 l
101.003291 241.924048 l
103.005848 245.178414 l
105.008405 271.150361 l
107.010961 293.802028 l
109.013518 258.708428 l
111.016074 262.395769 l
113.018631 264.862417 l
115.021187 264.343115 l
117.023744 262.442355 l
119.0263 235.462337 l
121.028857 215.226179 l
123.031413 219.26539 l
125.03397 213.998154 l
127.036526 221.133891 l
129.039083 217.179571 l
131.041639 217.929353 l
133.044196 217.532449 l
135.046753 219.581407 l
137.049309 216.853406 l
139.051866 210.992016 l
141.054422 210.590805 l
143.056979 208.88854 l
145.059535 209.417989 l
147.062092 211.661054 l
149.064648 210.461963 l
151.067205 208.439729 l
153.069761 211.571738 l
155.072318 210.809491 l
157.074874 209.178544 l
159.077431 210.881478 l
161.079987 210.192026 l
163.082544 210.743509 l
165.085101 209.688723 l
167.087657 210.73605 l
169.090214 213.524634 l
171.09277 211.521106 l
173.095327 209.994257 l
175.097883 213.296114 l
177.10044 212.262988 l
179.102996 215.478619 l
181.105553 208.971443 l
183.108109 212.415347 l
185.110666 208.344589 l
187.113222 205.737937 l
191.118335 206.723363 l
193.120892 206.917189 l
195.123448 208.724094 l
197.126005 206.606663 l
199.128562 208.616152 l
201.131118 207.058159 l
203.133675 208.031228 l
205.136231 205.446507 l
207.138788 206.448135 l
209.141344 206.756415 l
211.143901 206.242402 l
213.146457 206.434694 l
215.149014 201.684885 l
217.15157 203.751949 l
219.154127 204.942219 l
221.156683 202.845336 l
223.15924 205.932647 l
225.161796 203.948577 l
227.164353 203.963377 l
229.16691 202.438134 l
231.169466 206.856684 l
233.172023 202.890208 l
235.174579 206.739154 l
237.177136 203.538521 l
239.179692 203.706368 l
241.182249 196.728991 l
243.184805 207.119036 l
245.187362 203.161629 l
247.189918 202.629196 l
249.192475 204.626644 l
251.195031 203.466087 l
253.197588 202.600309 l
255.200144 203.540765 l
257.202701 204.033605 l
259.205258 203.917371 l
261.207814 203.329178 l
263.210371 203.755737 l
267.215484 203.002188 l
269.21804 206.468962 l
271.220597 102.338804 l
273.223153 281.641532 l
275.22571 285.293121 l
277.228266 282.483954 l
279.230823 285.254151 l
281.233379 283.089165 l
283.235936 283.511214 l
285.238492 286.306151 l
287.241049 284.511848 l
289.243606 286.576341 l
291.246162 287.859887 l
293.248719 285.431594 l
295.251275 288.647632 l
297.253832 282.851557 l
299.256388 268.075836 l
301.258945 264.141301 l
303.261501 241.540915 l
305.264058 214.002321 l
307.266614 214.322928 l
309.269171 213.858771 l
311.271727 215.048691 l
313.274284 210.38371 l
315.27684 214.644564 l
317.279397 210.511606 l
319.281954 215.180837 l
321.28451 213.023597 l
323.287067 211.550521 l
329.294736 213.228803 l
331.297293 211.326811 l
333.299849 213.374942 l
335.302406 214.478547 l
337.304962 213.360656 l
339.307519 213.883169 l
341.310075 213.989943 l
343.312632 211.674318 l
345.315188 212.38979 l
347.317745 213.327817 l
349.320302 211.375906 l
351.322858 212.359475 l
353.325415 212.30477 l
355.327971 212.434034 l
357.330528 211.307883 l
359.333084 213.344423 l
361.335641 212.262825 l
363.338197 212.612687 l
365.340754 211.559882 l
367.34331 211.763513 l
369.345867 212.751564 l
371.348423 212.8309 l
373.35098 209.682157 l
375.353536 210.356873 l
377.356093 209.700894 l
379.358649 209.552643 l
381.361206 210.731228 l
383.363763 209.646009 l
385.366319 209.349592 l
387.368876 212.347824 l
389.371432 210.137918 l
391.373989 209.537439 l
393.376545 210.437053 l
395.379102 209.276339 l
397.381658 208.919832 l
399.384215 208.24814 l
403.389328 208.361285 l
405.391884 209.251439 l
407.394441 208.881158 l
409.396997 209.279287 l
411.399554 208.160747 l
413.402111 209.755475 l
415.404667 210.301621 l
417.407224 208.777116 l
419.40978 210.541459 l
421.412337 209.905155 l
423.414893 212.359192 l
425.41745 211.296523 l
427.420006 207.366922 l
429.422563 210.983946 l
431.425119 209.820853 l
433.427676 209.058944 l
435.430232 210.106542 l
437.432789 210.215287 l
439.435345 210.631618 l
441.437902 210.471081 l
443.440459 211.00419 l
445.443015 210.70044 l
447.445572 211.992899 l
449.448128 211.225693 l
451.450685 213.743163 l
453.453241 211.758221 l
455.455798 209.978887 l
457.458354 215.491456 l
459.460911 211.545464 l
461.463467 212.150714 l
463.466024 210.706239 l
465.46858 212.128786 l
467.471137 207.85848 l
469.473693 207.110412 l
471.47625 200.373593 l
471.47625 200.373593 l
stroke
grestore
0.363 0.003 0.649 setrgbcolor
gsave
398.5 308.8 72.97 58.68 clipbox
72.9675 281.512274 m
74.970057 292.428772 l
78.97517 295.973319 l
80.977726 293.463394 l
82.980283 295.539165 l
84.982839 291.452065 l
86.985396 292.711068 l
88.987952 295.35499 l
90.990509 295.697652 l
92.993065 291.720632 l
96.998178 241.12713 l
99.000735 244.848307 l
101.003291 240.551066 l
103.005848 240.996483 l
105.008405 270.343399 l
107.010961 286.095491 l
109.013518 262.878414 l
111.016074 259.979696 l
113.018631 263.552695 l
115.021187 261.128925 l
117.023744 257.574484 l
119.0263 252.844334 l
121.028857 212.426042 l
123.031413 210.217378 l
125.03397 212.999442 l
127.036526 214.55233 l
129.039083 214.064505 l
131.041639 211.962352 l
133.044196 212.50956 l
135.046753 212.098471 l
137.049309 215.466519 l
139.051866 204.966628 l
141.054422 201.782898 l
143.056979 205.768505 l
145.059535 206.393624 l
147.062092 202.967557 l
149.064648 205.74321 l
151.067205 204.666639 l
153.069761 206.139364 l
155.072318 205.040937 l
157.074874 203.193893 l
159.077431 205.366198 l
161.079987 202.517962 l
163.082544 207.910029 l
165.085101 203.366649 l
167.087657 205.043013 l
169.090214 204.044845 l
171.09277 204.415815 l
173.095327 206.130135 l
175.097883 203.21782 l
177.10044 203.926332 l
179.102996 204.877485 l
181.105553 202.434841 l
183.108109 204.428048 l
185.110666 203.271637 l
187.113222 202.925799 l
189.115779 199.149853 l
191.118335 203.598846 l
193.120892 204.078901 l
195.123448 203.131349 l
197.126005 202.735375 l
199.128562 203.898565 l
201.131118 201.377805 l
203.133675 201.314284 l
205.136231 202.097398 l
207.138788 201.442924 l
209.141344 202.752489 l
211.143901 201.397171 l
213.146457 202.601083 l
215.149014 202.250871 l
217.15157 203.063864 l
219.154127 202.904337 l
223.15924 203.82953 l
225.161796 202.48677 l
227.164353 203.517745 l
229.16691 201.830282 l
231.169466 204.122873 l
233.172023 200.912151 l
235.174579 204.623155 l
237.177136 202.360259 l
239.179692 204.816319 l
241.182249 205.753357 l
243.184805 205.960851 l
245.187362 205.379473 l
247.189918 206.225219 l
249.192475 204.561988 l
251.195031 204.576989 l
253.197588 205.921319 l
255.200144 205.511622 l
257.202701 205.732461 l
259.205258 206.527728 l
261.207814 204.529689 l
263.210371 205.965526 l
265.212927 204.755969 l
267.215484 206.477928 l
269.21804 199.717551 l
271.220597 102.253388 l
273.223153 280.795628 l
275.22571 280.736511 l
277.228266 280.454286 l
279.230823 281.385812 l
281.233379 279.430182 l
283.235936 282.523076 l
285.238492 283.682853 l
287.241049 282.66494 l
289.243606 285.156791 l
291.246162 281.126359 l
293.248719 283.591599 l
295.251275 283.544543 l
297.253832 270.828107 l
299.256388 205.255217 l
301.258945 194.326051 l
303.261501 196.785423 l
305.264058 197.490442 l
307.266614 195.235282 l
309.269171 196.819635 l
311.271727 198.080686 l
313.274284 195.606942 l
315.27684 192.441989 l
317.279397 193.567752 l
319.281954 192.501245 l
321.28451 193.311664 l
323.287067 192.609687 l
325.289623 193.451698 l
327.29218 192.308664 l
329.294736 191.818935 l
331.297293 196.609149 l
333.299849 195.413319 l
335.302406 197.845687 l
337.304962 196.964378 l
339.307519 196.595869 l
341.310075 198.757156 l
343.312632 197.001104 l
345.315188 196.467904 l
347.317745 204.052307 l
349.320302 200.69041 l
351.322858 202.364034 l
353.325415 200.223449 l
357.330528 201.868729 l
359.333084 201.558198 l
361.335641 198.702785 l
363.338197 205.581511 l
365.340754 201.239395 l
367.34331 201.470221 l
369.345867 201.136639 l
371.348423 201.493131 l
373.35098 202.957585 l
375.353536 202.889614 l
377.356093 201.588936 l
379.358649 202.685564 l
381.361206 202.276049 l
383.363763 202.355976 l
385.366319 203.35885 l
387.368876 201.937713 l
389.371432 202.705607 l
391.373989 202.641971 l
393.376545 202.392365 l
395.379102 201.694577 l
397.381658 202.471736 l
399.384215 201.310264 l
401.386771 203.975368 l
403.389328 202.145755 l
405.391884 202.653732 l
407.394441 201.88032 l
409.396997 202.957368 l
411.399554 202.051714 l
413.402111 201.927013 l
415.404667 202.44099 l
417.407224 202.507592 l
419.40978 203.103326 l
421.412337 201.836451 l
423.414893 201.977328 l
425.41745 203.005527 l
427.420006 201.321658 l
429.422563 203.054485 l
431.425119 202.228873 l
433.427676 202.214508 l
435.430232 201.751428 l
437.432789 202.910261 l
439.435345 201.950553 l
441.437902 203.8441 l
443.440459 203.323754 l
445.443015 203.747191 l
447.445572 200.864161 l
449.448128 202.095048 l
451.450685 201.535903 l
453.453241 202.580255 l
455.455798 200.595831 l
457.458354 203.029895 l
459.460911 200.898562 l
463.466024 204.287629 l
467.471137 202.558332 l
469.473693 202.623929 l
471.47625 195.166444 l
471.47625 195.166444 l
stroke
grestore
0.495 0.012 0.658 setrgbcolor
gsave
398.5 308.8 72.97 58.68 clipbox
72.9675 300.261992 m
74.970057 306.504218 l
76.972613 311.640045 l
78.97517 311.497958 l
80.977726 307.12001 l
82.980283 311.012906 l
84.982839 309.345858 l
86.985396 307.298571 l
88.987952 314.57216 l
90.990509 314.538415 l
92.993065 311.631756 l
94.995622 283.966336 l
96.998178 261.462952 l
99.000735 259.374387 l
101.003291 261.288464 l
103.005848 257.082107 l
105.008405 285.493369 l
107.010961 305.115998 l
109.013518 278.686144 l
111.016074 220.644946 l
113.018631 214.289844 l
115.021187 216.975975 l
117.023744 216.842326 l
119.0263 216.477881 l
121.028857 217.191886 l
123.031413 216.59036 l
125.03397 217.766025 l
127.036526 217.139842 l
129.039083 216.954585 l
131.041639 215.681067 l
133.044196 219.491239 l
135.046753 216.745577 l
137.049309 218.17962 l
139.051866 221.566998 l
141.054422 218.655194 l
143.056979 222.241815 l
145.059535 218.505066 l
147.062092 221.431463 l
149.064648 219.132003 l
151.067205 218.460316 l
153.069761 222.238944 l
155.072318 220.197878 l
157.074874 218.388723 l
159.077431 221.729627 l
163.082544 216.369119 l
165.085101 215.807436 l
167.087657 216.790349 l
169.090214 214.35256 l
171.09277 214.64733 l
173.095327 220.129877 l
175.097883 216.608445 l
177.10044 217.19559 l
179.102996 215.303615 l
181.105553 215.943074 l
183.108109 218.51891 l
185.110666 217.962553 l
187.113222 217.080045 l
191.118335 217.363989 l
193.120892 216.662629 l
195.123448 217.487385 l
199.128562 217.789573 l
201.131118 217.221938 l
203.133675 217.00089 l
205.136231 216.331544 l
207.138788 218.519623 l
209.141344 218.536664 l
211.143901 216.930965 l
213.146457 216.884896 l
215.149014 234.03783 l
217.15157 229.642896 l
219.154127 229.758276 l
221.156683 228.152207 l
223.15924 231.425081 l
225.161796 228.782077 l
227.164353 228.263483 l
229.16691 229.950221 l
231.169466 230.208222 l
233.172023 229.433132 l
235.174579 230.392404 l
237.177136 227.626742 l
239.179692 226.582148 l
241.182249 224.255994 l
243.184805 225.454348 l
245.187362 225.37573 l
247.189918 223.116093 l
249.192475 225.215598 l
251.195031 223.621816 l
253.197588 224.259845 l
255.200144 226.209449 l
257.202701 224.745781 l
259.205258 225.503721 l
261.207814 223.614782 l
263.210371 223.56647 l
267.215484 223.059024 l
269.21804 223.325736 l
271.220597 113.729696 l
273.223153 297.487347 l
275.22571 299.429071 l
277.228266 297.148477 l
279.230823 300.537582 l
281.233379 297.170256 l
283.235936 300.353007 l
285.238492 299.86036 l
287.241049 302.361657 l
289.243606 300.591806 l
291.246162 301.094369 l
293.248719 300.649541 l
295.251275 303.457355 l
297.253832 298.096214 l
299.256388 284.71117 l
301.258945 278.996021 l
303.261501 220.934078 l
305.264058 218.977974 l
307.266614 221.004517 l
309.269171 219.818139 l
311.271727 220.406152 l
313.274284 220.129714 l
315.27684 226.532557 l
317.279397 227.639226 l
319.281954 232.552268 l
321.28451 228.356754 l
323.287067 230.716511 l
325.289623 229.994539 l
327.29218 229.922171 l
329.294736 229.013298 l
331.297293 230.533109 l
333.299849 228.117059 l
335.302406 230.759526 l
337.304962 230.148548 l
339.307519 228.77859 l
341.310075 232.310453 l
343.312632 230.050573 l
345.315188 226.55265 l
347.317745 225.027702 l
349.320302 222.873919 l
351.322858 225.555905 l
353.325415 224.156915 l
355.327971 222.615975 l
357.330528 225.218887 l
359.333084 224.647066 l
361.335641 222.623654 l
363.338197 224.687494 l
365.340754 224.464505 l
367.34331 223.425873 l
369.345867 223.54658 l
371.348423 223.002269 l
373.35098 220.565181 l
375.353536 219.91026 l
377.356093 218.401351 l
379.358649 220.763807 l
381.361206 220.2499 l
383.363763 218.608071 l
385.366319 219.229878 l
387.368876 220.345881 l
389.371432 219.440864 l
391.373989 220.180607 l
393.376545 219.890932 l
395.379102 217.172959 l
397.381658 216.978941 l
399.384215 217.028143 l
401.386771 217.374133 l
403.389328 218.162134 l
405.391884 218.062425 l
407.394441 216.70771 l
409.396997 218.406337 l
411.399554 216.682265 l
413.402111 216.346682 l
415.404667 217.850066 l
417.407224 217.557034 l
419.40978 218.260899 l
421.412337 217.194856 l
423.414893 217.707396 l
425.41745 217.917445 l
427.420006 219.526397 l
429.422563 218.481189 l
431.425119 216.653504 l
433.427676 218.348416 l
435.430232 216.60738 l
437.432789 218.724715 l
439.435345 218.36229 l
441.437902 216.737663 l
443.440459 218.941415 l
445.443015 218.042546 l
447.445572 218.713804 l
449.448128 217.615812 l
451.450685 218.307124 l
453.453241 217.017047 l
455.455798 218.038203 l
457.458354 217.622544 l
459.460911 217.884863 l
461.463467 218.761961 l
463.466024 218.806387 l
465.46858 219.263013 l
467.471137 218.533791 l
469.473693 216.811229 l
471.47625 214.253157 l
471.47625 214.253157 l
stroke
grestore
0.611 0.090 0.620 setrgbcolor
gsave
398.5 308.8 72.97 58.68 clipbox
72.9675 297.848396 m
74.970057 304.952111 l
76.972613 309.691573 l
78.97517 304.461209 l
80.977726 308.648741 l
82.980283 306.803825 l
84.982839 308.412718 l
86.985396 305.682847 l
88.987952 310.114151 l
90.990509 304.916363 l
92.993065 305.870987 l
96.998178 254.591652 l
99.000735 254.055724 l
101.003291 258.380023 l
103.005848 254.720317 l
105.008405 281.60984 l
107.010961 299.994161 l
109.013518 274.926878 l
111.016074 273.239292 l
113.018631 242.89074 l
115.021187 216.746052 l
117.023744 214.705224 l
119.0263 217.36699 l
121.028857 217.670492 l
123.031413 215.502989 l
127.036526 216.299215 l
129.039083 215.497035 l
131.041639 215.408026 l
133.044196 217.868106 l
135.046753 216.462519 l
137.049309 213.39694 l
139.051866 214.819243 l
141.054422 208.453496 l
143.056979 216.140868 l
145.059535 211.628907 l
147.062092 211.199052 l
149.064648 213.990654 l
151.067205 210.706837 l
153.069761 211.920171 l
155.072318 215.136425 l
157.074874 210.517162 l
159.077431 214.172961 l
161.079987 212.061585 l
163.082544 219.7453 l
165.085101 218.127062 l
167.087657 219.554659 l
169.090214 217.235077 l
171.09277 215.559335 l
173.095327 220.710411 l
175.097883 217.718911 l
177.10044 218.863243 l
179.102996 217.043956 l
181.105553 219.982132 l
183.108109 217.292712 l
185.110666 224.116133 l
187.113222 222.098914 l
189.115779 224.347611 l
191.118335 224.753164 l
193.120892 224.173356 l
195.123448 224.524673 l
197.126005 223.855648 l
199.128562 225.155393 l
203.133675 225.949744 l
205.136231 224.681656 l
207.138788 222.580208 l
209.141344 227.35439 l
211.143901 224.111291 l
213.146457 217.202705 l
215.149014 212.744805 l
217.15157 214.749279 l
219.154127 214.699199 l
221.156683 214.219388 l
223.15924 216.656262 l
225.161796 216.051672 l
227.164353 214.863635 l
229.16691 216.816031 l
231.169466 215.324554 l
233.172023 215.504641 l
235.174579 216.619114 l
237.177136 213.859677 l
239.179692 214.81836 l
241.182249 214.425743 l
243.184805 213.668271 l
245.187362 213.223447 l
247.189918 213.976566 l
249.192475 216.963475 l
251.195031 212.725422 l
253.197588 214.553849 l
255.200144 215.435039 l
257.202701 213.149713 l
259.205258 214.163515 l
261.207814 213.824754 l
263.210371 215.005208 l
265.212927 210.259881 l
267.215484 215.71916 l
269.21804 219.579577 l
271.220597 111.499109 l
273.223153 289.105542 l
275.22571 293.639276 l
277.228266 291.414544 l
279.230823 290.300991 l
281.233379 292.719937 l
283.235936 294.915171 l
285.238492 295.091616 l
287.241049 293.406132 l
289.243606 296.325469 l
291.246162 296.072837 l
293.248719 293.796388 l
295.251275 295.111978 l
297.253832 289.98982 l
299.256388 278.32994 l
301.258945 273.012846 l
303.261501 274.542945 l
305.264058 239.438193 l
307.266614 221.262221 l
309.269171 219.924732 l
311.271727 224.225531 l
313.274284 218.645314 l
315.27684 217.228126 l
317.279397 221.47885 l
319.281954 218.342535 l
321.28451 219.881332 l
323.287067 219.632976 l
325.289623 219.758721 l
327.29218 218.425211 l
329.294736 218.060845 l
331.297293 214.999673 l
333.299849 217.078545 l
335.302406 216.24522 l
337.304962 215.647385 l
339.307519 214.890652 l
341.310075 216.356307 l
343.312632 214.982543 l
345.315188 216.521797 l
347.317745 210.892187 l
349.320302 211.980863 l
351.322858 212.348592 l
353.325415 210.819273 l
355.327971 211.413644 l
357.330528 210.670594 l
359.333084 213.437617 l
361.335641 211.928954 l
363.338197 211.393018 l
365.340754 210.595645 l
367.34331 210.581193 l
369.345867 209.794988 l
371.348423 210.949916 l
373.35098 217.111187 l
375.353536 218.617267 l
377.356093 217.671011 l
379.358649 219.171118 l
381.361206 219.364921 l
383.363763 218.633175 l
385.366319 219.74918 l
387.368876 218.645595 l
389.371432 219.766632 l
393.376545 219.707589 l
397.381658 218.40229 l
399.384215 218.263278 l
401.386771 218.394039 l
403.389328 219.224364 l
405.391884 219.194792 l
407.394441 217.224363 l
409.396997 217.462069 l
411.399554 216.919766 l
415.404667 217.660355 l
417.407224 216.677525 l
419.40978 217.541561 l
421.412337 216.639978 l
423.414893 217.998866 l
425.41745 219.843503 l
427.420006 215.302334 l
429.422563 221.890767 l
431.425119 218.300167 l
433.427676 217.821412 l
435.430232 217.623691 l
437.432789 219.072719 l
441.437902 218.164649 l
445.443015 217.826847 l
447.445572 214.565391 l
449.448128 215.148182 l
451.450685 214.896704 l
455.455798 213.072906 l
457.458354 213.839762 l
459.460911 210.874821 l
461.463467 217.292187 l
463.466024 213.733226 l
465.46858 213.106463 l
467.471137 215.192661 l
469.473693 214.90447 l
471.47625 208.831912 l
471.47625 208.831912 l
stroke
grestore
0.711 0.183 0.550 setrgbcolor
gsave
398.5 308.8 72.97 58.68 clipbox
72.9675 295.691272 m
74.970057 304.944332 l
76.972613 304.673861 l
78.97517 302.78972 l
80.977726 304.239912 l
82.980283 303.94334 l
84.982839 305.485719 l
86.985396 303.962784 l
88.987952 304.345496 l
90.990509 307.865403 l
92.993065 304.263875 l
94.995622 278.147522 l
96.998178 254.090276 l
99.000735 253.105905 l
101.003291 257.314716 l
103.005848 254.368131 l
107.010961 302.085299 l
109.013518 270.452573 l
111.016074 270.042025 l
113.018631 224.135043 l
115.021187 207.811142 l
117.023744 214.077741 l
119.0263 211.571497 l
121.028857 212.088899 l
123.031413 214.213285 l
125.03397 213.855754 l
127.036526 212.531014 l
129.039083 212.662369 l
131.041639 211.436651 l
133.044196 217.460842 l
135.046753 212.928339 l
137.049309 216.001664 l
139.051866 207.842602 l
141.054422 207.754567 l
143.056979 209.550688 l
145.059535 209.010243 l
147.062092 208.934852 l
149.064648 207.394384 l
151.067205 209.484183 l
153.069761 207.939056 l
155.072318 207.594884 l
157.074874 208.306629 l
159.077431 206.418219 l
161.079987 205.304483 l
163.082544 212.456831 l
165.085101 212.562699 l
167.087657 212.309431 l
169.090214 214.389332 l
171.09277 212.5308 l
173.095327 214.343843 l
175.097883 211.916408 l
177.10044 216.172137 l
179.102996 213.900208 l
181.105553 211.863179 l
183.108109 214.678747 l
185.110666 210.957716 l
187.113222 209.290033 l
189.115779 208.780376 l
193.120892 209.355405 l
195.123448 210.086254 l
197.126005 209.339374 l
199.128562 210.162449 l
201.131118 210.229143 l
203.133675 210.520429 l
205.136231 207.444585 l
207.138788 211.636582 l
209.141344 211.461143 l
211.143901 209.728551 l
213.146457 214.621404 l
215.149014 217.076599 l
217.15157 216.7232 l
219.154127 216.951771 l
221.156683 216.878763 l
223.15924 216.531997 l
225.161796 215.613635 l
227.164353 218.912416 l
229.16691 217.136888 l
231.169466 217.348943 l
233.172023 215.482052 l
235.174579 219.322513 l
237.177136 217.593129 l
239.179692 210.633949 l
241.182249 213.441107 l
243.184805 211.642892 l
245.187362 210.02151 l
247.189918 210.8765 l
249.192475 211.325154 l
251.195031 211.01137 l
253.197588 210.156862 l
255.200144 212.29289 l
257.202701 208.080203 l
259.205258 214.005607 l
261.207814 212.261615 l
263.210371 211.916802 l
265.212927 212.452008 l
267.215484 212.678181 l
269.21804 209.849479 l
271.220597 111.644822 l
273.223153 290.182954 l
275.22571 292.20762 l
277.228266 290.099528 l
279.230823 292.602107 l
281.233379 290.460429 l
283.235936 291.508556 l
285.238492 293.911967 l
287.241049 292.455569 l
289.243606 296.37308 l
291.246162 291.217973 l
293.248719 295.69999 l
295.251275 295.370369 l
297.253832 290.894879 l
299.256388 215.542154 l
301.258945 203.817169 l
303.261501 206.499109 l
305.264058 204.742141 l
307.266614 206.033194 l
309.269171 206.264626 l
311.271727 209.820828 l
313.274284 205.730735 l
315.27684 205.631017 l
317.279397 206.637741 l
319.281954 205.766056 l
321.28451 205.416512 l
323.287067 206.430375 l
325.289623 206.280088 l
327.29218 205.178769 l
329.294736 205.100295 l
331.297293 206.468148 l
333.299849 204.264809 l
335.302406 204.485714 l
337.304962 203.241485 l
339.307519 203.702913 l
341.310075 206.772419 l
343.312632 206.13746 l
345.315188 206.770601 l
347.317745 210.010149 l
349.320302 209.782836 l
351.322858 209.067365 l
353.325415 209.881713 l
355.327971 211.342652 l
357.330528 210.550585 l
359.333084 211.952984 l
361.335641 210.447322 l
363.338197 209.514509 l
367.34331 209.58822 l
369.345867 209.636439 l
371.348423 209.011792 l
373.35098 212.253555 l
375.353536 212.808148 l
377.356093 211.617545 l
379.358649 212.183634 l
381.361206 211.627435 l
383.363763 212.290027 l
385.366319 212.728319 l
387.368876 211.545433 l
393.376545 212.263971 l
395.379102 213.070626 l
397.381658 212.329482 l
399.384215 211.299984 l
401.386771 211.512775 l
403.389328 213.329659 l
405.391884 212.202625 l
407.394441 212.09775 l
409.396997 212.90882 l
413.402111 212.160361 l
415.404667 212.467548 l
417.407224 213.009573 l
419.40978 212.439634 l
421.412337 213.129122 l
423.414893 212.845587 l
425.41745 215.257672 l
427.420006 213.46498 l
429.422563 214.056084 l
431.425119 213.367481 l
433.427676 213.447214 l
435.430232 212.455187 l
437.432789 214.179756 l
441.437902 213.149204 l
443.440459 213.125437 l
445.443015 212.287083 l
447.445572 212.009603 l
449.448128 209.755442 l
451.450685 209.367317 l
453.453241 215.011324 l
455.455798 210.984986 l
461.463467 212.406428 l
463.466024 210.153048 l
465.46858 211.974477 l
469.473693 210.266252 l
471.47625 202.930911 l
471.47625 202.930911 l
stroke
grestore
0.798 0.280 0.470 setrgbcolor
gsave
398.5 308.8 72.97 58.68 clipbox
72.9675 299.124867 m
74.970057 306.229663 l
76.972613 304.483787 l
78.97517 308.991029 l
80.977726 308.336019 l
82.980283 305.882412 l
84.982839 311.014935 l
86.985396 305.607992 l
88.987952 309.390999 l
90.990509 306.315002 l
92.993065 308.2491 l
94.995622 279.027755 l
96.998178 256.148769 l
99.000735 255.240641 l
101.003291 258.40817 l
103.005848 255.694338 l
105.008405 281.754756 l
107.010961 304.031207 l
109.013518 271.18782 l
111.016074 261.773357 l
113.018631 213.210594 l
115.021187 213.788503 l
117.023744 212.113944 l
119.0263 212.60793 l
121.028857 214.784827 l
123.031413 212.916861 l
125.03397 214.753219 l
127.036526 212.141854 l
129.039083 214.578426 l
131.041639 211.932139 l
135.046753 214.560825 l
137.049309 214.46564 l
139.051866 212.26059 l
141.054422 209.310752 l
143.056979 214.769442 l
145.059535 210.440166 l
147.062092 214.579035 l
149.064648 210.807041 l
151.067205 214.466237 l
153.069761 210.894564 l
155.072318 212.009873 l
157.074874 210.639774 l
159.077431 212.375205 l
161.079987 214.338595 l
163.082544 208.93802 l
165.085101 206.470747 l
167.087657 206.837357 l
169.090214 210.927196 l
171.09277 208.645092 l
173.095327 211.584811 l
175.097883 208.891072 l
177.10044 208.628701 l
179.102996 208.898705 l
181.105553 210.349205 l
183.108109 210.138318 l
185.110666 209.296593 l
187.113222 207.715476 l
191.118335 208.122776 l
193.120892 206.812629 l
195.123448 209.033168 l
197.126005 208.519879 l
199.128562 207.74904 l
201.131118 208.026564 l
203.133675 208.436551 l
207.138788 207.717334 l
209.141344 208.562623 l
211.143901 208.567196 l
213.146457 212.656886 l
215.149014 214.352417 l
217.15157 214.946833 l
219.154127 215.393426 l
221.156683 215.437656 l
223.15924 213.260782 l
225.161796 214.549965 l
227.164353 216.071281 l
229.16691 213.670253 l
231.169466 215.048182 l
233.172023 215.817906 l
235.174579 214.78148 l
237.177136 213.266182 l
239.179692 211.943956 l
241.182249 208.811895 l
243.184805 208.505556 l
245.187362 206.020188 l
247.189918 207.677045 l
249.192475 209.573726 l
251.195031 208.664707 l
253.197588 207.990607 l
255.200144 209.634978 l
257.202701 207.765546 l
259.205258 208.07952 l
261.207814 207.612538 l
263.210371 206.730102 l
265.212927 206.834504 l
267.215484 208.097323 l
269.21804 208.059462 l
271.220597 110.88358 l
273.223153 291.882549 l
275.22571 293.92006 l
277.228266 291.874622 l
279.230823 296.188589 l
281.233379 293.164666 l
283.235936 296.260903 l
285.238492 297.244339 l
287.241049 295.210452 l
289.243606 296.385952 l
291.246162 297.413615 l
295.251275 295.802682 l
297.253832 294.610509 l
301.258945 258.641735 l
303.261501 217.956322 l
305.264058 221.014775 l
307.266614 218.625641 l
309.269171 217.76528 l
311.271727 220.901434 l
313.274284 223.329278 l
315.27684 238.160952 l
317.279397 239.859641 l
319.281954 237.266738 l
321.28451 239.680006 l
323.287067 238.506707 l
325.289623 237.593333 l
327.29218 239.331917 l
329.294736 237.877752 l
331.297293 232.729713 l
333.299849 233.211045 l
335.302406 234.112815 l
341.310075 233.209734 l
343.312632 233.906633 l
345.315188 233.388481 l
347.317745 227.909647 l
349.320302 227.014546 l
351.322858 228.840057 l
353.325415 227.24157 l
355.327971 228.686382 l
357.330528 227.300654 l
359.333084 229.07618 l
361.335641 227.902873 l
363.338197 227.656455 l
365.340754 228.779236 l
367.34331 227.673509 l
369.345867 228.963485 l
371.348423 226.389528 l
373.35098 226.770157 l
375.353536 222.737633 l
377.356093 223.385094 l
379.358649 221.672144 l
381.361206 222.881586 l
383.363763 222.016838 l
385.366319 222.663508 l
387.368876 222.755582 l
389.371432 222.068034 l
391.373989 222.427861 l
393.376545 222.158127 l
395.379102 220.439905 l
397.381658 214.629155 l
399.384215 216.582141 l
401.386771 215.675584 l
403.389328 216.751619 l
405.391884 215.910524 l
407.394441 215.785464 l
409.396997 216.743655 l
411.399554 215.060605 l
413.402111 216.820811 l
415.404667 215.651679 l
417.407224 215.34825 l
419.40978 213.839942 l
421.412337 212.82408 l
423.414893 213.727389 l
425.41745 212.544943 l
427.420006 213.949806 l
429.422563 212.044578 l
431.425119 215.101876 l
433.427676 214.383187 l
435.430232 212.728526 l
437.432789 216.111019 l
439.435345 213.891541 l
441.437902 215.168655 l
443.440459 213.953096 l
445.443015 213.941702 l
447.445572 211.555982 l
449.448128 211.523918 l
451.450685 212.21063 l
453.453241 210.043269 l
455.455798 210.458704 l
457.458354 211.012406 l
459.460911 211.126295 l
461.463467 211.098772 l
463.466024 209.869423 l
465.46858 209.675149 l
467.471137 215.18119 l
469.473693 213.173039 l
471.47625 206.302778 l
471.47625 206.302778 l
stroke
grestore
0.869 0.374 0.397 setrgbcolor
gsave
398.5 308.8 72.97 58.68 clipbox
72.9675 297.392107 m
74.970057 308.529018 l
76.972613 312.586896 l
78.97517 311.257021 l
80.977726 305.518235 l
82.980283 310.786011 l
84.982839 311.897633 l
86.985396 309.103513 l
88.987952 310.676833 l
90.990509 307.909395 l
92.993065 308.594341 l
94.995622 281.735806 l
96.998178 260.017208 l
99.000735 261.707378 l
101.003291 256.922021 l
103.005848 260.559693 l
107.010961 306.770582 l
109.013518 211.622014 l
111.016074 207.788413 l
113.018631 207.532492 l
115.021187 207.759442 l
117.023744 207.419166 l
119.0263 210.790562 l
121.028857 208.883057 l
123.031413 209.734148 l
125.03397 209.432818 l
127.036526 209.447466 l
129.039083 206.607749 l
131.041639 209.461113 l
133.044196 210.328634 l
135.046753 211.460627 l
137.049309 212.308147 l
139.051866 210.948369 l
141.054422 204.768945 l
143.056979 200.759814 l
147.062092 201.123219 l
149.064648 201.962032 l
151.067205 201.228872 l
155.072318 201.009456 l
157.074874 198.875374 l
159.077431 198.847023 l
161.079987 201.402241 l
163.082544 216.796232 l
165.085101 226.628714 l
167.087657 225.197537 l
169.090214 225.227181 l
171.09277 226.109681 l
173.095327 227.169217 l
175.097883 223.302309 l
177.10044 223.300241 l
179.102996 223.796916 l
181.105553 226.671393 l
183.108109 223.135279 l
185.110666 224.128345 l
187.113222 218.740335 l
189.115779 217.477092 l
191.118335 216.837228 l
193.120892 218.83093 l
195.123448 218.067647 l
197.126005 219.352033 l
199.128562 216.808926 l
201.131118 218.232215 l
203.133675 216.917065 l
205.136231 218.462329 l
207.138788 216.937288 l
209.141344 217.613912 l
211.143901 216.329049 l
213.146457 218.371698 l
215.149014 219.339979 l
217.15157 221.243435 l
221.156683 219.656065 l
223.15924 221.085422 l
225.161796 221.239048 l
227.164353 220.119054 l
229.16691 219.984283 l
231.169466 220.658517 l
233.172023 221.626526 l
235.174579 222.734689 l
237.177136 220.435634 l
239.179692 218.644321 l
241.182249 217.894973 l
243.184805 214.899284 l
245.187362 214.49929 l
247.189918 216.225882 l
249.192475 215.876974 l
251.195031 215.21755 l
253.197588 215.167729 l
255.200144 216.494915 l
257.202701 214.560673 l
259.205258 217.313349 l
261.207814 216.040209 l
263.210371 216.360641 l
265.212927 216.957407 l
267.215484 217.916813 l
269.21804 216.944711 l
271.220597 117.10386 l
273.223153 293.852643 l
275.22571 297.569455 l
277.228266 298.115777 l
279.230823 297.680007 l
281.233379 298.195056 l
283.235936 297.191513 l
285.238492 300.014951 l
287.241049 298.770194 l
289.243606 300.308431 l
291.246162 300.53293 l
293.248719 299.863081 l
295.251275 300.508276 l
297.253832 296.287834 l
299.256388 281.778267 l
301.258945 281.362222 l
303.261501 239.23074 l
305.264058 217.652315 l
307.266614 220.257688 l
309.269171 218.102146 l
311.271727 221.851625 l
313.274284 214.611377 l
315.27684 219.502442 l
317.279397 212.525291 l
319.281954 211.570457 l
321.28451 212.907213 l
325.289623 212.243359 l
327.29218 212.261295 l
329.294736 212.495165 l
331.297293 211.085505 l
333.299849 209.140141 l
335.302406 209.237497 l
337.304962 208.020144 l
339.307519 207.941416 l
341.310075 209.639912 l
343.312632 209.922746 l
345.315188 212.793566 l
347.317745 212.903101 l
351.322858 213.497888 l
355.327971 211.976192 l
357.330528 212.504013 l
359.333084 213.640611 l
361.335641 211.473756 l
363.338197 211.941776 l
365.340754 210.867628 l
367.34331 211.410173 l
369.345867 210.896865 l
371.348423 210.750401 l
373.35098 217.897862 l
375.353536 217.717234 l
379.358649 219.076474 l
381.361206 218.971697 l
383.363763 217.632447 l
385.366319 218.904507 l
387.368876 218.990056 l
389.371432 217.047241 l
391.373989 216.875072 l
395.379102 218.798132 l
397.381658 218.007599 l
399.384215 219.783095 l
401.386771 220.720104 l
403.389328 219.380967 l
405.391884 219.798541 l
407.394441 219.60833 l
409.396997 220.29383 l
411.399554 218.475342 l
413.402111 220.207073 l
415.404667 219.792668 l
417.407224 218.856667 l
419.40978 219.465488 l
421.412337 217.637894 l
423.414893 219.131641 l
425.41745 218.557662 l
427.420006 216.970849 l
429.422563 219.412659 l
431.425119 218.904047 l
433.427676 217.898086 l
435.430232 218.286189 l
437.432789 218.834437 l
439.435345 218.348956 l
441.437902 218.356515 l
443.440459 218.623163 l
445.443015 218.162486 l
447.445572 218.447771 l
449.448128 219.932328 l
451.450685 220.481845 l
453.453241 218.715988 l
455.455798 218.523649 l
457.458354 222.769941 l
459.460911 221.123878 l
461.463467 220.101713 l
463.466024 220.217783 l
465.46858 221.99005 l
467.471137 220.452208 l
469.473693 219.896408 l
471.47625 213.697868 l
471.47625 213.697868 l
stroke
grestore
0.928 0.473 0.326 setrgbcolor
gsave
398.5 308.8 72.97 58.68 clipbox
72.9675 292.484476 m
74.970057 299.377154 l
76.972613 298.386351 l
78.97517 305.36112 l
80.977726 305.260441 l
82.980283 304.589556 l
84.982839 306.851156 l
86.985396 301.690526 l
90.990509 304.743746 l
92.993065 305.851466 l
94.995622 280.040805 l
96.998178 257.373641 l
99.000735 257.503039 l
101.003291 255.488857 l
103.005848 257.319441 l
105.008405 281.215469 l
107.010961 301.118746 l
109.013518 271.823013 l
111.016074 234.627517 l
113.018631 212.362786 l
115.021187 211.47056 l
117.023744 211.024557 l
119.0263 209.948641 l
121.028857 210.669071 l
123.031413 210.119817 l
125.03397 211.260181 l
127.036526 210.721105 l
129.039083 211.3001 l
131.041639 211.252488 l
133.044196 209.55946 l
135.046753 212.402942 l
137.049309 210.81086 l
139.051866 217.952089 l
141.054422 228.755746 l
143.056979 229.125701 l
145.059535 231.187823 l
147.062092 225.60505 l
149.064648 231.008918 l
151.067205 230.620366 l
153.069761 229.149286 l
155.072318 231.166137 l
157.074874 228.479768 l
159.077431 229.64575 l
161.079987 231.461077 l
163.082544 221.01084 l
165.085101 216.844387 l
167.087657 219.150996 l
169.090214 216.368565 l
171.09277 218.003343 l
173.095327 220.588683 l
175.097883 218.316716 l
177.10044 218.650728 l
179.102996 217.716179 l
181.105553 221.252004 l
183.108109 219.161628 l
185.110666 219.026539 l
187.113222 217.704667 l
189.115779 215.582897 l
191.118335 218.453744 l
193.120892 216.637387 l
195.123448 217.556919 l
197.126005 217.512497 l
199.128562 216.913736 l
201.131118 217.079513 l
203.133675 217.714576 l
205.136231 216.608026 l
207.138788 217.814128 l
211.143901 216.766832 l
213.146457 217.925396 l
215.149014 218.650036 l
217.15157 221.29619 l
219.154127 220.907981 l
221.156683 220.343889 l
223.15924 220.802856 l
225.161796 218.600363 l
227.164353 221.892199 l
229.16691 219.939228 l
231.169466 222.127286 l
233.172023 219.127945 l
235.174579 221.376151 l
237.177136 219.083286 l
239.179692 219.313717 l
241.182249 216.331402 l
243.184805 215.176226 l
245.187362 215.968013 l
247.189918 214.843509 l
249.192475 215.897947 l
251.195031 215.344382 l
253.197588 214.922042 l
255.200144 216.946766 l
257.202701 215.15005 l
259.205258 216.201954 l
261.207814 214.65448 l
263.210371 216.653462 l
265.212927 215.31127 l
267.215484 216.64145 l
269.21804 214.719239 l
271.220597 119.986737 l
273.223153 286.110449 l
275.22571 291.698297 l
277.228266 294.601152 l
279.230823 292.620269 l
281.233379 291.550641 l
285.238492 295.124805 l
287.241049 295.354177 l
289.243606 290.25567 l
291.246162 298.831532 l
293.248719 293.695733 l
295.251275 295.375224 l
297.253832 290.860766 l
299.256388 277.850042 l
301.258945 274.128744 l
305.264058 216.738314 l
307.266614 218.77296 l
309.269171 218.763354 l
311.271727 218.446726 l
313.274284 216.412073 l
315.27684 210.020773 l
317.279397 211.819705 l
319.281954 210.105018 l
321.28451 210.494569 l
323.287067 212.052418 l
325.289623 210.511602 l
327.29218 212.445899 l
329.294736 211.347001 l
331.297293 212.424368 l
333.299849 213.240388 l
335.302406 213.636404 l
337.304962 212.366606 l
339.307519 212.245974 l
341.310075 213.318503 l
343.312632 211.75111 l
345.315188 212.33925 l
347.317745 213.323461 l
349.320302 214.178406 l
351.322858 216.836572 l
353.325415 214.044467 l
355.327971 216.133702 l
357.330528 215.601491 l
359.333084 215.444472 l
361.335641 217.169889 l
363.338197 214.09071 l
365.340754 216.294545 l
367.34331 217.26008 l
369.345867 215.095602 l
371.348423 215.418818 l
373.35098 216.440702 l
375.353536 214.755752 l
377.356093 215.197347 l
379.358649 214.554928 l
381.361206 214.071306 l
383.363763 215.321773 l
385.366319 216.191744 l
387.368876 213.904523 l
389.371432 214.280769 l
391.373989 216.174599 l
393.376545 215.592005 l
395.379102 216.087885 l
397.381658 216.989799 l
399.384215 219.016715 l
401.386771 218.307035 l
403.389328 218.638978 l
405.391884 219.209591 l
407.394441 217.652942 l
409.396997 218.740816 l
411.399554 219.14077 l
413.402111 218.513993 l
415.404667 218.449332 l
417.407224 217.454177 l
419.40978 218.47034 l
421.412337 216.727002 l
423.414893 216.400031 l
425.41745 217.233366 l
427.420006 214.297772 l
429.422563 218.24427 l
431.425119 216.581863 l
433.427676 218.210043 l
435.430232 217.426743 l
437.432789 219.209594 l
439.435345 217.424362 l
441.437902 217.635815 l
443.440459 217.615424 l
445.443015 217.777574 l
447.445572 216.829273 l
449.448128 215.50653 l
451.450685 216.043601 l
453.453241 215.850217 l
455.455798 215.957219 l
457.458354 216.571481 l
461.463467 215.285124 l
463.466024 216.148029 l
465.46858 215.350129 l
467.471137 214.841542 l
469.473693 215.881049 l
471.47625 212.79802 l
471.47625 212.79802 l
stroke
grestore
0.973 0.586 0.252 setrgbcolor
gsave
398.5 308.8 72.97 58.68 clipbox
72.9675 296.741912 m
74.970057 304.811949 l
76.972613 301.477172 l
78.97517 306.335605 l
80.977726 308.290771 l
82.980283 306.509522 l
84.982839 303.425358 l
86.985396 303.002003 l
88.987952 305.562644 l
90.990509 307.624288 l
92.993065 304.803161 l
94.995622 279.324099 l
96.998178 258.319291 l
99.000735 252.006894 l
101.003291 257.867684 l
103.005848 256.391618 l
105.008405 280.914501 l
107.010961 298.39887 l
109.013518 272.276993 l
111.016074 222.658844 l
113.018631 211.410754 l
115.021187 210.175622 l
117.023744 209.593716 l
119.0263 209.988392 l
121.028857 212.255952 l
123.031413 211.12637 l
125.03397 210.8908 l
127.036526 212.795279 l
129.039083 209.904339 l
131.041639 208.838329 l
133.044196 212.133087 l
135.046753 212.355652 l
137.049309 212.247408 l
139.051866 213.633515 l
141.054422 206.385402 l
143.056979 216.065587 l
145.059535 213.242043 l
151.067205 212.852301 l
153.069761 212.574147 l
155.072318 212.786722 l
157.074874 212.330752 l
159.077431 213.030065 l
161.079987 212.625979 l
163.082544 211.061857 l
165.085101 207.128998 l
167.087657 208.904676 l
169.090214 207.59256 l
171.09277 207.351326 l
173.095327 209.78354 l
175.097883 208.117674 l
177.10044 207.868993 l
179.102996 208.749485 l
181.105553 206.585564 l
183.108109 208.623058 l
185.110666 212.627708 l
187.113222 224.679013 l
189.115779 226.318902 l
191.118335 223.151477 l
193.120892 226.648802 l
195.123448 225.585337 l
197.126005 225.38294 l
199.128562 224.33954 l
201.131118 224.442365 l
203.133675 225.34521 l
205.136231 224.406756 l
209.141344 225.255988 l
211.143901 223.769766 l
213.146457 217.999626 l
215.149014 212.622812 l
217.15157 213.402374 l
219.154127 213.294549 l
221.156683 212.90634 l
223.15924 212.785686 l
225.161796 213.272329 l
227.164353 212.348433 l
229.16691 213.893178 l
231.169466 213.210656 l
233.172023 211.588282 l
235.174579 214.2476 l
237.177136 213.238695 l
239.179692 213.963576 l
241.182249 218.610011 l
243.184805 217.099471 l
245.187362 219.409999 l
247.189918 217.032324 l
249.192475 219.705458 l
251.195031 219.253892 l
253.197588 217.207846 l
255.200144 218.616837 l
257.202701 218.801777 l
259.205258 218.04802 l
261.207814 217.122906 l
263.210371 219.057349 l
267.215484 218.053212 l
269.21804 218.15217 l
271.220597 117.229497 l
273.223153 290.414223 l
275.22571 292.568899 l
277.228266 291.244623 l
279.230823 291.302214 l
281.233379 289.664485 l
283.235936 292.238676 l
285.238492 293.618673 l
287.241049 293.475497 l
289.243606 293.205268 l
291.246162 293.515221 l
293.248719 293.244433 l
295.251275 293.481745 l
297.253832 292.160624 l
299.256388 267.899731 l
301.258945 212.153767 l
303.261501 211.452191 l
305.264058 211.188207 l
307.266614 209.366366 l
309.269171 211.011163 l
311.271727 214.806156 l
313.274284 210.562408 l
315.27684 210.355877 l
317.279397 210.873764 l
319.281954 211.750287 l
321.28451 211.325533 l
325.289623 212.642139 l
327.29218 212.034269 l
329.294736 211.948168 l
331.297293 208.285253 l
333.299849 204.915434 l
335.302406 204.696627 l
337.304962 203.329621 l
341.310075 201.756305 l
343.312632 202.905962 l
345.315188 205.458378 l
347.317745 218.956742 l
349.320302 220.23961 l
351.322858 222.12938 l
353.325415 221.362039 l
355.327971 220.738906 l
357.330528 221.872021 l
359.333084 221.388938 l
361.335641 221.12231 l
363.338197 221.677331 l
365.340754 220.524765 l
367.34331 220.820204 l
369.345867 221.640824 l
371.348423 221.049849 l
373.35098 216.641076 l
375.353536 215.384779 l
377.356093 213.698054 l
379.358649 215.57814 l
381.361206 214.99984 l
383.363763 214.5566 l
385.366319 215.625065 l
387.368876 214.651321 l
389.371432 214.794489 l
391.373989 215.255332 l
393.376545 215.156762 l
395.379102 212.783302 l
397.381658 216.006816 l
399.384215 215.934727 l
401.386771 214.32181 l
403.389328 216.207514 l
405.391884 215.58569 l
407.394441 213.770039 l
409.396997 216.090774 l
411.399554 214.893005 l
413.402111 214.992363 l
415.404667 214.681535 l
417.407224 214.828044 l
421.412337 216.205789 l
423.414893 217.133919 l
425.41745 217.443068 l
427.420006 216.219848 l
429.422563 217.083618 l
433.427676 216.932831 l
435.430232 217.191396 l
437.432789 217.278689 l
439.435345 216.505816 l
441.437902 217.001421 l
443.440459 216.826013 l
445.443015 217.883874 l
447.445572 218.221117 l
451.450685 220.499489 l
453.453241 219.59891 l
455.455798 218.56818 l
457.458354 220.242765 l
459.460911 219.12823 l
461.463467 219.412342 l
463.466024 217.995998 l
465.46858 220.544838 l
467.471137 217.806697 l
469.473693 213.323399 l
471.47625 209.431479 l
471.47625 209.431479 l
stroke
grestore
0.994 0.705 0.183 setrgbcolor
gsave
398.5 308.8 72.97 58.68 clipbox
72.9675 301.345081 m
74.970057 306.311252 l
76.972613 309.599635 l
78.97517 307.806358 l
80.977726 308.601324 l
82.980283 311.328654 l
84.982839 313.043592 l
86.985396 307.938411 l
88.987952 312.903041 l
90.990509 308.660275 l
92.993065 309.111773 l
96.998178 260.31064 l
99.000735 262.795573 l
101.003291 259.56927 l
103.005848 258.547956 l
105.008405 283.144106 l
107.010961 280.250321 l
109.013518 205.692529 l
111.016074 203.175223 l
113.018631 209.34109 l
115.021187 206.539634 l
117.023744 209.455659 l
119.0263 208.771357 l
121.028857 211.661881 l
123.031413 205.890554 l
125.03397 207.62919 l
127.036526 209.599091 l
129.039083 208.912266 l
131.041639 208.71865 l
133.044196 207.583436 l
135.046753 210.80474 l
137.049309 210.947616 l
139.051866 214.483498 l
141.054422 220.151742 l
143.056979 221.490744 l
145.059535 221.802659 l
147.062092 221.281058 l
149.064648 222.273581 l
151.067205 220.59199 l
153.069761 220.422247 l
155.072318 220.38749 l
157.074874 219.148449 l
159.077431 221.101951 l
161.079987 220.585582 l
163.082544 218.972479 l
165.085101 214.963193 l
167.087657 216.805308 l
169.090214 216.627127 l
171.09277 213.2867 l
173.095327 219.947596 l
175.097883 214.974837 l
177.10044 216.15179 l
179.102996 216.894527 l
181.105553 214.326237 l
183.108109 217.451076 l
185.110666 218.321104 l
187.113222 221.39538 l
189.115779 220.197894 l
191.118335 220.887178 l
193.120892 221.0354 l
195.123448 218.811176 l
197.126005 222.429851 l
199.128562 221.796588 l
201.131118 221.379478 l
203.133675 221.515507 l
205.136231 221.47818 l
207.138788 221.879952 l
211.143901 221.96814 l
213.146457 220.783985 l
215.149014 217.720332 l
217.15157 218.039218 l
219.154127 218.052524 l
221.156683 217.706145 l
223.15924 218.975109 l
227.164353 217.871998 l
229.16691 218.220359 l
231.169466 217.778739 l
233.172023 216.799708 l
235.174579 219.39096 l
237.177136 217.760274 l
239.179692 218.565472 l
241.182249 221.543395 l
243.184805 222.141362 l
245.187362 221.293044 l
247.189918 220.604202 l
249.192475 222.392424 l
251.195031 220.698321 l
253.197588 221.994472 l
255.200144 221.892735 l
257.202701 222.300091 l
259.205258 222.526056 l
261.207814 221.65408 l
263.210371 222.847059 l
265.212927 221.625467 l
267.215484 222.654513 l
269.21804 221.807509 l
271.220597 121.684278 l
273.223153 297.294763 l
275.22571 299.347205 l
277.228266 296.863101 l
279.230823 298.743052 l
281.233379 294.8649 l
283.235936 298.101126 l
285.238492 299.513269 l
287.241049 297.08133 l
289.243606 298.635235 l
293.248719 298.757162 l
295.251275 300.432061 l
297.253832 296.365475 l
299.256388 281.755644 l
301.258945 217.022183 l
303.261501 215.522999 l
305.264058 215.602367 l
307.266614 213.567925 l
309.269171 217.01721 l
311.271727 214.861183 l
313.274284 213.693569 l
315.27684 220.480495 l
317.279397 218.167393 l
319.281954 217.70058 l
321.28451 218.127071 l
323.287067 217.359127 l
325.289623 218.438306 l
327.29218 218.394166 l
329.294736 217.602751 l
331.297293 217.615068 l
333.299849 218.563293 l
335.302406 219.046636 l
337.304962 217.384701 l
339.307519 217.675366 l
341.310075 216.423206 l
343.312632 220.354257 l
345.315188 219.309267 l
347.317745 213.378981 l
349.320302 211.236688 l
351.322858 213.700222 l
353.325415 211.589519 l
355.327971 211.749296 l
357.330528 212.709002 l
359.333084 213.957725 l
361.335641 211.918419 l
363.338197 213.121487 l
365.340754 212.317405 l
367.34331 212.954575 l
369.345867 211.9088 l
371.348423 212.075685 l
373.35098 218.135501 l
375.353536 221.521789 l
377.356093 220.831074 l
379.358649 221.265888 l
381.361206 220.769531 l
383.363763 221.168683 l
385.366319 222.011373 l
387.368876 220.558153 l
389.371432 221.424181 l
391.373989 220.416424 l
393.376545 221.372557 l
395.379102 221.204636 l
397.381658 218.152843 l
399.384215 220.744051 l
401.386771 219.226761 l
403.389328 219.769313 l
405.391884 219.410982 l
407.394441 219.279837 l
409.396997 219.595551 l
411.399554 218.683737 l
413.402111 220.012816 l
415.404667 219.701373 l
417.407224 219.257233 l
419.40978 221.253101 l
421.412337 222.557933 l
423.414893 222.717899 l
425.41745 223.214269 l
427.420006 222.14104 l
429.422563 223.084476 l
431.425119 223.546712 l
433.427676 222.136846 l
435.430232 222.727018 l
437.432789 222.838809 l
439.435345 222.672357 l
441.437902 223.684226 l
443.440459 222.555477 l
445.443015 172.083627 l
447.445572 296.350156 l
449.448128 219.630662 l
451.450685 218.62887 l
453.453241 223.418843 l
455.455798 220.887877 l
457.458354 221.993087 l
459.460911 221.542313 l
461.463467 221.56709 l
463.466024 219.807672 l
465.46858 220.795192 l
467.471137 220.229248 l
469.473693 216.588862 l
471.47625 211.626245 l
471.47625 211.626245 l
stroke
grestore
0 setlinejoin
[] 0 setdash
0.000 setgray
gsave
72.9675 58.68 m
72.9675 367.528 l
stroke
grestore
gsave
471.47625 58.68 m
471.47625 367.528 l
stroke
grestore
gsave
72.9675 58.68 m
471.47625 58.68 l
stroke
grestore
gsave
72.9675 367.528 m
471.47625 367.528 l
stroke
grestore
0.500 setlinewidth
1 setlinejoin
0 setlinecap
[] 0 setdash
gsave
/o {
gsave
newpath
translate
0.5 setlinewidth
1 setlinejoin
0 setlinecap
0 0 m
0 4 l

gsave
0.000 setgray
fill
grestore
stroke
grestore
} bind def
72.9675 58.68 o
grestore
gsave
/o {
gsave
newpath
translate
0.5 setlinewidth
1 setlinejoin
0 setlinecap
0 0 m
0 -4 l

gsave
0.000 setgray
fill
grestore
stroke
grestore
} bind def
72.9675 367.528 o
grestore
/DejaVuSans findfont
16.000 scalefont
setfont
gsave
67.873750 42.523750 translate
0.000000 rotate
0.000000 0.000000 m /zero glyphshow
grestore
gsave
/o {
gsave
newpath
translate
0.5 setlinewidth
1 setlinejoin
0 setlinecap
0 0 m
0 4 l

gsave
0.000 setgray
fill
grestore
stroke
grestore
} bind def
152.669 58.68 o
grestore
gsave
/o {
gsave
newpath
translate
0.5 setlinewidth
1 setlinejoin
0 setlinecap
0 0 m
0 -4 l

gsave
0.000 setgray
fill
grestore
stroke
grestore
} bind def
152.669 367.528 o
grestore
gsave
142.481750 42.523750 translate
0.000000 rotate
0.000000 0.000000 m /two glyphshow
10.179688 0.000000 m /zero glyphshow
grestore
gsave
/o {
gsave
newpath
translate
0.5 setlinewidth
1 setlinejoin
0 setlinecap
0 0 m
0 4 l

gsave
0.000 setgray
fill
grestore
stroke
grestore
} bind def
232.371 58.68 o
grestore
gsave
/o {
gsave
newpath
translate
0.5 setlinewidth
1 setlinejoin
0 setlinecap
0 0 m
0 -4 l

gsave
0.000 setgray
fill
grestore
stroke
grestore
} bind def
232.371 367.528 o
grestore
gsave
222.183500 42.523750 translate
0.000000 rotate
0.000000 0.000000 m /four glyphshow
10.179688 0.000000 m /zero glyphshow
grestore
gsave
/o {
gsave
newpath
translate
0.5 setlinewidth
1 setlinejoin
0 setlinecap
0 0 m
0 4 l

gsave
0.000 setgray
fill
grestore
stroke
grestore
} bind def
312.073 58.68 o
grestore
gsave
/o {
gsave
newpath
translate
0.5 setlinewidth
1 setlinejoin
0 setlinecap
0 0 m
0 -4 l

gsave
0.000 setgray
fill
grestore
stroke
grestore
} bind def
312.073 367.528 o
grestore
gsave
301.885250 42.523750 translate
0.000000 rotate
0.000000 0.000000 m /six glyphshow
10.179688 0.000000 m /zero glyphshow
grestore
gsave
/o {
gsave
newpath
translate
0.5 setlinewidth
1 setlinejoin
0 setlinecap
0 0 m
0 4 l

gsave
0.000 setgray
fill
grestore
stroke
grestore
} bind def
391.775 58.68 o
grestore
gsave
/o {
gsave
newpath
translate
0.5 setlinewidth
1 setlinejoin
0 setlinecap
0 0 m
0 -4 l

gsave
0.000 setgray
fill
grestore
stroke
grestore
} bind def
391.775 367.528 o
grestore
gsave
381.587000 42.523750 translate
0.000000 rotate
0.000000 0.000000 m /eight glyphshow
10.179688 0.000000 m /zero glyphshow
grestore
gsave
/o {
gsave
newpath
translate
0.5 setlinewidth
1 setlinejoin
0 setlinecap
0 0 m
0 4 l

gsave
0.000 setgray
fill
grestore
stroke
grestore
} bind def
471.476 58.68 o
grestore
gsave
/o {
gsave
newpath
translate
0.5 setlinewidth
1 setlinejoin
0 setlinecap
0 0 m
0 -4 l

gsave
0.000 setgray
fill
grestore
stroke
grestore
} bind def
471.476 367.528 o
grestore
gsave
456.195000 42.523750 translate
0.000000 rotate
0.000000 0.000000 m /one glyphshow
10.179688 0.000000 m /zero glyphshow
20.359375 0.000000 m /zero glyphshow
grestore
gsave
174.690625 22.039375 translate
0.000000 rotate
0.000000 0.000000 m /I glyphshow
4.718750 0.000000 m /t glyphshow
10.992188 0.000000 m /e glyphshow
20.835938 0.000000 m /r glyphshow
27.414062 0.000000 m /a glyphshow
37.218750 0.000000 m /t glyphshow
43.492188 0.000000 m /i glyphshow
47.937500 0.000000 m /o glyphshow
57.726562 0.000000 m /n glyphshow
67.867188 0.000000 m /space glyphshow
72.953125 0.000000 m /numbersign glyphshow
86.359375 0.000000 m /space glyphshow
91.445312 0.000000 m /parenleft glyphshow
97.687500 0.000000 m /N glyphshow
109.656250 0.000000 m /o glyphshow
119.445312 0.000000 m /r glyphshow
126.023438 0.000000 m /m glyphshow
141.609375 0.000000 m /a glyphshow
151.414062 0.000000 m /l glyphshow
155.859375 0.000000 m /i glyphshow
160.304688 0.000000 m /z glyphshow
168.703125 0.000000 m /e glyphshow
178.546875 0.000000 m /d glyphshow
188.703125 0.000000 m /parenright glyphshow
grestore
gsave
/o {
gsave
newpath
translate
0.5 setlinewidth
1 setlinejoin
0 setlinecap
0 0 m
4 0 l

gsave
0.000 setgray
fill
grestore
stroke
grestore
} bind def
72.9675 70.5588 o
grestore
gsave
/o {
gsave
newpath
translate
0.5 setlinewidth
1 setlinejoin
0 setlinecap
0 0 m
-4 0 l

gsave
0.000 setgray
fill
grestore
stroke
grestore
} bind def
471.476 70.5588 o
grestore
gsave
48.592500 64.480644 translate
0.000000 rotate
0.000000 0.000000 m /eight glyphshow
10.179688 0.000000 m /zero glyphshow
grestore
gsave
/o {
gsave
newpath
translate
0.5 setlinewidth
1 setlinejoin
0 setlinecap
0 0 m
4 0 l

gsave
0.000 setgray
fill
grestore
stroke
grestore
} bind def
72.9675 112.983 o
grestore
gsave
/o {
gsave
newpath
translate
0.5 setlinewidth
1 setlinejoin
0 setlinecap
0 0 m
-4 0 l

gsave
0.000 setgray
fill
grestore
stroke
grestore
} bind def
471.476 112.983 o
grestore
gsave
38.405000 106.904820 translate
0.000000 rotate
0.000000 0.000000 m /one glyphshow
10.179688 0.000000 m /zero glyphshow
20.359375 0.000000 m /zero glyphshow
grestore
gsave
/o {
gsave
newpath
translate
0.5 setlinewidth
1 setlinejoin
0 setlinecap
0 0 m
4 0 l

gsave
0.000 setgray
fill
grestore
stroke
grestore
} bind def
72.9675 155.407 o
grestore
gsave
/o {
gsave
newpath
translate
0.5 setlinewidth
1 setlinejoin
0 setlinecap
0 0 m
-4 0 l

gsave
0.000 setgray
fill
grestore
stroke
grestore
} bind def
471.476 155.407 o
grestore
gsave
38.405000 149.328996 translate
0.000000 rotate
0.000000 0.000000 m /one glyphshow
10.179688 0.000000 m /two glyphshow
20.359375 0.000000 m /zero glyphshow
grestore
gsave
/o {
gsave
newpath
translate
0.5 setlinewidth
1 setlinejoin
0 setlinecap
0 0 m
4 0 l

gsave
0.000 setgray
fill
grestore
stroke
grestore
} bind def
72.9675 197.831 o
grestore
gsave
/o {
gsave
newpath
translate
0.5 setlinewidth
1 setlinejoin
0 setlinecap
0 0 m
-4 0 l

gsave
0.000 setgray
fill
grestore
stroke
grestore
} bind def
471.476 197.831 o
grestore
gsave
38.405000 191.753172 translate
0.000000 rotate
0.000000 0.000000 m /one glyphshow
10.179688 0.000000 m /four glyphshow
20.359375 0.000000 m /zero glyphshow
grestore
gsave
/o {
gsave
newpath
translate
0.5 setlinewidth
1 setlinejoin
0 setlinecap
0 0 m
4 0 l

gsave
0.000 setgray
fill
grestore
stroke
grestore
} bind def
72.9675 240.255 o
grestore
gsave
/o {
gsave
newpath
translate
0.5 setlinewidth
1 setlinejoin
0 setlinecap
0 0 m
-4 0 l

gsave
0.000 setgray
fill
grestore
stroke
grestore
} bind def
471.476 240.255 o
grestore
gsave
38.405000 234.177348 translate
0.000000 rotate
0.000000 0.000000 m /one glyphshow
10.179688 0.000000 m /six glyphshow
20.359375 0.000000 m /zero glyphshow
grestore
gsave
/o {
gsave
newpath
translate
0.5 setlinewidth
1 setlinejoin
0 setlinecap
0 0 m
4 0 l

gsave
0.000 setgray
fill
grestore
stroke
grestore
} bind def
72.9675 282.68 o
grestore
gsave
/o {
gsave
newpath
translate
0.5 setlinewidth
1 setlinejoin
0 setlinecap
0 0 m
-4 0 l

gsave
0.000 setgray
fill
grestore
stroke
grestore
} bind def
471.476 282.68 o
grestore
gsave
38.405000 276.601523 translate
0.000000 rotate
0.000000 0.000000 m /one glyphshow
10.179688 0.000000 m /eight glyphshow
20.359375 0.000000 m /zero glyphshow
grestore
gsave
/o {
gsave
newpath
translate
0.5 setlinewidth
1 setlinejoin
0 setlinecap
0 0 m
4 0 l

gsave
0.000 setgray
fill
grestore
stroke
grestore
} bind def
72.9675 325.104 o
grestore
gsave
/o {
gsave
newpath
translate
0.5 setlinewidth
1 setlinejoin
0 setlinecap
0 0 m
-4 0 l

gsave
0.000 setgray
fill
grestore
stroke
grestore
} bind def
471.476 325.104 o
grestore
gsave
38.405000 319.025699 translate
0.000000 rotate
0.000000 0.000000 m /two glyphshow
10.179688 0.000000 m /zero glyphshow
20.359375 0.000000 m /zero glyphshow
grestore
gsave
/o {
gsave
newpath
translate
0.5 setlinewidth
1 setlinejoin
0 setlinecap
0 0 m
4 0 l

gsave
0.000 setgray
fill
grestore
stroke
grestore
} bind def
72.9675 367.528 o
grestore
gsave
/o {
gsave
newpath
translate
0.5 setlinewidth
1 setlinejoin
0 setlinecap
0 0 m
-4 0 l

gsave
0.000 setgray
fill
grestore
stroke
grestore
} bind def
471.476 367.528 o
grestore
gsave
38.405000 361.449875 translate
0.000000 rotate
0.000000 0.000000 m /two glyphshow
10.179688 0.000000 m /two glyphshow
20.359375 0.000000 m /zero glyphshow
grestore
gsave
30.076875 111.479000 translate
90.000000 rotate
0.000000 0.000000 m /S glyphshow
10.156250 0.000000 m /o glyphshow
19.945312 0.000000 m /c glyphshow
28.742188 0.000000 m /k glyphshow
38.007812 0.000000 m /e glyphshow
47.851562 0.000000 m /t glyphshow
54.125000 0.000000 m /plus glyphshow
67.531250 0.000000 m /D glyphshow
79.851562 0.000000 m /R glyphshow
90.968750 0.000000 m /A glyphshow
101.914062 0.000000 m /M glyphshow
115.718750 0.000000 m /space glyphshow
120.804688 0.000000 m /P glyphshow
130.453125 0.000000 m /o glyphshow
140.242188 0.000000 m /w glyphshow
153.328125 0.000000 m /e glyphshow
163.171875 0.000000 m /r glyphshow
169.750000 0.000000 m /space glyphshow
174.835938 0.000000 m /parenleft glyphshow
181.078125 0.000000 m /W glyphshow
196.898438 0.000000 m /parenright glyphshow
grestore
/DejaVuSans findfont
19.200 scalefont
setfont
gsave
126.776563 399.983085 translate
0.000000 rotate
0.000000 0.000000 m /N glyphshow
14.399902 0.000000 m /e glyphshow
26.243164 0.000000 m /k glyphshow
37.390869 0.000000 m /b glyphshow
49.610107 0.000000 m /o glyphshow
61.387573 0.000000 m /n glyphshow
73.588013 0.000000 m /e glyphshow
85.431274 0.000000 m /space glyphshow
91.550293 0.000000 m /I glyphshow
97.227539 0.000000 m /t glyphshow
104.775269 0.000000 m /e glyphshow
116.618530 0.000000 m /r glyphshow
124.532837 0.000000 m /a glyphshow
136.329102 0.000000 m /t glyphshow
143.876831 0.000000 m /i glyphshow
149.225098 0.000000 m /o glyphshow
161.002563 0.000000 m /n glyphshow
173.203003 0.000000 m /space glyphshow
179.322021 0.000000 m /L glyphshow
190.046753 0.000000 m /o glyphshow
201.824219 0.000000 m /o glyphshow
213.601685 0.000000 m /p glyphshow
225.820923 0.000000 m /space glyphshow
231.939941 0.000000 m /P glyphshow
243.548218 0.000000 m /o glyphshow
255.325684 0.000000 m /w glyphshow
271.069702 0.000000 m /e glyphshow
282.912964 0.000000 m /r glyphshow
grestore
gsave
141.479688 378.704960 translate
0.000000 rotate
0.000000 0.000000 m /at glyphshow
19.250000 0.000000 m /space glyphshow
25.369019 0.000000 m /one glyphshow
37.616455 0.000000 m /five glyphshow
49.863892 0.000000 m /zero glyphshow
62.111328 0.000000 m /space glyphshow
68.230347 0.000000 m /W glyphshow
87.264160 0.000000 m /space glyphshow
93.383179 0.000000 m /hyphen glyphshow
100.329346 0.000000 m /space glyphshow
106.448364 0.000000 m /K glyphshow
119.071777 0.000000 m /n glyphshow
131.272217 0.000000 m /i glyphshow
136.620483 0.000000 m /g glyphshow
148.839722 0.000000 m /h glyphshow
161.040161 0.000000 m /t glyphshow
168.587891 0.000000 m /s glyphshow
178.617065 0.000000 m /space glyphshow
184.736084 0.000000 m /L glyphshow
195.460815 0.000000 m /a glyphshow
207.257080 0.000000 m /n glyphshow
219.457520 0.000000 m /d glyphshow
231.676758 0.000000 m /i glyphshow
237.025024 0.000000 m /n glyphshow
249.225464 0.000000 m /g glyphshow
grestore
3.000 setlinewidth
2 setlinecap
gsave
398.5 308.8 72.97 58.68 clipbox
72.9675 332.394329 m
74.970057 340.921998 l
76.972613 343.991972 l
78.97517 346.059203 l
80.977726 347.016288 l
82.980283 342.057536 l
84.982839 345.673611 l
86.985396 345.261608 l
88.987952 349.634427 l
90.990509 345.818388 l
92.993065 347.892587 l
94.995622 257.136318 l
96.998178 214.501434 l
99.000735 217.957079 l
101.003291 216.581682 l
103.005848 215.890509 l
105.008405 270.226714 l
107.010961 279.891248 l
109.013518 277.699109 l
111.016074 278.878317 l
113.018631 275.658646 l
115.021187 280.405553 l
117.023744 277.857718 l
119.0263 280.949841 l
121.028857 277.407447 l
123.031413 275.135508 l
125.03397 277.5837 l
127.036526 280.238277 l
129.039083 279.783488 l
131.041639 279.006002 l
133.044196 279.773738 l
135.046753 278.57929 l
137.049309 280.901803 l
139.051866 266.522261 l
141.054422 261.767559 l
143.056979 267.163884 l
145.059535 263.55677 l
147.062092 266.11132 l
149.064648 265.561642 l
151.067205 263.975249 l
153.069761 268.146488 l
155.072318 261.981049 l
157.074874 267.701733 l
159.077431 265.366994 l
161.079987 268.251455 l
163.082544 259.373485 l
165.085101 258.457388 l
167.087657 260.555266 l
169.090214 260.010857 l
171.09277 259.289821 l
173.095327 258.815894 l
175.097883 259.68487 l
177.10044 259.746371 l
179.102996 258.856948 l
181.105553 260.162124 l
183.108109 258.338493 l
185.110666 258.282432 l
187.113222 255.378854 l
189.115779 255.841681 l
191.118335 257.587029 l
193.120892 256.909325 l
195.123448 257.600116 l
197.126005 255.608372 l
199.128562 257.826576 l
201.131118 256.412468 l
203.133675 257.592764 l
205.136231 258.169716 l
207.138788 258.162179 l
209.141344 257.542264 l
211.143901 258.530527 l
213.146457 254.544281 l
215.149014 245.878898 l
217.15157 248.183778 l
219.154127 247.994126 l
221.156683 248.602202 l
223.15924 249.588121 l
225.161796 247.785985 l
229.16691 248.542219 l
231.169466 249.362229 l
233.172023 248.454596 l
235.174579 249.067934 l
237.177136 248.015656 l
239.179692 258.433177 l
241.182249 261.863576 l
243.184805 260.911056 l
245.187362 260.175159 l
247.189918 260.563894 l
249.192475 259.126117 l
251.195031 261.712449 l
253.197588 261.467208 l
255.200144 262.725558 l
257.202701 261.130613 l
259.205258 260.849512 l
261.207814 259.951297 l
263.210371 262.001954 l
265.212927 261.175441 l
267.215484 261.096582 l
269.21804 259.722685 l
271.220597 145.119447 l
273.223153 328.459242 l
275.22571 331.757072 l
277.228266 330.81444 l
279.230823 333.369845 l
281.233379 332.098326 l
283.235936 333.915942 l
287.241049 336.211409 l
289.243606 336.585472 l
291.246162 337.586699 l
293.248719 336.507669 l
295.251275 339.566058 l
297.253832 337.748573 l
299.256388 320.611435 l
301.258945 307.143277 l
303.261501 251.684661 l
305.264058 250.908166 l
307.266614 252.423569 l
309.269171 250.913997 l
311.271727 251.591736 l
313.274284 255.354163 l
315.27684 262.644809 l
317.279397 265.431927 l
319.281954 265.209988 l
321.28451 263.997759 l
323.287067 264.247532 l
325.289623 263.663143 l
327.29218 265.254247 l
329.294736 264.627044 l
331.297293 259.991277 l
333.299849 259.856275 l
335.302406 260.295911 l
337.304962 259.498196 l
339.307519 259.19283 l
341.310075 260.61039 l
343.312632 257.592459 l
345.315188 262.973403 l
347.317745 258.449621 l
349.320302 257.598079 l
351.322858 259.572797 l
353.325415 258.47602 l
355.327971 258.683404 l
357.330528 257.919684 l
361.335641 259.333558 l
363.338197 258.949732 l
365.340754 259.261511 l
367.34331 258.229781 l
369.345867 257.951188 l
371.348423 259.01953 l
373.35098 253.278963 l
375.353536 252.366895 l
377.356093 252.118496 l
379.358649 252.944379 l
381.361206 252.351388 l
383.363763 251.068571 l
385.366319 253.186442 l
387.368876 251.799445 l
389.371432 253.002833 l
391.373989 252.970122 l
393.376545 252.100883 l
395.379102 257.90705 l
397.381658 253.444531 l
399.384215 261.541842 l
401.386771 257.187674 l
403.389328 255.634969 l
405.391884 257.346868 l
407.394441 255.857911 l
409.396997 257.139618 l
411.399554 256.337015 l
413.402111 256.304092 l
415.404667 257.645011 l
417.407224 257.642749 l
419.40978 256.524144 l
421.412337 252.996784 l
423.414893 251.943095 l
425.41745 251.909605 l
427.420006 252.296553 l
429.422563 250.720378 l
431.425119 252.037431 l
433.427676 252.522586 l
435.430232 250.727935 l
437.432789 252.750654 l
439.435345 250.399591 l
441.437902 251.364624 l
443.440459 251.998253 l
445.443015 251.55964 l
447.445572 251.787767 l
449.448128 252.988022 l
451.450685 253.0897 l
453.453241 248.128104 l
455.455798 257.198529 l
457.458354 251.612483 l
459.460911 251.756884 l
461.463467 253.792614 l
463.466024 252.03277 l
465.46858 253.248593 l
469.473693 253.93834 l
471.47625 250.688265 l
471.47625 250.688265 l
stroke
grestore
1.000 setlinewidth
1.000 0.000 0.000 setrgbcolor
gsave
398.5 308.8 72.97 58.68 clipbox
72.9675 332.394329 m
74.970057 340.921998 l
76.972613 343.991972 l
78.97517 346.059203 l
80.977726 347.016288 l
82.980283 342.057536 l
84.982839 345.673611 l
86.985396 345.261608 l
88.987952 349.634427 l
90.990509 345.818388 l
92.993065 347.892587 l
94.995622 257.136318 l
96.998178 214.501434 l
99.000735 217.957079 l
101.003291 216.581682 l
103.005848 215.890509 l
105.008405 270.226714 l
107.010961 279.891248 l
109.013518 277.699109 l
111.016074 278.878317 l
113.018631 275.658646 l
115.021187 280.405553 l
117.023744 277.857718 l
119.0263 280.949841 l
121.028857 277.407447 l
123.031413 275.135508 l
125.03397 277.5837 l
127.036526 280.238277 l
129.039083 279.783488 l
131.041639 279.006002 l
133.044196 279.773738 l
135.046753 278.57929 l
137.049309 280.901803 l
139.051866 266.522261 l
141.054422 261.767559 l
143.056979 267.163884 l
145.059535 263.55677 l
147.062092 266.11132 l
149.064648 265.561642 l
151.067205 263.975249 l
153.069761 268.146488 l
155.072318 261.981049 l
157.074874 267.701733 l
159.077431 265.366994 l
161.079987 268.251455 l
163.082544 259.373485 l
165.085101 258.457388 l
167.087657 260.555266 l
169.090214 260.010857 l
171.09277 259.289821 l
173.095327 258.815894 l
175.097883 259.68487 l
177.10044 259.746371 l
179.102996 258.856948 l
181.105553 260.162124 l
183.108109 258.338493 l
185.110666 258.282432 l
187.113222 255.378854 l
189.115779 255.841681 l
191.118335 257.587029 l
193.120892 256.909325 l
195.123448 257.600116 l
197.126005 255.608372 l
199.128562 257.826576 l
201.131118 256.412468 l
203.133675 257.592764 l
205.136231 258.169716 l
207.138788 258.162179 l
209.141344 257.542264 l
211.143901 258.530527 l
213.146457 254.544281 l
215.149014 245.878898 l
217.15157 248.183778 l
219.154127 247.994126 l
221.156683 248.602202 l
223.15924 249.588121 l
225.161796 247.785985 l
229.16691 248.542219 l
231.169466 249.362229 l
233.172023 248.454596 l
235.174579 249.067934 l
237.177136 248.015656 l
239.179692 258.433177 l
241.182249 261.863576 l
243.184805 260.911056 l
245.187362 260.175159 l
247.189918 260.563894 l
249.192475 259.126117 l
251.195031 261.712449 l
253.197588 261.467208 l
255.200144 262.725558 l
257.202701 261.130613 l
259.205258 260.849512 l
261.207814 259.951297 l
263.210371 262.001954 l
265.212927 261.175441 l
267.215484 261.096582 l
269.21804 259.722685 l
271.220597 145.119447 l
273.223153 328.459242 l
275.22571 331.757072 l
277.228266 330.81444 l
279.230823 333.369845 l
281.233379 332.098326 l
283.235936 333.915942 l
287.241049 336.211409 l
289.243606 336.585472 l
291.246162 337.586699 l
293.248719 336.507669 l
295.251275 339.566058 l
297.253832 337.748573 l
299.256388 320.611435 l
301.258945 307.143277 l
303.261501 251.684661 l
305.264058 250.908166 l
307.266614 252.423569 l
309.269171 250.913997 l
311.271727 251.591736 l
313.274284 255.354163 l
315.27684 262.644809 l
317.279397 265.431927 l
319.281954 265.209988 l
321.28451 263.997759 l
323.287067 264.247532 l
325.289623 263.663143 l
327.29218 265.254247 l
329.294736 264.627044 l
331.297293 259.991277 l
333.299849 259.856275 l
335.302406 260.295911 l
337.304962 259.498196 l
339.307519 259.19283 l
341.310075 260.61039 l
343.312632 257.592459 l
345.315188 262.973403 l
347.317745 258.449621 l
349.320302 257.598079 l
351.322858 259.572797 l
353.325415 258.47602 l
355.327971 258.683404 l
357.330528 257.919684 l
361.335641 259.333558 l
363.338197 258.949732 l
365.340754 259.261511 l
367.34331 258.229781 l
369.345867 257.951188 l
371.348423 259.01953 l
373.35098 253.278963 l
375.353536 252.366895 l
377.356093 252.118496 l
379.358649 252.944379 l
381.361206 252.351388 l
383.363763 251.068571 l
385.366319 253.186442 l
387.368876 251.799445 l
389.371432 253.002833 l
391.373989 252.970122 l
393.376545 252.100883 l
395.379102 257.90705 l
397.381658 253.444531 l
399.384215 261.541842 l
401.386771 257.187674 l
403.389328 255.634969 l
405.391884 257.346868 l
407.394441 255.857911 l
409.396997 257.139618 l
411.399554 256.337015 l
413.402111 256.304092 l
415.404667 257.645011 l
417.407224 257.642749 l
419.40978 256.524144 l
421.412337 252.996784 l
423.414893 251.943095 l
425.41745 251.909605 l
427.420006 252.296553 l
429.422563 250.720378 l
431.425119 252.037431 l
433.427676 252.522586 l
435.430232 250.727935 l
437.432789 252.750654 l
439.435345 250.399591 l
441.437902 251.364624 l
443.440459 251.998253 l
445.443015 251.55964 l
447.445572 251.787767 l
449.448128 252.988022 l
451.450685 253.0897 l
453.453241 248.128104 l
455.455798 257.198529 l
457.458354 251.612483 l
459.460911 251.756884 l
461.463467 253.792614 l
463.466024 252.03277 l
465.46858 253.248593 l
469.473693 253.93834 l
471.47625 250.688265 l
471.47625 250.688265 l
stroke
grestore
0 setlinejoin
0 setlinecap
[] 0 setdash
0.300 setgray
gsave
129.40625 62.68 m
419.0375 62.68 l
420.6375 62.68 421.4375 63.48 421.4375 65.08 c
421.4375 121.78 l
421.4375 123.38 420.6375 124.18 419.0375 124.18 c
129.40625 124.18 l
127.80625 124.18 127.00625 123.38 127.00625 121.78 c
127.00625 65.08 l
127.00625 63.48 127.80625 62.68 129.40625 62.68 c
cl
gsave
fill
grestore
stroke
grestore
0.000 setgray
gsave
127.40625 64.68 m
417.0375 64.68 l
418.6375 64.68 419.4375 65.48 419.4375 67.08 c
419.4375 123.78 l
419.4375 125.38 418.6375 126.18 417.0375 126.18 c
127.40625 126.18 l
125.80625 126.18 125.00625 125.38 125.00625 123.78 c
125.00625 67.08 l
125.00625 65.48 125.80625 64.68 127.40625 64.68 c
cl
gsave
1.000 setgray
fill
grestore
stroke
grestore
2.000 setlinewidth
1 setlinejoin
2 setlinecap
[] 0 setdash
0.050 0.030 0.528 setrgbcolor
gsave
133.40625 116.455 m
150.20625 116.455 l
stroke
grestore
0.000 setgray
/DejaVuSans findfont
12.000 scalefont
setfont
gsave
163.406250 112.255000 translate
0.000000 rotate
0.000000 0.000000 m /N glyphshow
8.976562 0.000000 m /o glyphshow
16.318359 0.000000 m /d glyphshow
23.935547 0.000000 m /e glyphshow
31.318359 0.000000 m /space glyphshow
35.132812 0.000000 m /one glyphshow
grestore
0.228 0.016 0.605 setrgbcolor
gsave
133.40625 103.03 m
150.20625 103.03 l
stroke
grestore
0.000 setgray
gsave
163.406250 98.830000 translate
0.000000 rotate
0.000000 0.000000 m /N glyphshow
8.976562 0.000000 m /o glyphshow
16.318359 0.000000 m /d glyphshow
23.935547 0.000000 m /e glyphshow
31.318359 0.000000 m /space glyphshow
35.132812 0.000000 m /two glyphshow
grestore
0.363 0.003 0.649 setrgbcolor
gsave
133.40625 89.605 m
150.20625 89.605 l
stroke
grestore
0.000 setgray
gsave
163.406250 85.405000 translate
0.000000 rotate
0.000000 0.000000 m /N glyphshow
8.976562 0.000000 m /o glyphshow
16.318359 0.000000 m /d glyphshow
23.935547 0.000000 m /e glyphshow
31.318359 0.000000 m /space glyphshow
35.132812 0.000000 m /three glyphshow
grestore
0.495 0.012 0.658 setrgbcolor
gsave
133.40625 76.18 m
150.20625 76.18 l
stroke
grestore
0.000 setgray
gsave
163.406250 71.980000 translate
0.000000 rotate
0.000000 0.000000 m /N glyphshow
8.976562 0.000000 m /o glyphshow
16.318359 0.000000 m /d glyphshow
23.935547 0.000000 m /e glyphshow
31.318359 0.000000 m /space glyphshow
35.132812 0.000000 m /four glyphshow
grestore
0.611 0.090 0.620 setrgbcolor
gsave
233.803125 116.455 m
250.603125 116.455 l
stroke
grestore
0.000 setgray
gsave
263.803125 112.255000 translate
0.000000 rotate
0.000000 0.000000 m /N glyphshow
8.976562 0.000000 m /o glyphshow
16.318359 0.000000 m /d glyphshow
23.935547 0.000000 m /e glyphshow
31.318359 0.000000 m /space glyphshow
35.132812 0.000000 m /five glyphshow
grestore
0.711 0.183 0.550 setrgbcolor
gsave
233.803125 103.03 m
250.603125 103.03 l
stroke
grestore
0.000 setgray
gsave
263.803125 98.830000 translate
0.000000 rotate
0.000000 0.000000 m /N glyphshow
8.976562 0.000000 m /o glyphshow
16.318359 0.000000 m /d glyphshow
23.935547 0.000000 m /e glyphshow
31.318359 0.000000 m /space glyphshow
35.132812 0.000000 m /six glyphshow
grestore
0.798 0.280 0.470 setrgbcolor
gsave
233.803125 89.605 m
250.603125 89.605 l
stroke
grestore
0.000 setgray
gsave
263.803125 85.405000 translate
0.000000 rotate
0.000000 0.000000 m /N glyphshow
8.976562 0.000000 m /o glyphshow
16.318359 0.000000 m /d glyphshow
23.935547 0.000000 m /e glyphshow
31.318359 0.000000 m /space glyphshow
35.132812 0.000000 m /seven glyphshow
grestore
3.000 setlinewidth
gsave
233.803125 76.18 m
250.603125 76.18 l
stroke
grestore
2.000 setlinewidth
1.000 0.000 0.000 setrgbcolor
gsave
233.803125 76.18 m
250.603125 76.18 l
stroke
grestore
0.000 setgray
gsave
263.803125 71.980000 translate
0.000000 rotate
0.000000 0.000000 m /N glyphshow
8.976562 0.000000 m /o glyphshow
16.318359 0.000000 m /d glyphshow
23.935547 0.000000 m /e glyphshow
31.318359 0.000000 m /space glyphshow
35.132812 0.000000 m /eight glyphshow
grestore
0.869 0.374 0.397 setrgbcolor
gsave
334.2 116.455 m
351 116.455 l
stroke
grestore
0.000 setgray
gsave
364.200000 112.255000 translate
0.000000 rotate
0.000000 0.000000 m /N glyphshow
8.976562 0.000000 m /o glyphshow
16.318359 0.000000 m /d glyphshow
23.935547 0.000000 m /e glyphshow
31.318359 0.000000 m /space glyphshow
35.132812 0.000000 m /nine glyphshow
grestore
0.928 0.473 0.326 setrgbcolor
gsave
334.2 103.03 m
351 103.03 l
stroke
grestore
0.000 setgray
gsave
364.200000 98.830000 translate
0.000000 rotate
0.000000 0.000000 m /N glyphshow
8.976562 0.000000 m /o glyphshow
16.318359 0.000000 m /d glyphshow
23.935547 0.000000 m /e glyphshow
31.318359 0.000000 m /space glyphshow
35.132812 0.000000 m /one glyphshow
42.767578 0.000000 m /zero glyphshow
grestore
0.973 0.586 0.252 setrgbcolor
gsave
334.2 89.605 m
351 89.605 l
stroke
grestore
0.000 setgray
gsave
364.200000 85.405000 translate
0.000000 rotate
0.000000 0.000000 m /N glyphshow
8.976562 0.000000 m /o glyphshow
16.318359 0.000000 m /d glyphshow
23.935547 0.000000 m /e glyphshow
31.318359 0.000000 m /space glyphshow
35.132812 0.000000 m /one glyphshow
42.767578 0.000000 m /one glyphshow
grestore
0.994 0.705 0.183 setrgbcolor
gsave
334.2 76.18 m
351 76.18 l
stroke
grestore
0.000 setgray
gsave
364.200000 71.980000 translate
0.000000 rotate
0.000000 0.000000 m /N glyphshow
8.976562 0.000000 m /o glyphshow
16.318359 0.000000 m /d glyphshow
23.935547 0.000000 m /e glyphshow
31.318359 0.000000 m /space glyphshow
35.132812 0.000000 m /one glyphshow
42.767578 0.000000 m /two glyphshow
grestore

end
showpage
