%!PS-Adobe-3.0 EPSF-3.0
%%Creator: cairo 1.14.2 (http://cairographics.org)
%%CreationDate: Mon Feb 19 09:15:05 2018
%%Pages: 1
%%DocumentData: Clean7Bit
%%LanguageLevel: 2
%%BoundingBox: 0 38 410 372
%%EndComments
%%BeginProlog
save
50 dict begin
/q { gsave } bind def
/Q { grestore } bind def
/cm { 6 array astore concat } bind def
/w { setlinewidth } bind def
/J { setlinecap } bind def
/j { setlinejoin } bind def
/M { setmiterlimit } bind def
/d { setdash } bind def
/m { moveto } bind def
/l { lineto } bind def
/c { curveto } bind def
/h { closepath } bind def
/re { exch dup neg 3 1 roll 5 3 roll moveto 0 rlineto
      0 exch rlineto 0 rlineto closepath } bind def
/S { stroke } bind def
/f { fill } bind def
/f* { eofill } bind def
/n { newpath } bind def
/W { clip } bind def
/W* { eoclip } bind def
/BT { } bind def
/ET { } bind def
/pdfmark where { pop globaldict /?pdfmark /exec load put }
    { globaldict begin /?pdfmark /pop load def /pdfmark
    /cleartomark load def end } ifelse
/BDC { mark 3 1 roll /BDC pdfmark } bind def
/EMC { mark /EMC pdfmark } bind def
/cairo_store_point { /cairo_point_y exch def /cairo_point_x exch def } def
/Tj { show currentpoint cairo_store_point } bind def
/TJ {
  {
    dup
    type /stringtype eq
    { show } { -0.001 mul 0 cairo_font_matrix dtransform rmoveto } ifelse
  } forall
  currentpoint cairo_store_point
} bind def
/cairo_selectfont { cairo_font_matrix aload pop pop pop 0 0 6 array astore
    cairo_font exch selectfont cairo_point_x cairo_point_y moveto } bind def
/Tf { pop /cairo_font exch def /cairo_font_matrix where
      { pop cairo_selectfont } if } bind def
/Td { matrix translate cairo_font_matrix matrix concatmatrix dup
      /cairo_font_matrix exch def dup 4 get exch 5 get cairo_store_point
      /cairo_font where { pop cairo_selectfont } if } bind def
/Tm { 2 copy 8 2 roll 6 array astore /cairo_font_matrix exch def
      cairo_store_point /cairo_font where { pop cairo_selectfont } if } bind def
/g { setgray } bind def
/rg { setrgbcolor } bind def
/d1 { setcachedevice } bind def
%%EndProlog
%%BeginSetup
%%EndSetup
%%Page: 1 1
%%BeginPageSetup
%%PageBoundingBox: 0 38 410 372
%%EndPageSetup
q 0 38 410 334 rectclip q
0.917647 0.231373 0.219608 rg
380.555 261.534 m 178.977 261.534 l 178.977 96.788 l 178.977 83.843 189.469
 73.347 202.414 73.347 c 326.555 73.347 l 349.363 50.538 l 351.793 48.109
 355.949 49.831 355.949 53.265 c 355.949 73.347 l 380.555 73.347 l 393.5
 73.347 403.996 83.843 403.996 96.788 c 403.996 238.093 l 403.996 251.038
 393.5 261.534 380.555 261.534 c h
380.555 261.534 m f
0.894118 0.00392157 0.211765 rg
359.086 187.796 m 340.5 187.796 l 338.031 187.796 336.031 185.796 336.031
 183.327 c 336.031 178.546 l 318.145 178.546 l 312.91 186.273 304.23 190.878
 294.887 190.878 c 241.621 190.878 l 236.441 190.878 232.227 186.667 232.227
 181.488 c 232.227 177.253 235.043 173.663 238.902 172.495 c 235.043 171.327
 232.227 167.738 232.227 163.503 c 232.227 159.269 235.043 155.675 238.902
 154.511 c 235.043 153.343 232.227 149.753 232.227 145.515 c 232.227 141.28
 235.043 137.691 238.902 136.523 c 235.043 135.355 232.227 131.765 232.227
 127.53 c 232.227 122.351 236.441 118.14 241.621 118.14 c 272.824 118.14
 l 272.824 96.187 l 272.824 91.007 277.039 86.792 282.215 86.792 c 287.395
 86.792 291.609 91.007 291.609 96.187 c 291.609 118.296 l 303.812 124.738
 l 307.852 126.87 311.344 129.991 313.91 133.757 c 317.629 139.21 l 336.031
 139.21 l 336.031 135.968 l 336.031 133.499 338.031 131.499 340.496 131.499
 c 359.082 131.499 l 361.551 131.499 363.551 133.499 363.551 135.968 c 363.551
 183.331 l 363.555 185.796 361.555 187.796 359.086 187.796 c h
359.086 187.796 m f
0.980392 0.827451 0.576471 rg
291.828 99.78 m 286.648 99.78 282.434 103.995 282.434 109.171 c 282.434
 131.124 l 251.23 131.124 l 246.051 131.124 241.836 135.339 241.836 140.519
 c 241.836 144.753 244.656 148.343 248.512 149.511 c 244.656 150.679 241.836
 154.269 241.836 158.503 c 241.836 162.738 244.656 166.327 248.512 167.495
 c 244.656 168.663 241.836 172.253 241.836 176.488 c 241.836 180.726 244.656
 184.312 248.512 185.48 c 244.656 186.648 241.836 190.238 241.836 194.476
 c 241.836 199.655 246.051 203.866 251.23 203.866 c 304.496 203.866 l 313.84
 203.866 322.52 199.261 327.754 191.534 c 346.441 191.534 l 346.441 152.191
 l 327.238 152.191 l 323.523 146.741 l 320.953 142.972 317.461 139.855 313.426
 137.722 c 301.219 131.28 l 301.219 109.167 l 301.219 103.991 297.008 99.78
 291.828 99.78 c h
291.828 99.78 m f
0.929412 0.717647 0.411765 rg
337.738 191.538 8.699 -39.34 re f
314.82 146.745 m 312.242 142.96 308.773 139.866 304.723 137.726 c 292.52
 131.284 l 292.52 109.171 l 292.52 105.566 290.469 102.429 287.477 100.855
 c 288.996 100.058 290.762 99.655 292.629 99.812 c 297.543 100.23 301.219
 104.55 301.219 109.484 c 301.219 131.288 l 313.426 137.73 l 317.477 139.866
 320.941 142.964 323.523 146.745 c 327.238 152.198 l 321.773 152.198 l 319.75
 152.198 317.855 151.198 316.715 149.527 c h
314.82 146.745 m f
0.192157 0.823529 0.968627 rg
345.641 148.956 m 345.641 196.32 l 345.641 198.788 347.641 200.788 350.109
 200.788 c 368.695 200.788 l 371.164 200.788 373.164 198.788 373.164 196.32
 c 373.164 148.956 l 373.164 146.488 371.164 144.488 368.695 144.488 c 350.109
 144.488 l 347.641 144.488 345.641 146.488 345.641 148.956 c h
345.641 148.956 m f
0.0745098 0.67451 0.909804 rg
363.871 154.78 m 361.402 154.78 359.402 156.78 359.402 159.249 c 359.402
 200.788 l 350.109 200.788 l 347.641 200.788 345.641 198.788 345.641 196.32
 c 345.641 148.956 l 345.641 146.488 347.641 144.488 350.109 144.488 c 368.695
 144.488 l 371.164 144.488 373.164 146.488 373.164 148.956 c 373.164 154.78
 l h
363.871 154.78 m f
1 0.811765 0.34902 rg
48.426 197.288 m 26.539 197.288 l 14.977 197.288 5.605 206.659 5.605 218.222
 c 5.605 344.148 l 5.605 355.71 14.977 365.081 26.539 365.081 c 211.293 
365.081 l 222.855 365.081 232.227 355.71 232.227 344.148 c 232.227 218.222
 l 232.227 206.659 222.855 197.288 211.293 197.288 c 74.68 197.288 l 55.008
 177.616 l 52.578 175.187 48.426 176.905 48.426 180.343 c h
48.426 197.288 m f
0.976471 0.74902 0.243137 rg
190.332 267.995 m 190.332 272.23 187.516 275.82 183.656 276.988 c 187.516
 278.155 190.332 281.745 190.332 285.98 c 190.332 291.159 186.121 295.374
 180.941 295.374 c 149.738 295.374 l 149.738 317.327 l 149.738 322.507 145.523
 326.722 140.344 326.722 c 135.168 326.722 130.953 322.507 130.953 317.327
 c 130.953 295.214 l 118.746 288.773 l 114.711 286.64 111.219 283.523 108.648
 279.753 c 104.934 274.304 l 86.531 274.304 l 86.531 276.644 l 86.531 279.609
 84.129 282.011 81.164 282.011 c 64.371 282.011 l 61.406 282.011 59.004 
279.609 59.004 276.644 c 59.004 231.077 l 59.004 228.113 61.41 225.71 64.371
 225.71 c 81.16 225.71 l 84.125 225.71 86.527 228.113 86.527 231.077 c 86.527
 234.96 l 104.414 234.96 l 109.652 227.234 118.328 222.628 127.672 222.628
 c 180.941 222.628 l 186.121 222.628 190.332 226.843 190.332 232.023 c 190.332
 236.257 187.516 239.847 183.656 241.015 c 187.516 242.183 190.332 245.773
 190.332 250.007 c 190.332 254.241 187.516 257.831 183.656 258.999 c 187.516
 260.171 190.332 263.761 190.332 267.995 c h
190.332 267.995 m f
0.980392 0.827451 0.576471 rg
114.312 235.113 m 104.969 235.113 96.289 239.718 91.055 247.445 c 72.367
 247.445 l 72.367 286.788 l 91.566 286.788 l 95.285 292.238 l 97.855 296.007
 101.344 299.124 105.383 301.257 c 117.59 307.698 l 117.59 329.808 l 117.59
 334.988 121.801 339.202 126.98 339.202 c 132.16 339.202 136.371 334.988
 136.371 329.808 c 136.371 307.855 l 167.578 307.855 l 172.758 307.855 176.969
 303.64 176.969 298.464 c 176.969 294.23 174.152 290.64 170.293 289.472 
c 174.152 288.304 176.969 284.714 176.969 280.476 c 176.969 276.241 174.152
 272.652 170.293 271.484 c 174.152 270.316 176.969 266.726 176.969 262.491
 c 176.969 258.257 174.152 254.667 170.293 253.499 c 174.152 252.331 176.969
 248.741 176.969 244.507 c 176.969 239.327 172.754 235.113 167.578 235.113
 c h
114.312 235.113 m f
0.929412 0.717647 0.411765 rg
72.367 286.784 10.617 -39.344 re f
105.902 292.238 m 108.48 296.023 111.949 299.116 116 301.257 c 124.273 
305.62 l 126.691 306.898 128.203 309.409 128.203 312.144 c 128.203 329.808
 l 128.203 333.019 129.824 335.855 132.289 337.55 c 130.531 338.761 128.34
 339.394 126 339.152 c 121.168 338.655 117.59 334.409 117.59 329.558 c 117.59
 307.695 l 105.383 301.253 l 101.332 299.116 97.863 296.019 95.285 292.234
 c 91.566 286.784 l 102.184 286.784 l h
105.902 292.238 m f
0.192157 0.823529 0.968627 rg
45.645 243.562 m 45.645 289.128 l 45.645 292.093 48.047 294.495 51.012 
294.495 c 67.801 294.495 l 70.766 294.495 73.168 292.093 73.168 289.128 
c 73.168 243.562 l 73.168 240.597 70.766 238.195 67.801 238.195 c 51.012
 238.195 l 48.047 238.195 45.645 240.597 45.645 243.562 c h
45.645 243.562 m f
0.0745098 0.67451 0.909804 rg
67.277 253.484 m 64.312 253.484 61.91 255.886 61.91 258.851 c 61.91 294.495
 l 51.012 294.495 l 48.047 294.495 45.645 292.093 45.645 289.128 c 45.645
 243.562 l 45.645 240.597 48.047 238.195 51.012 238.195 c 67.801 238.195
 l 70.766 238.195 73.168 240.597 73.168 243.562 c 73.168 253.484 l h
67.277 253.484 m f
0 g
179.574 253.499 m 181.461 256.003 182.578 259.12 182.578 262.491 c 182.578
 265.863 181.461 268.976 179.574 271.484 c 181.461 273.991 182.578 277.105
 182.578 280.476 c 182.578 283.847 181.461 286.96 179.574 289.468 c 181.461
 291.976 182.578 295.089 182.578 298.46 c 182.578 306.73 175.852 313.46 
167.578 313.46 c 141.98 313.46 l 141.98 329.808 l 141.98 338.081 135.254
 344.808 126.984 344.808 c 118.715 344.808 111.984 338.081 111.984 329.808
 c 111.984 311.077 l 102.77 306.214 l 97.926 303.655 93.738 299.913 90.656
 295.394 c 88.609 292.39 l 78.52 292.39 l 77.52 296.796 73.578 300.101 68.871
 300.101 c 49.938 300.101 l 44.48 300.101 40.039 295.659 40.039 290.198 
c 40.039 242.488 l 40.039 237.03 44.48 232.589 49.938 232.589 c 68.871 232.589
 l 74.113 232.589 78.402 236.683 78.738 241.839 c 88.25 241.839 l 94.613
 234.062 104.133 229.507 114.312 229.507 c 167.578 229.507 l 175.852 229.507
 182.578 236.234 182.578 244.503 c 182.578 247.874 181.461 250.991 179.574
 253.499 c h
66.762 244.601 m 52.051 244.601 l 52.051 288.089 l 66.762 288.089 l h
167.578 283.464 m 169.227 283.464 170.566 282.124 170.566 280.476 c 170.566
 278.831 169.227 277.491 167.578 277.491 c 164.262 277.491 161.574 274.8
 161.574 271.484 c 161.574 268.167 164.262 265.48 167.578 265.48 c 169.227
 265.48 170.566 264.14 170.566 262.491 c 170.566 260.847 169.227 259.503
 167.578 259.503 c 164.262 259.503 161.574 256.816 161.574 253.499 c 161.574
 250.183 164.262 247.495 167.578 247.495 c 169.227 247.495 170.566 246.152
 170.566 244.507 c 170.566 242.859 169.227 241.519 167.578 241.519 c 114.312
 241.519 l 107.043 241.519 100.297 245.128 96.266 251.179 c 95.152 252.851
 93.277 253.855 91.27 253.855 c 78.773 253.855 l 78.773 280.382 l 91.781
 280.382 l 93.766 280.382 95.625 281.363 96.742 283.003 c 100.578 288.628
 l 102.562 291.538 105.258 293.945 108.375 295.593 c 120.793 302.144 l 122.762
 303.187 123.996 305.23 123.996 307.456 c 123.996 329.808 l 123.996 331.456
 125.336 332.796 126.98 332.796 c 128.629 332.796 129.969 331.456 129.969
 329.808 c 129.969 307.456 l 129.969 304.14 132.656 301.448 135.973 301.448
 c 167.578 301.448 l 169.227 301.448 170.566 300.109 170.566 298.464 c 170.566
 296.816 169.227 295.476 167.578 295.476 c 164.262 295.476 161.574 292.788
 161.574 289.472 c 161.57 286.152 164.262 283.464 167.578 283.464 c h
167.578 283.464 m f
368.871 206.394 m 349.938 206.394 l 344.695 206.394 340.406 202.3 340.07
 197.144 c 330.559 197.144 l 324.195 204.921 314.676 209.476 304.496 209.476
 c 251.23 209.476 l 242.957 209.476 236.23 202.749 236.23 194.476 c 236.23
 191.105 237.348 187.991 239.234 185.484 c 237.348 182.976 236.23 179.863
 236.23 176.491 c 236.23 173.12 237.348 170.007 239.234 167.499 c 237.348
 164.991 236.23 161.878 236.23 158.507 c 236.23 155.136 237.348 152.023 
239.234 149.515 c 237.348 147.007 236.23 143.894 236.23 140.523 c 236.23
 132.253 242.957 125.523 251.23 125.523 c 276.828 125.523 l 276.828 109.175
 l 276.828 100.905 283.555 94.175 291.824 94.175 c 300.094 94.175 306.824
 100.905 306.824 109.175 c 306.824 127.909 l 316.039 132.773 l 320.883 135.327
 325.07 139.07 328.152 143.593 c 330.199 146.593 l 340.289 146.593 l 341.289
 142.187 345.23 138.886 349.934 138.886 c 368.867 138.886 l 374.328 138.886
 378.77 143.327 378.77 148.784 c 378.77 196.495 l 378.77 201.952 374.328
 206.394 368.871 206.394 c h
327.027 158.601 m 325.043 158.601 323.184 157.62 322.066 155.98 c 318.23
 150.359 l 316.246 147.445 313.551 145.038 310.434 143.394 c 298.016 136.839
 l 296.047 135.8 294.812 133.753 294.812 131.527 c 294.812 109.175 l 294.812
 107.527 293.473 106.187 291.828 106.187 c 290.18 106.187 288.84 107.527
 288.84 109.175 c 288.84 131.527 l 288.84 134.847 286.152 137.534 282.836
 137.534 c 251.227 137.534 l 249.582 137.534 248.242 138.874 248.242 140.523
 c 248.242 142.167 249.582 143.507 251.227 143.507 c 254.547 143.507 257.234
 146.195 257.234 149.515 c 257.234 152.831 254.547 155.519 251.227 155.519
 c 249.582 155.519 248.242 156.859 248.242 158.507 c 248.242 160.152 249.582
 161.495 251.227 161.495 c 254.547 161.495 257.234 164.183 257.234 167.499
 c 257.234 170.816 254.547 173.503 251.227 173.503 c 249.582 173.503 248.242
 174.843 248.242 176.491 c 248.242 178.136 249.582 179.48 251.227 179.48
 c 254.547 179.48 257.234 182.167 257.234 185.484 c 257.234 188.8 254.547
 191.491 251.227 191.491 c 249.582 191.491 248.242 192.831 248.242 194.476
 c 248.242 196.124 249.582 197.464 251.227 197.464 c 304.496 197.464 l 311.766
 197.464 318.512 193.855 322.543 187.804 c 323.656 186.132 325.531 185.132
 327.539 185.132 c 340.035 185.132 l 340.035 158.601 l h
366.758 150.894 m 352.047 150.894 l 352.047 194.382 l 366.758 194.382 l
 h
366.758 150.894 m f
380.555 267.14 m 237.832 267.14 l 237.832 344.148 l 237.832 358.804 225.949
 370.687 211.293 370.687 c 26.539 370.687 l 11.883 370.687 0 358.804 0 344.148
 c 0 218.222 l 0 203.566 11.883 191.683 26.539 191.683 c 42.82 191.683 l
 42.82 172.21 l 42.82 170.198 43.715 168.241 45.367 167.089 c 46.426 166.347
 47.633 165.991 48.824 165.991 c 50.387 165.991 51.922 166.605 53.07 167.753
 c 77.004 191.683 l 101.016 191.683 l 104.332 191.683 107.02 194.37 107.02
 197.691 c 107.02 201.007 104.332 203.695 101.016 203.695 c 74.516 203.695
 l 72.922 203.695 71.395 203.062 70.27 201.937 c 54.832 186.499 l 54.832
 197.691 l 54.832 201.007 52.141 203.695 48.824 203.695 c 26.539 203.695
 l 18.516 203.695 12.012 210.198 12.012 218.222 c 12.012 344.148 l 12.012
 352.171 18.516 358.675 26.539 358.675 c 211.293 358.675 l 219.316 358.675
 225.82 352.171 225.82 344.148 c 225.82 218.222 l 225.82 210.198 219.316
 203.695 211.293 203.695 c 140.094 203.695 l 136.777 203.695 134.09 201.007
 134.09 197.691 c 134.09 194.37 136.777 191.683 140.094 191.683 c 173.371
 191.683 l 173.371 96.788 l 173.371 80.745 186.375 67.741 202.414 67.741
 c 324.23 67.741 l 351.301 40.675 l 352.449 39.527 353.988 38.913 355.551
 38.913 c 356.738 38.913 357.945 39.269 359.008 40.011 c 360.656 41.163 
361.555 43.12 361.555 45.132 c 361.555 67.741 l 380.555 67.741 l 396.598
 67.741 409.602 80.745 409.602 96.788 c 409.602 238.093 l 409.602 254.136
 396.598 267.14 380.555 267.14 c h
397.59 96.788 m 397.59 87.398 389.945 79.753 380.555 79.753 c 355.547 79.753
 l 352.23 79.753 349.539 77.066 349.539 73.749 c 349.539 59.421 l 330.965
 77.995 l 329.84 79.12 328.312 79.753 326.719 79.753 c 202.414 79.753 l 
193.023 79.753 185.379 87.394 185.379 96.788 c 185.379 191.683 l 211.293
 191.683 l 225.926 191.683 237.832 203.589 237.832 218.222 c 237.832 255.128
 l 380.555 255.128 l 389.945 255.128 397.59 247.488 397.59 238.093 c h
397.59 96.788 m f
Q Q
showpage
%%Trailer
end restore
%%EOF
