%!PS-Adobe-3.0 EPSF-3.0
%%Creator: cairo 1.14.2 (http://cairographics.org)
%%CreationDate: Mon Feb 19 09:15:05 2018
%%Pages: 1
%%DocumentData: Clean7Bit
%%LanguageLevel: 2
%%BoundingBox: 3 -1 406 410
%%EndComments
%%BeginProlog
save
50 dict begin
/q { gsave } bind def
/Q { grestore } bind def
/cm { 6 array astore concat } bind def
/w { setlinewidth } bind def
/J { setlinecap } bind def
/j { setlinejoin } bind def
/M { setmiterlimit } bind def
/d { setdash } bind def
/m { moveto } bind def
/l { lineto } bind def
/c { curveto } bind def
/h { closepath } bind def
/re { exch dup neg 3 1 roll 5 3 roll moveto 0 rlineto
      0 exch rlineto 0 rlineto closepath } bind def
/S { stroke } bind def
/f { fill } bind def
/f* { eofill } bind def
/n { newpath } bind def
/W { clip } bind def
/W* { eoclip } bind def
/BT { } bind def
/ET { } bind def
/pdfmark where { pop globaldict /?pdfmark /exec load put }
    { globaldict begin /?pdfmark /pop load def /pdfmark
    /cleartomark load def end } ifelse
/BDC { mark 3 1 roll /BDC pdfmark } bind def
/EMC { mark /EMC pdfmark } bind def
/cairo_store_point { /cairo_point_y exch def /cairo_point_x exch def } def
/Tj { show currentpoint cairo_store_point } bind def
/TJ {
  {
    dup
    type /stringtype eq
    { show } { -0.001 mul 0 cairo_font_matrix dtransform rmoveto } ifelse
  } forall
  currentpoint cairo_store_point
} bind def
/cairo_selectfont { cairo_font_matrix aload pop pop pop 0 0 6 array astore
    cairo_font exch selectfont cairo_point_x cairo_point_y moveto } bind def
/Tf { pop /cairo_font exch def /cairo_font_matrix where
      { pop cairo_selectfont } if } bind def
/Td { matrix translate cairo_font_matrix matrix concatmatrix dup
      /cairo_font_matrix exch def dup 4 get exch 5 get cairo_store_point
      /cairo_font where { pop cairo_selectfont } if } bind def
/Tm { 2 copy 8 2 roll 6 array astore /cairo_font_matrix exch def
      cairo_store_point /cairo_font where { pop cairo_selectfont } if } bind def
/g { setgray } bind def
/rg { setrgbcolor } bind def
/d1 { setcachedevice } bind def
%%EndProlog
%%BeginSetup
%%EndSetup
%%Page: 1 1
%%BeginPageSetup
%%PageBoundingBox: 3 -1 406 410
%%EndPageSetup
q 3 -1 403 411 rectclip q
1 0.384314 0.654902 rg
57.578 277.596 m 26.613 277.596 l 17.344 277.596 9.801 285.139 9.801 294.413
 c 9.801 303.682 17.344 311.225 26.613 311.225 c 76.988 311.225 l 86.258
 311.225 93.801 303.682 93.801 294.413 c 93.801 285.139 86.258 277.596 76.988
 277.596 c 66.398 277.596 l 61.984 273.186 l h
57.578 277.596 m f
0.988235 0.329412 0.47451 rg
27 280.237 m 27 289.506 34.543 297.049 43.812 297.049 c 93.57 297.049 l
 92.301 305.069 85.359 311.225 76.988 311.225 c 26.613 311.225 l 17.344 
311.225 9.801 303.682 9.801 294.409 c 9.801 285.139 17.344 277.596 26.613
 277.596 c 27.23 277.596 l 27.09 278.459 27 279.334 27 280.237 c h
27 280.237 m f
1 0.384314 0.654902 rg
316.316 57.069 m 304.574 57.069 295.059 66.799 295.41 78.62 c 295.746 89.998
 305.379 98.905 316.762 98.905 c 329.52 98.905 l 333.73 106.885 l 334.297
 107.959 335.836 107.959 336.402 106.885 c 340.613 98.905 l 378.84 98.905
 l 390.219 98.905 399.855 89.998 400.191 78.62 c 400.543 66.799 391.027 
57.069 379.281 57.069 c h
316.316 57.069 m f
0.988235 0.329412 0.47451 rg
338.801 68.069 m 327.055 68.069 317.539 77.799 317.891 89.62 c 317.992 
92.987 318.91 96.135 320.445 98.905 c 316.762 98.905 l 305.379 98.905 295.746
 89.998 295.41 78.62 c 295.059 66.799 304.574 57.069 316.316 57.069 c 379.281
 57.069 l 387.23 57.069 394.152 61.526 397.691 68.069 c h
338.801 68.069 m f
1 0.811765 0.34902 rg
33 5.6 m 19.75 5.6 9.016 16.577 9.41 29.916 c 9.793 42.752 20.66 52.799
 33.504 52.799 c 133.469 52.799 l 140.945 92.225 l 141.246 93.799 143.523
 93.752 143.75 92.163 c 148.004 62.545 l 149.348 52.799 l 168.496 52.799
 l 181.34 52.799 192.207 42.752 192.59 29.916 c 192.984 16.577 182.25 5.6
 169 5.6 c h
33 5.6 m f
1 0.709804 0.360784 rg
63.801 20.873 m 50.551 20.873 39.812 31.854 40.211 45.19 c 40.289 47.873
 40.832 50.428 41.75 52.799 c 33.504 52.799 l 20.66 52.799 9.793 42.752 
9.41 29.916 c 9.016 16.577 19.75 5.6 33 5.6 c 169 5.6 l 179.082 5.6 187.703
 11.959 191.078 20.873 c h
63.801 20.873 m f
1 0.811765 0.34902 rg
255.816 322.241 m 251.051 356.799 l 231.902 356.799 l 219.059 356.799 208.191
 366.85 207.809 379.686 c 207.414 393.022 218.148 403.998 231.398 403.998
 c 366.898 403.998 l 379.738 403.998 390.609 393.952 390.988 381.112 c 391.387
 367.776 380.652 356.799 367.398 356.799 c 266.93 356.799 l 265.023 346.737
 l 260.047 322.108 l 259.57 319.741 256.148 319.846 255.816 322.241 c h
255.816 322.241 m f
1 0.709804 0.360784 rg
231.809 363.756 m 231.414 377.092 242.148 388.073 255.398 388.073 c 389.695
 388.073 l 386.41 397.401 377.301 403.998 366.898 403.998 c 231.398 403.998
 l 218.148 403.998 207.414 393.022 207.809 379.686 c 208.191 366.85 219.062
 356.799 231.902 356.799 c 233.105 356.799 l 232.336 358.987 231.883 361.319
 231.809 363.756 c h
231.809 363.756 m f
0.192157 0.823529 0.968627 rg
202.602 82.799 m 135.992 82.799 81.801 136.991 81.801 203.6 c 81.801 270.209
 135.992 324.401 202.602 324.401 c 269.211 324.401 323.398 270.209 323.398
 203.6 c 323.398 136.991 269.211 82.799 202.602 82.799 c h
202.602 82.799 m f
0.0745098 0.67451 0.909804 rg
276.574 118.483 m 209.965 118.483 155.773 172.67 155.773 239.28 c 155.773
 272.147 168.969 301.979 190.336 323.78 c 129.465 317.616 81.801 266.069
 81.801 203.6 c 81.801 136.991 135.992 82.799 202.602 82.799 c 236.348 82.799
 266.898 96.713 288.836 119.1 c 284.805 118.69 280.711 118.483 276.574 118.483
 c h
276.574 118.483 m f
0.0392157 0.6 0.490196 rg
160.184 180.705 m 160.184 178.248 152 176.256 141.902 176.256 c 131.809
 176.256 123.625 178.248 123.625 180.705 c 123.625 183.159 131.809 185.151
 141.902 185.151 c 152 185.151 160.184 183.159 160.184 180.705 c h
160.184 180.705 m f
180.121 279.37 m 180.121 276.127 169.32 273.498 156 273.498 c 142.68 273.498
 131.879 276.127 131.879 279.37 c 131.879 282.608 142.68 285.237 156 285.237
 c 169.32 285.237 180.121 282.608 180.121 279.37 c h
180.121 279.37 m f
1 0.313726 0.490196 rg
141.863 180.342 m 135.449 187.416 127.809 197.26 127.809 204.006 c 127.809
 214.37 136.238 222.799 146.602 222.799 c 156.961 222.799 165.395 214.37
 165.395 204.006 c 165.395 196.862 156.59 186.112 151.34 180.338 c 148.801
 177.541 144.402 177.541 141.863 180.342 c h
141.863 180.342 m f
0.937255 0.0941176 0.27451 rg
159.395 204.006 m 159.395 196.944 153.664 191.213 146.602 191.213 c 139.535
 191.213 133.809 196.944 133.809 204.006 c 133.809 211.073 139.535 216.799
 146.602 216.799 c 153.664 216.799 159.395 211.073 159.395 204.006 c h
159.395 204.006 m f
146.602 204.006 m 146.602 210.948 150.387 217.018 155.996 220.272 c 153.23
 221.877 150.023 222.799 146.602 222.799 c 136.238 222.799 127.809 214.37
 127.809 204.006 c 127.809 197.264 135.453 187.416 141.863 180.342 c 144.402
 177.541 148.797 177.541 151.34 180.334 c 152.723 181.858 154.348 183.721
 156 185.776 c 151.043 191.92 146.602 198.866 146.602 204.006 c h
146.602 204.006 m f
0.705882 0.901961 0.431373 rg
202.57 121.549 m 202.91 123.737 203.977 125.784 205.578 127.315 c 224.062
 145.014 l 225.961 146.834 228.449 147.834 231.07 147.834 c 233.285 147.834
 235.48 147.088 237.25 145.729 c 247.414 137.913 l 251.035 135.131 252.348
 130.237 250.609 126.014 c 244.34 110.811 l 266.055 100.002 l 254.145 94.362
 l 238.426 86.916 221.594 83.034 204.109 82.819 c 196.547 82.725 l h
202.57 121.549 m f
0.627451 0.843137 0.333333 rg
244.34 110.815 m 248.828 121.702 l 236.52 124.604 224.934 129.397 214.391
 135.752 c 205.578 127.319 l 203.977 125.788 202.91 123.737 202.57 121.549
 c 196.578 82.952 l 198.574 82.854 200.582 82.799 202.602 82.799 c 203.133
 82.799 203.66 82.815 204.191 82.823 c 205.215 82.834 206.238 82.862 207.258
 82.901 c 207.336 82.901 207.418 82.905 207.496 82.909 c 208.461 82.948 
209.426 82.998 210.391 83.057 c 210.539 83.069 210.695 83.077 210.844 83.088
 c 211.707 83.147 212.57 83.213 213.43 83.291 c 213.688 83.315 213.945 83.334
 214.199 83.362 c 214.938 83.432 215.672 83.51 216.402 83.592 c 216.777 
83.635 217.152 83.678 217.523 83.725 c 218.121 83.795 218.719 83.877 219.312
 83.963 c 219.809 84.03 220.301 84.096 220.793 84.17 c 221.25 84.241 221.703
 84.319 222.16 84.393 c 222.777 84.491 223.395 84.592 224.004 84.702 c 224.312
 84.756 224.617 84.819 224.922 84.873 c 225.668 85.014 226.41 85.155 227.152
 85.307 c 227.289 85.338 227.426 85.37 227.562 85.397 c 232.211 86.381 236.762
 87.631 241.199 89.131 c 241.418 89.205 241.637 89.276 241.855 89.35 c 242.406
 89.541 242.957 89.741 243.504 89.94 c 243.957 90.104 244.41 90.264 244.859
 90.436 c 245.289 90.596 245.715 90.764 246.141 90.928 c 246.711 91.151 
247.281 91.373 247.852 91.604 c 248.203 91.745 248.555 91.897 248.906 92.041
 c 249.539 92.307 250.176 92.573 250.805 92.85 c 251.121 92.987 251.434 
93.127 251.746 93.268 c 252.395 93.557 253.047 93.854 253.691 94.159 c 257.68
 96.03 261.547 98.108 265.285 100.385 c h
244.34 110.815 m f
124.238 111.737 m 106.207 127.143 93.191 147.241 86.602 169.858 c 84.219
 178.038 l 119.504 178.077 l 122.504 178.077 125.449 177.065 127.805 175.225
 c 145.762 161.209 l 148.988 158.69 150.875 154.901 150.941 150.807 c 151.008
 146.717 149.242 142.866 146.098 140.245 c 144.445 138.87 143.164 137.08
 142.391 135.077 c 131.113 105.87 l h
124.238 111.737 m f
0.705882 0.901961 0.431373 rg
319.473 234.163 m 316.395 245.909 l 269.906 261.33 l 244.754 253.725 l 
238.734 251.905 234.34 246.698 233.559 240.459 c 229.871 210.936 l 229.277
 206.186 230.824 201.471 234.121 197.998 c 247.199 184.217 l 250.191 181.061
 254.395 179.248 258.734 179.248 c 259.082 179.248 259.426 179.26 259.766
 179.284 c 264.488 179.584 268.805 181.948 271.602 185.772 c 277.84 194.295
 l 280.734 198.252 285.164 200.522 289.996 200.522 c 292.438 200.522 294.797
 199.94 297.008 198.791 c 307.648 193.276 l 319.93 167.069 l 322.559 189.354
 l 323.117 194.1 323.402 198.893 323.402 203.6 c 323.398 213.928 322.078
 224.209 319.473 234.163 c h
319.473 234.163 m f
0.627451 0.843137 0.333333 rg
311.656 226.928 m 311.656 223.686 300.855 221.061 287.535 221.061 c 274.215
 221.061 263.414 223.686 263.414 226.928 c 263.414 230.17 274.215 232.795
 287.535 232.795 c 300.855 232.795 311.656 230.17 311.656 226.928 c h
311.656 226.928 m f
1 0.313726 0.490196 rg
293.168 228.913 m 286.871 235.514 266.324 258.135 266.324 272.123 c 266.324
 289.479 280.441 303.6 297.801 303.6 c 315.156 303.6 329.277 289.479 329.277
 272.123 c 329.277 258.135 308.727 235.514 302.43 228.913 c 299.91 226.268
 295.691 226.268 293.168 228.913 c h
293.168 228.913 m f
0.937255 0.0941176 0.27451 rg
297.801 252.041 m 286.727 252.041 277.719 261.049 277.719 272.123 c 277.719
 283.198 286.727 292.205 297.801 292.205 c 308.871 292.205 317.883 283.198
 317.883 272.123 c 317.883 261.049 308.871 252.041 297.801 252.041 c h
297.801 252.041 m f
298.953 272.123 m 298.953 283.51 305.031 293.506 314.113 299.034 c 309.355
 301.932 303.77 303.6 297.801 303.6 c 280.441 303.6 266.324 289.479 266.324
 272.123 c 266.324 258.135 286.871 235.51 293.168 228.913 c 293.172 228.909
 l 295.691 226.268 299.91 226.268 302.43 228.909 c 302.43 228.913 l 304.867
 231.463 309.434 236.413 314.117 242.33 c 306.684 251.721 298.953 263.541
 298.953 272.123 c h
298.953 272.123 m f
1 g
297.801 259.01 m 290.57 259.01 284.688 264.893 284.688 272.123 c 284.688
 279.354 290.57 285.237 297.801 285.237 c 305.031 285.237 310.914 279.354
 310.914 272.123 c 310.914 264.893 305.031 259.01 297.801 259.01 c h
297.801 259.01 m f
0.705882 0.901961 0.431373 rg
181.508 242.397 m 177.047 242.397 172.863 244.147 169.719 247.319 c 166.258
 250.819 164.535 255.635 164.992 260.538 c 165.266 263.471 164.715 266.413
 163.402 269.053 c 152.492 290.936 l 155.426 294.174 l 160.98 300.311 168.781
 309.596 174.402 318.995 c 175.852 321.416 l 178.621 321.979 l 185 323.276
 191.5 324.057 197.938 324.307 c 207.098 324.659 l 198.766 298.92 l 203.055
 296.666 l 210.156 292.932 213.566 284.666 211.164 277.01 c 208.711 269.186
 l 208.059 267.108 207.844 264.955 208.074 262.788 c 208.195 261.631 l 208.668
 257.178 207.367 252.819 204.523 249.354 c 201.68 245.889 197.66 243.76 
193.195 243.354 c 187.973 242.877 l 182.887 242.455 l 182.43 242.416 181.965
 242.397 181.508 242.397 c h
181.508 242.397 m f
0.627451 0.843137 0.333333 rg
156 285.237 m 155.777 285.237 155.559 285.233 155.336 285.233 c 161.117
 273.631 l 171.98 274.205 180.121 276.553 180.121 279.366 c 180.121 282.608
 169.32 285.237 156 285.237 c h
156 285.237 m f
190.316 323.764 m 186.402 323.358 182.488 322.764 178.621 321.979 c 176.105
 321.471 l 176.02 321.452 175.934 321.428 175.844 321.409 c 174.402 318.995
 l 168.781 309.6 160.98 300.311 155.426 294.174 c 152.492 290.936 l 160.891
 274.088 l 166.598 293.006 176.824 309.991 190.316 323.764 c h
190.316 323.764 m f
1 0.313726 0.490196 rg
141.988 288.475 m 134.719 296.034 111 321.948 111 337.998 c 111 357.631
 126.969 373.6 146.602 373.6 c 166.23 373.6 182.199 357.631 182.199 337.998
 c 182.199 321.948 158.48 296.034 151.215 288.475 c 148.695 285.858 144.504
 285.858 141.988 288.475 c h
141.988 288.475 m f
0.937255 0.0941176 0.27451 rg
146.602 313.807 m 133.258 313.807 122.406 324.659 122.406 337.998 c 122.406
 351.342 133.258 362.194 146.602 362.194 c 159.941 362.194 170.793 351.342
 170.793 337.998 c 170.793 324.659 159.941 313.807 146.602 313.807 c h
146.602 313.807 m f
143.633 337.998 m 143.633 351.752 151.473 363.698 162.914 369.623 c 158.023
 372.159 152.477 373.6 146.602 373.6 c 126.969 373.6 111 357.631 111 337.998
 c 111 321.948 134.719 296.034 141.988 288.475 c 144.504 285.858 148.695
 285.858 151.211 288.475 c 153.711 291.077 158.156 295.846 162.914 301.639
 c 153.84 312.694 143.633 327.467 143.633 337.998 c h
143.633 337.998 m f
1 g
146.602 323.202 m 138.438 323.202 131.801 329.838 131.801 337.998 c 131.801
 346.163 138.438 352.799 146.602 352.799 c 154.762 352.799 161.398 346.163
 161.398 337.998 c 161.398 329.838 154.762 323.202 146.602 323.202 c h
146.602 323.202 m f
154.125 204.006 m 154.125 199.854 150.754 196.483 146.602 196.483 c 142.445
 196.483 139.074 199.854 139.074 204.006 c 139.074 208.163 142.445 211.534
 146.602 211.534 c 150.754 211.534 154.125 208.163 154.125 204.006 c h
154.125 204.006 m f
0 g
26.613 271.998 m 53.934 271.998 l 56.844 265.823 l 57.832 263.713 59.953
 262.373 62.27 262.373 c 62.32 262.373 62.371 262.377 62.418 262.377 c 64.797
 262.436 66.914 263.893 67.82 266.092 c 70.25 271.998 l 76.988 271.998 l
 89.344 271.998 99.402 282.053 99.402 294.409 c 99.402 306.768 89.348 316.823
 76.988 316.823 c 26.613 316.823 l 14.254 316.823 4.199 306.768 4.199 294.409
 c 4.199 282.053 14.254 271.998 26.613 271.998 c h
26.613 304.827 m 76.988 304.827 l 82.73 304.827 87.402 300.155 87.402 294.413
 c 87.402 288.67 82.73 283.998 76.988 283.998 c 66.234 283.998 l 64.609 
283.998 63.094 283.342 61.988 282.237 c 60.879 283.346 59.363 283.998 57.742
 283.998 c 26.613 283.998 l 20.871 283.998 16.199 288.67 16.199 294.413 
c 16.199 300.155 20.871 304.827 26.613 304.827 c h
26.613 304.827 m f
379.281 104.502 m 344.18 104.502 l 340.141 113.084 l 339.129 115.237 336.926
 116.596 334.562 116.53 c 332.188 116.471 330.07 115.014 329.164 112.815
 c 325.742 104.502 l 316.316 104.502 l 301.695 104.502 289.801 92.608 289.801
 77.987 c 289.801 63.366 301.695 51.471 316.316 51.471 c 379.281 51.471 
l 393.906 51.471 405.801 63.366 405.801 77.987 c 405.801 92.608 393.906 
104.502 379.281 104.502 c h
379.281 63.471 m 316.316 63.471 l 308.312 63.471 301.801 69.983 301.801
 77.987 c 301.801 85.991 308.312 92.502 316.316 92.502 c 329.762 92.502 
l 332 92.502 334.035 93.748 335.066 95.702 c 336.102 93.741 338.141 92.502
 340.371 92.502 c 379.285 92.502 l 387.289 92.502 393.801 85.991 393.801
 77.987 c 393.801 69.983 387.289 63.471 379.281 63.471 c h
379.281 63.471 m f
367.398 409.6 m 231.949 409.6 l 216.004 409.6 202.586 397.045 202.207 381.104
 c 201.82 364.682 215.066 351.202 231.398 351.202 c 246.172 351.202 l 250.391
 320.608 l 235.641 326.655 219.504 329.998 202.602 329.998 c 197.027 329.998
 191.543 329.62 186.164 328.909 c 187.203 332.077 187.801 335.143 187.801
 337.998 c 187.801 360.717 169.316 379.202 146.602 379.202 c 123.883 379.202
 105.398 360.717 105.398 337.998 c 105.398 327.1 114.055 313.205 123.031
 301.721 c 111.719 292.53 102.02 281.424 94.426 268.905 c 93.012 266.573
 93.402 263.569 95.34 261.643 c 95.371 261.612 95.402 261.584 95.43 261.557
 c 98.148 258.858 102.684 259.377 104.668 262.655 c 111.566 274.049 120.395
 284.147 130.695 292.498 c 136.379 286.034 141.125 281.354 142.422 280.096
 c 143.586 278.963 145.094 278.401 146.602 278.401 c 148.105 278.401 149.613
 278.963 150.777 280.096 c 150.926 280.237 151.125 280.432 151.359 280.659
 c 158.391 266.553 l 159.23 264.87 159.598 262.983 159.422 261.108 c 158.793
 254.538 161.098 248.073 165.738 243.381 c 169.934 239.143 175.594 236.799
 181.5 236.799 c 182.113 236.799 182.73 236.823 183.348 236.877 c 193.699
 237.776 l 199.539 238.307 204.812 241.045 208.598 245.498 c 212.633 250.248
 214.363 256.541 213.707 262.737 c 213.641 263.385 l 213.492 264.776 213.633
 266.178 214.051 267.51 c 216.508 275.33 l 219.719 285.573 215.156 296.631
 205.656 301.623 c 205.543 301.682 l 210.73 317.709 l 232.641 316.163 252.867
 308.424 269.66 296.229 c 264.098 289.741 260.723 281.323 260.723 272.123
 c 260.723 269.799 261.164 267.327 261.934 264.772 c 243.129 259.084 l 234.996
 256.627 229.059 249.588 228 241.151 c 224.312 211.627 l 223.508 205.209
 225.602 198.838 230.055 194.143 c 243.133 180.358 l 247.539 175.713 253.738
 173.284 260.121 173.694 c 266.508 174.1 272.34 177.295 276.121 182.463 
c 282.359 190.987 l 285.133 194.78 290.258 195.983 294.43 193.819 c 303.379
 189.178 l 312.121 170.53 l 304.141 144.155 286.883 121.772 264.152 107.209
 c 251.508 113.502 l 255.785 123.881 l 258.488 130.436 256.449 138.034 250.828
 142.354 c 240.664 150.17 l 234.457 154.94 225.844 154.475 220.191 149.061
 c 201.707 131.362 l 199.223 128.987 197.566 125.807 197.039 122.409 c 191.961
 89.698 l 172.211 91.53 153.898 98.397 138.332 109.01 c 147.613 133.061 
l 148.047 134.178 148.762 135.174 149.684 135.944 c 154.328 139.815 156.848
 145.58 156.516 151.655 c 156.207 157.284 153.277 162.448 148.832 165.916
 c 131.25 179.639 l 127.898 182.256 123.77 183.674 119.52 183.674 c 119.5
 183.674 l 89.949 183.643 l 88.805 190.127 88.203 196.795 88.203 203.6 c
 88.203 210.881 88.895 217.998 90.203 224.905 c 90.566 226.819 89.953 228.791
 88.578 230.17 c 88.543 230.205 88.508 230.245 88.469 230.28 c 85.102 233.666
 79.312 231.889 78.422 227.202 c 76.965 219.553 76.203 211.663 76.203 203.6
 c 76.203 158.323 100.133 118.541 136.004 96.213 c 128.832 58.401 l 33.547
 58.401 l 17.602 58.401 4.188 45.846 3.809 29.905 c 3.422 13.483 16.664 
-0.002 33 -0.002 c 168.453 -0.002 l 184.398 -0.002 197.812 12.557 198.191
 28.495 c 198.578 44.916 185.336 58.401 169 58.401 c 154.227 58.401 l 150.055
 88.651 l 166.23 81.229 184.227 77.116 203.176 77.202 c 270.867 77.506 326.734
 131.776 328.934 199.436 c 329.438 215.038 327.086 230.03 322.383 243.952
 c 329.109 253.237 334.875 263.663 334.875 272.123 c 334.875 292.569 318.242
 309.202 297.801 309.202 c 290.988 309.202 284.605 307.346 279.117 304.131
 c 274.477 307.67 269.582 310.901 264.473 313.784 c 271.57 351.202 l 366.852
 351.202 l 382.797 351.202 396.215 363.756 396.59 379.698 c 396.98 396.116
 383.734 409.6 367.398 409.6 c h
146.602 292.913 m 133.891 306.131 117.398 326.967 117.398 337.998 c 117.398
 354.1 130.5 367.202 146.602 367.202 c 162.699 367.202 175.801 354.1 175.801
 337.998 c 175.801 326.967 159.309 306.131 146.602 292.913 c h
205.059 278.924 m 202.602 271.104 l 201.684 268.182 201.383 265.155 201.707
 262.108 c 201.828 260.959 l 202.121 258.221 201.32 255.541 199.574 253.413
 c 197.828 251.284 195.355 249.975 192.613 249.725 c 187.391 249.252 l 182.359
 248.834 l 179.34 248.584 176.395 249.674 174.27 251.823 c 172.141 253.971
 171.082 256.932 171.363 259.94 c 171.746 264.065 170.977 268.202 169.129
 271.905 c 160.172 289.881 l 166.309 296.663 174.133 306.08 179.891 315.698
 c 185.836 316.913 191.945 317.663 198.184 317.905 c 192.574 300.573 l 191.672
 297.795 192.906 294.772 195.488 293.413 c 200.074 291.002 l 204.438 288.709
 206.535 283.627 205.059 278.924 c h
128.398 116.604 m 111.648 130.913 99.066 149.955 92.746 171.647 c 119.508
 171.674 l 119.516 171.674 l 121.086 171.674 122.629 171.143 123.863 170.178
 c 141.824 156.163 l 143.516 154.842 144.508 152.85 144.539 150.705 c 144.574
 148.557 143.648 146.538 142 145.163 c 139.512 143.088 137.582 140.397 136.418
 137.381 c h
169 46.401 m 178.484 46.401 186.199 38.686 186.199 29.202 c 186.199 19.717
 178.484 11.998 169 11.998 c 33 11.998 l 23.516 11.998 15.801 19.717 15.801
 29.202 c 15.801 38.686 23.516 46.401 33 46.401 c 133.801 46.401 l 136.684
 46.401 139.156 48.452 139.695 51.284 c 141.664 61.67 l 143.055 51.58 l 
143.465 48.612 146.004 46.401 149 46.401 c h
204.031 89.217 m 208.895 120.569 l 209.02 121.373 209.414 122.131 210.004
 122.694 c 228.488 140.393 l 229.828 141.678 231.871 141.788 233.348 140.655
 c 243.512 132.842 l 244.848 131.815 245.332 130.01 244.691 128.455 c 238.281
 112.909 l 237.082 109.998 238.336 106.655 241.156 105.252 c 251.406 100.147
 l 237 93.327 220.953 89.428 204.031 89.217 c h
316.199 190.1 m 313.383 196.112 l 312.824 197.307 311.883 198.284 310.711
 198.893 c 299.953 204.471 l 290.461 209.393 278.988 206.702 272.672 198.073
 c 266.434 189.549 l 264.762 187.264 262.184 185.846 259.355 185.666 c 256.535
 185.483 253.789 186.561 251.84 188.616 c 238.762 202.401 l 236.789 204.479
 235.863 207.299 236.219 210.139 c 239.91 239.663 l 240.375 243.397 243.004
 246.51 246.602 247.596 c 266.867 253.725 l 275.707 238.163 291.234 222.807
 293.621 220.495 c 294.781 219.362 296.293 218.799 297.797 218.799 c 299.305
 218.799 300.812 219.362 301.977 220.495 c 303.195 221.674 307.848 226.268
 313.285 232.545 c 315.707 223.295 317 213.596 317 203.6 c 317 199.034 316.723
 194.53 316.199 190.1 c h
297.801 297.202 m 311.629 297.202 322.879 285.952 322.879 272.123 c 322.879
 262.725 308.863 244.924 297.801 233.33 c 286.734 244.924 272.723 262.725
 272.723 272.123 c 272.723 285.952 283.973 297.202 297.801 297.202 c h
367.398 363.202 m 266.602 363.202 l 263.719 363.202 261.242 361.151 260.707
 358.319 c 258.734 347.932 l 257.344 358.018 l 256.934 360.987 254.398 363.198
 251.398 363.198 c 231.398 363.198 l 221.914 363.198 214.199 370.916 214.199
 380.401 c 214.199 389.881 221.914 397.6 231.398 397.6 c 367.398 397.6 l
 376.883 397.6 384.602 389.881 384.602 380.401 c 384.602 370.916 376.883
 363.202 367.398 363.202 c h
367.398 363.202 m f
167 337.998 m 167 349.248 157.848 358.401 146.602 358.401 c 135.352 358.401
 126.199 349.248 126.199 337.998 c 126.199 326.752 135.352 317.6 146.602
 317.6 c 157.848 317.6 167 326.752 167 337.998 c h
138.199 337.998 m 138.199 342.631 141.969 346.401 146.602 346.401 c 151.23
 346.401 155 342.631 155 337.998 c 155 333.37 151.23 329.6 146.602 329.6
 c 141.969 329.6 138.199 333.37 138.199 337.998 c h
138.199 337.998 m f
297.801 253.409 m 308.117 253.409 316.512 261.803 316.512 272.123 c 316.512
 282.44 308.121 290.834 297.801 290.834 c 287.48 290.834 279.086 282.44 
279.086 272.123 c 279.086 261.803 287.48 253.409 297.801 253.409 c h
297.801 278.834 m 301.5 278.834 304.512 275.823 304.512 272.123 c 304.512
 268.42 301.5 265.409 297.801 265.409 c 294.098 265.409 291.086 268.42 291.086
 272.123 c 291.086 275.823 294.098 278.834 297.801 278.834 c h
297.801 278.834 m f
142.422 171.694 m 143.586 170.565 145.094 169.998 146.602 169.998 c 148.105
 169.998 149.613 170.565 150.777 171.694 c 154.156 174.971 170.992 191.924
 170.992 204.006 c 170.992 217.459 160.051 228.401 146.602 228.401 c 133.152
 228.401 122.207 217.459 122.207 204.006 c 122.207 191.924 139.047 174.971
 142.422 171.694 c h
146.602 216.401 m 153.434 216.401 158.992 210.842 158.992 204.006 c 158.992
 200.256 153.148 191.838 146.605 184.643 c 140.516 191.358 134.207 199.983
 134.207 204.006 c 134.207 210.842 139.766 216.401 146.602 216.401 c h
146.602 216.401 m f
154.125 204.006 m 154.125 199.854 150.754 196.483 146.602 196.483 c 142.445
 196.483 139.074 199.854 139.074 204.006 c 139.074 208.163 142.445 211.534
 146.602 211.534 c 150.754 211.534 154.125 208.163 154.125 204.006 c h
154.125 204.006 m f
Q Q
showpage
%%Trailer
end restore
%%EOF
