%!PS-Adobe-3.0 EPSF-3.0
%%Creator: cairo 1.14.2 (http://cairographics.org)
%%CreationDate: Mon Feb 19 09:15:05 2018
%%Pages: 1
%%DocumentData: Clean7Bit
%%LanguageLevel: 2
%%BoundingBox: 0 74 410 336
%%EndComments
%%BeginProlog
save
50 dict begin
/q { gsave } bind def
/Q { grestore } bind def
/cm { 6 array astore concat } bind def
/w { setlinewidth } bind def
/J { setlinecap } bind def
/j { setlinejoin } bind def
/M { setmiterlimit } bind def
/d { setdash } bind def
/m { moveto } bind def
/l { lineto } bind def
/c { curveto } bind def
/h { closepath } bind def
/re { exch dup neg 3 1 roll 5 3 roll moveto 0 rlineto
      0 exch rlineto 0 rlineto closepath } bind def
/S { stroke } bind def
/f { fill } bind def
/f* { eofill } bind def
/n { newpath } bind def
/W { clip } bind def
/W* { eoclip } bind def
/BT { } bind def
/ET { } bind def
/pdfmark where { pop globaldict /?pdfmark /exec load put }
    { globaldict begin /?pdfmark /pop load def /pdfmark
    /cleartomark load def end } ifelse
/BDC { mark 3 1 roll /BDC pdfmark } bind def
/EMC { mark /EMC pdfmark } bind def
/cairo_store_point { /cairo_point_y exch def /cairo_point_x exch def } def
/Tj { show currentpoint cairo_store_point } bind def
/TJ {
  {
    dup
    type /stringtype eq
    { show } { -0.001 mul 0 cairo_font_matrix dtransform rmoveto } ifelse
  } forall
  currentpoint cairo_store_point
} bind def
/cairo_selectfont { cairo_font_matrix aload pop pop pop 0 0 6 array astore
    cairo_font exch selectfont cairo_point_x cairo_point_y moveto } bind def
/Tf { pop /cairo_font exch def /cairo_font_matrix where
      { pop cairo_selectfont } if } bind def
/Td { matrix translate cairo_font_matrix matrix concatmatrix dup
      /cairo_font_matrix exch def dup 4 get exch 5 get cairo_store_point
      /cairo_font where { pop cairo_selectfont } if } bind def
/Tm { 2 copy 8 2 roll 6 array astore /cairo_font_matrix exch def
      cairo_store_point /cairo_font where { pop cairo_selectfont } if } bind def
/g { setgray } bind def
/rg { setrgbcolor } bind def
/d1 { setcachedevice } bind def
%%EndProlog
%%BeginSetup
%%EndSetup
%%Page: 1 1
%%BeginPageSetup
%%PageBoundingBox: 0 74 410 336
%%EndPageSetup
q 0 74 410 262 rectclip q
0.909804 0.882353 0.839216 rg
389.102 329.33 m 88.945 329.33 l 80.734 329.33 74.051 322.647 74.051 314.436
 c 74.051 95.166 l 74.051 86.952 80.734 80.272 88.945 80.272 c 389.102 80.272
 l 397.312 80.272 403.996 86.955 403.996 95.166 c 403.996 314.436 l 403.996
 322.647 397.312 329.33 389.102 329.33 c h
389.102 329.33 m f
0.886275 0.8 0.686275 rg
121.82 95.166 m 121.82 314.436 l 121.82 322.647 128.504 329.33 136.715 
329.33 c 88.945 329.33 l 80.73 329.33 74.051 322.647 74.051 314.436 c 74.051
 95.166 l 74.051 86.952 80.734 80.272 88.945 80.272 c 136.715 80.272 l 128.504
 80.272 121.82 86.952 121.82 95.166 c h
121.82 95.166 m f
201.34 209.475 m 201.34 216.538 195.594 222.288 188.527 222.288 c 145.312
 222.288 l 145.312 252.737 l 145.312 259.799 139.566 265.545 132.5 265.545
 c 125.438 265.545 119.691 259.799 119.691 252.737 c 119.691 222.127 l 102.766
 213.194 l 97.219 210.268 92.418 205.979 88.883 200.795 c 83.711 193.209
 l 74.051 193.209 l 74.051 139.217 l 83 139.217 l 90.191 128.557 102.145
 122.198 115.02 122.198 c 188.527 122.198 l 195.594 122.198 201.34 127.944
 201.34 135.006 c 201.34 140.975 197.242 145.998 191.711 147.42 c 197.242
 148.838 201.34 153.866 201.34 159.83 c 201.34 165.795 197.242 170.823 191.711
 172.241 c 197.242 173.659 201.34 178.686 201.34 184.651 c 201.34 190.616
 197.242 195.643 191.711 197.061 c 197.242 198.479 201.34 203.506 201.34
 209.475 c h
201.34 209.475 m f
0.764706 0.854902 0.25098 rg
331.117 113.245 m 331.117 241.901 l 331.117 246.401 334.766 250.049 339.266
 250.049 c 362.211 250.049 l 366.711 250.049 370.359 246.401 370.359 241.901
 c 370.359 113.245 l 370.359 108.745 366.711 105.096 362.211 105.096 c 339.266
 105.096 l 334.766 105.096 331.117 108.745 331.117 113.245 c h
331.117 113.245 m f
0.192157 0.823529 0.968627 rg
267.852 113.245 m 267.852 201.858 l 267.852 206.358 271.5 210.006 276 210.006
 c 298.945 210.006 l 303.445 210.006 307.094 206.358 307.094 201.858 c 307.094
 113.245 l 307.094 108.745 303.445 105.096 298.945 105.096 c 276 105.096
 l 271.5 105.096 267.852 108.745 267.852 113.245 c h
267.852 113.245 m f
1 0.384314 0.654902 rg
204.586 113.245 m 204.586 171.428 l 204.586 175.928 208.234 179.577 212.734
 179.577 c 235.68 179.577 l 240.18 179.577 243.828 175.928 243.828 171.428
 c 243.828 113.245 l 243.828 108.745 240.18 105.096 235.68 105.096 c 212.734
 105.096 l 208.234 105.096 204.586 108.745 204.586 113.245 c h
204.586 113.245 m f
0.678431 0.737255 0.0823529 rg
349.926 113.245 m 349.926 241.901 l 349.926 246.401 353.57 250.049 358.07
 250.049 c 339.266 250.049 l 334.766 250.049 331.121 246.401 331.121 241.901
 c 331.121 113.245 l 331.121 108.745 334.766 105.096 339.266 105.096 c 358.07
 105.096 l 353.57 105.096 349.926 108.745 349.926 113.245 c h
349.926 113.245 m f
0.0745098 0.67451 0.909804 rg
286.656 113.245 m 286.656 201.858 l 286.656 206.358 290.305 210.006 294.805
 210.006 c 276 210.006 l 271.5 210.006 267.852 206.358 267.852 201.858 c
 267.852 113.245 l 267.852 108.745 271.5 105.096 276 105.096 c 294.805 105.096
 l 290.305 105.096 286.656 108.745 286.656 113.245 c h
286.656 113.245 m f
0.988235 0.329412 0.47451 rg
223.391 113.245 m 223.391 171.428 l 223.391 175.928 227.039 179.577 231.539
 179.577 c 212.734 179.577 l 208.234 179.577 204.586 175.928 204.586 171.428
 c 204.586 113.245 l 204.586 108.745 208.234 105.096 212.734 105.096 c 231.539
 105.096 l 227.039 105.096 223.391 108.745 223.391 113.245 c h
223.391 113.245 m f
0.972549 0.807843 0.160784 rg
141.32 112.588 m 141.32 142.334 l 173.73 142.334 l 174.012 142.346 l 180.562
 142.491 l 180.562 112.588 l 180.562 108.452 177.207 105.096 173.07 105.096
 c 148.812 105.096 l 144.676 105.096 141.32 108.452 141.32 112.588 c h
141.32 112.588 m f
0.976471 0.631373 0.254902 rg
173.73 142.334 m 141.32 142.334 l 141.32 122.198 l 180.562 122.198 l 180.562
 142.491 l 174.012 142.346 l h
173.73 142.334 m f
0.980392 0.827451 0.576471 rg
100.219 141.534 m 87.348 141.534 75.395 147.893 68.203 158.557 c 42.484
 158.557 l 42.484 212.545 l 68.914 212.545 l 74.086 220.131 l 77.621 225.319
 82.422 229.604 87.969 232.53 c 104.895 241.463 l 104.895 272.073 l 104.895
 279.135 110.641 284.885 117.703 284.885 c 124.77 284.885 130.516 279.139
 130.516 272.073 c 130.516 241.623 l 173.73 241.623 l 180.797 241.623 186.543
 235.877 186.543 228.811 c 186.543 222.846 182.445 217.819 176.914 216.401
 c 182.445 214.983 186.543 209.955 186.543 203.991 c 186.543 198.026 182.445
 192.998 176.914 191.58 c 182.445 190.159 186.543 185.135 186.543 179.166
 c 186.543 173.202 182.445 168.174 176.914 166.756 c 182.445 165.338 186.543
 160.311 186.543 154.346 c 186.543 147.284 180.797 141.534 173.73 141.534
 c h
100.219 141.534 m f
0.929412 0.717647 0.411765 rg
88.883 220.131 m 92.418 225.319 97.219 229.604 102.77 232.53 c 112.754 
237.803 l 117.02 240.057 119.691 244.483 119.691 249.307 c 119.691 272.073
 l 119.691 276.381 121.836 280.19 125.102 282.514 c 122.695 284.225 119.688
 285.135 116.453 284.823 c 109.836 284.186 104.895 278.413 104.895 271.764
 c 104.895 241.463 l 87.969 232.53 l 82.422 229.604 77.621 225.315 74.086
 220.131 c 68.914 212.545 l 83.711 212.545 l h
88.883 220.131 m f
42.484 212.549 14.797 -53.992 re f
83 158.557 m 68.203 158.557 l 75.395 147.893 87.348 141.534 100.219 141.534
 c 115.02 141.534 l 102.145 141.534 90.195 147.893 83 158.557 c h
83 158.557 m f
0.192157 0.823529 0.968627 rg
5.605 151.877 m 5.605 217.096 l 5.605 220.455 8.332 223.186 11.695 223.186
 c 37.195 223.186 l 40.559 223.186 43.285 220.459 43.285 217.096 c 43.285
 151.877 l 43.285 148.518 40.559 145.791 37.195 145.791 c 11.695 145.791
 l 8.332 145.791 5.605 148.514 5.605 151.877 c h
5.605 151.877 m f
0.0745098 0.67451 0.909804 rg
24.445 151.877 m 24.445 217.096 l 24.445 220.459 27.172 223.186 30.535 
223.186 c 11.695 223.186 l 8.332 223.186 5.605 220.459 5.605 217.096 c 5.605
 151.877 l 5.605 148.518 8.332 145.791 11.695 145.791 c 30.535 145.791 l
 27.172 145.791 24.445 148.514 24.445 151.877 c h
24.445 151.877 m f
0 g
389.102 334.936 m 88.945 334.936 l 77.641 334.936 68.445 325.741 68.445
 314.436 c 68.445 221.811 l 65.949 218.151 l 48.891 218.151 l 48.891 218.889
 l 48.891 224.346 44.449 228.788 38.992 228.788 c 9.902 228.788 l 4.441 
228.791 0 224.346 0 218.889 c 0 150.084 l 0 144.627 4.441 140.186 9.902 
140.186 c 38.992 140.186 l 44.449 140.186 48.891 144.627 48.891 150.084 
c 48.891 152.952 l 65.348 152.952 l 66.32 151.702 67.359 150.522 68.445 
149.397 c 68.445 95.166 l 68.445 83.862 77.641 74.666 88.945 74.666 c 389.102
 74.666 l 400.406 74.666 409.602 83.862 409.602 95.166 c 409.602 314.436
 l 409.602 325.741 400.402 334.936 389.102 334.936 c h
36.879 152.198 m 12.012 152.198 l 12.012 216.776 l 36.879 216.776 l h
48.891 164.963 m 48.891 206.139 l 69.125 206.139 l 71.109 206.139 72.969
 207.12 74.086 208.76 c 79.379 216.522 l 82.328 220.846 86.332 224.42 90.961
 226.866 c 108.098 235.909 l 110.066 236.948 111.297 238.995 111.297 241.221
 c 111.297 272.073 l 111.297 275.604 114.172 278.475 117.703 278.475 c 121.234
 278.475 124.109 275.604 124.109 272.073 c 124.109 241.221 l 124.109 237.905
 126.797 235.217 130.113 235.217 c 173.73 235.217 l 177.262 235.217 180.137
 232.342 180.137 228.811 c 180.137 225.28 177.262 222.409 173.73 222.409
 c 170.414 222.409 167.723 219.721 167.723 216.401 c 167.723 213.084 170.414
 210.393 173.73 210.393 c 177.262 210.393 180.137 207.522 180.137 203.991
 c 180.137 200.459 177.262 197.584 173.73 197.584 c 170.414 197.584 167.723
 194.897 167.723 191.58 c 167.723 188.26 170.414 185.573 173.73 185.573 
c 177.262 185.573 180.137 182.698 180.137 179.166 c 180.137 175.635 177.262
 172.764 173.73 172.764 c 170.414 172.764 167.723 170.077 167.723 166.756
 c 167.723 163.44 170.414 160.752 173.73 160.752 c 177.262 160.752 180.137
 157.877 180.137 154.346 c 180.137 150.815 177.262 147.944 173.73 147.944
 c 100.219 147.944 l 89.422 147.944 79.402 153.307 73.414 162.288 c 72.301
 163.959 70.426 164.963 68.414 164.963 c h
147.727 135.928 m 173.73 135.928 l 173.875 135.928 174.012 135.936 174.156
 135.94 c 174.156 111.502 l 147.727 111.502 l h
397.586 95.166 m 397.586 90.487 393.781 86.678 389.102 86.678 c 88.945 
86.678 l 84.266 86.678 80.457 90.487 80.457 95.166 c 80.457 140.584 l 86.5
 137.569 93.238 135.928 100.219 135.928 c 135.715 135.928 l 135.715 105.498
 l 135.715 102.178 138.406 99.491 141.723 99.491 c 180.164 99.491 l 183.48
 99.491 186.168 102.178 186.168 105.498 c 186.168 140.334 l 186.168 140.475
 186.156 140.616 186.148 140.756 c 189.832 144.123 192.148 148.971 192.148
 154.346 c 192.148 159.123 190.32 163.479 187.328 166.756 c 190.32 170.034
 192.148 174.389 192.148 179.166 c 192.148 183.944 190.32 188.303 187.328
 191.577 c 190.32 194.854 192.148 199.213 192.148 203.991 c 192.148 208.764
 190.32 213.123 187.328 216.401 c 190.32 219.674 192.148 224.034 192.148
 228.811 c 192.148 238.967 183.887 247.229 173.73 247.229 c 136.121 247.229
 l 136.121 272.073 l 136.121 282.229 127.859 290.491 117.703 290.491 c 107.547
 290.491 99.285 282.229 99.285 272.073 c 99.285 244.842 l 85.352 237.487
 l 83.656 236.592 82.023 235.577 80.457 234.467 c 80.457 314.436 l 80.457
 319.116 84.266 322.924 88.945 322.924 c 389.102 322.924 l 393.781 322.924
 397.59 319.116 397.59 314.436 c 397.59 95.166 l h
397.586 95.166 m f
243.426 185.178 m 204.988 185.178 l 201.672 185.178 198.98 182.491 198.98
 179.174 c 198.98 105.498 l 198.98 102.178 201.668 99.491 204.988 99.491
 c 243.426 99.491 l 246.742 99.491 249.434 102.178 249.434 105.498 c 249.434
 179.174 l 249.434 182.491 246.742 185.178 243.426 185.178 c h
237.422 111.502 m 210.992 111.502 l 210.992 173.166 l 237.422 173.166 l
 h
237.422 111.502 m f
306.691 215.612 m 268.254 215.612 l 264.938 215.612 262.246 212.924 262.246
 209.604 c 262.246 105.498 l 262.246 102.178 264.938 99.491 268.254 99.491
 c 306.691 99.491 l 310.008 99.491 312.699 102.178 312.699 105.498 c 312.699
 209.604 l 312.699 212.924 310.012 215.612 306.691 215.612 c h
300.688 111.502 m 274.262 111.502 l 274.262 203.6 l 300.688 203.6 l h
300.688 111.502 m f
369.961 255.655 m 331.52 255.655 l 328.203 255.655 325.512 252.963 325.512
 249.647 c 325.512 167.85 l 325.512 164.534 328.203 161.842 331.52 161.842
 c 334.836 161.842 337.527 164.534 337.527 167.85 c 337.527 243.639 l 363.953
 243.639 l 363.953 111.502 l 337.527 111.502 l 337.527 128.768 l 337.527
 132.084 334.836 134.772 331.52 134.772 c 328.203 134.772 325.512 132.084
 325.512 128.768 c 325.512 105.498 l 325.512 102.178 328.203 99.491 331.52
 99.491 c 369.961 99.491 l 373.277 99.491 375.965 102.178 375.965 105.498
 c 375.965 249.647 l 375.965 252.963 373.277 255.655 369.961 255.655 c h
369.961 255.655 m f
336.723 267.264 m 336.723 263.948 339.414 261.26 342.73 261.26 c 346.047
 261.26 348.738 263.948 348.738 267.264 c 348.738 292.092 l 348.738 295.409
 346.047 298.096 342.73 298.096 c 318.707 298.096 l 315.391 298.096 312.699
 295.409 312.699 292.092 c 312.699 288.772 315.391 286.084 318.707 286.084
 c 328.652 286.084 l 298.523 251.166 257.984 226.03 208.098 211.362 c 204.914
 210.428 203.094 207.088 204.031 203.905 c 204.797 201.288 207.191 199.592
 209.789 199.592 c 210.352 199.592 210.922 199.67 211.484 199.838 c 263.066
 215.002 305.172 240.971 336.723 277.053 c h
336.723 267.264 m f
Q Q
showpage
%%Trailer
end restore
%%EOF
