%!PS-Adobe-3.0 EPSF-3.0
%%Creator: cairo 1.14.2 (http://cairographics.org)
%%CreationDate: Mon Feb 19 09:15:05 2018
%%Pages: 1
%%DocumentData: Clean7Bit
%%LanguageLevel: 2
%%BoundingBox: 11 -1 398 410
%%EndComments
%%BeginProlog
save
50 dict begin
/q { gsave } bind def
/Q { grestore } bind def
/cm { 6 array astore concat } bind def
/w { setlinewidth } bind def
/J { setlinecap } bind def
/j { setlinejoin } bind def
/M { setmiterlimit } bind def
/d { setdash } bind def
/m { moveto } bind def
/l { lineto } bind def
/c { curveto } bind def
/h { closepath } bind def
/re { exch dup neg 3 1 roll 5 3 roll moveto 0 rlineto
      0 exch rlineto 0 rlineto closepath } bind def
/S { stroke } bind def
/f { fill } bind def
/f* { eofill } bind def
/n { newpath } bind def
/W { clip } bind def
/W* { eoclip } bind def
/BT { } bind def
/ET { } bind def
/pdfmark where { pop globaldict /?pdfmark /exec load put }
    { globaldict begin /?pdfmark /pop load def /pdfmark
    /cleartomark load def end } ifelse
/BDC { mark 3 1 roll /BDC pdfmark } bind def
/EMC { mark /EMC pdfmark } bind def
/cairo_store_point { /cairo_point_y exch def /cairo_point_x exch def } def
/Tj { show currentpoint cairo_store_point } bind def
/TJ {
  {
    dup
    type /stringtype eq
    { show } { -0.001 mul 0 cairo_font_matrix dtransform rmoveto } ifelse
  } forall
  currentpoint cairo_store_point
} bind def
/cairo_selectfont { cairo_font_matrix aload pop pop pop 0 0 6 array astore
    cairo_font exch selectfont cairo_point_x cairo_point_y moveto } bind def
/Tf { pop /cairo_font exch def /cairo_font_matrix where
      { pop cairo_selectfont } if } bind def
/Td { matrix translate cairo_font_matrix matrix concatmatrix dup
      /cairo_font_matrix exch def dup 4 get exch 5 get cairo_store_point
      /cairo_font where { pop cairo_selectfont } if } bind def
/Tm { 2 copy 8 2 roll 6 array astore /cairo_font_matrix exch def
      cairo_store_point /cairo_font where { pop cairo_selectfont } if } bind def
/g { setgray } bind def
/rg { setrgbcolor } bind def
/d1 { setcachedevice } bind def
%%EndProlog
%%BeginSetup
%%EndSetup
%%Page: 1 1
%%BeginPageSetup
%%PageBoundingBox: 11 -1 398 410
%%EndPageSetup
q 11 -1 387 411 rectclip q
0.447059 0.431373 0.439216 rg
299.508 403.998 m 108.492 403.998 l 101.164 403.998 95.199 398.038 95.199
 390.705 c 95.199 18.893 l 95.199 11.565 101.164 5.6 108.492 5.6 c 299.508
 5.6 l 306.836 5.6 312.801 11.565 312.801 18.893 c 312.801 390.705 l 312.801
 398.038 306.836 403.998 299.508 403.998 c h
299.508 403.998 m f
0.356863 0.341176 0.321569 rg
148 18.893 m 148 390.705 l 148 398.038 153.965 403.998 161.293 403.998 
c 108.492 403.998 l 101.164 403.998 95.199 398.038 95.199 390.705 c 95.199
 18.893 l 95.199 11.565 101.164 5.6 108.492 5.6 c 161.293 5.6 l 153.965 
5.6 148 11.565 148 18.893 c h
148 18.893 m f
0.764706 0.854902 0.25098 rg
279.297 382.401 m 128.703 382.401 l 123.039 382.401 118.43 377.791 118.43
 372.123 c 118.43 37.772 l 118.43 31.944 123.172 27.202 129 27.202 c 279
 27.202 l 284.828 27.202 289.57 31.944 289.57 37.772 c 289.57 372.123 l 
289.57 377.791 284.961 382.401 279.297 382.401 c h
279.297 382.401 m f
0.678431 0.737255 0.0823529 rg
289.57 91.202 m 289.57 119.952 l 228.398 119.952 l 215.148 119.952 204.414
 108.975 204.809 95.639 c 205.191 82.803 216.059 72.752 228.902 72.752 c
 251.344 72.752 l 255.805 63.276 l 256.656 61.467 259.246 61.53 260.008 
63.377 c 263.867 72.752 l 289.57 72.752 l h
289.57 91.202 m f
289.57 278.401 m 289.57 308.998 l 226.203 308.998 l 212.953 308.998 202.219
 298.022 202.613 284.686 c 202.996 271.85 213.863 261.799 226.703 261.799
 c 249.148 261.799 l 253.605 252.323 l 254.457 250.514 257.051 250.577 257.812
 252.424 c 261.672 261.799 l 289.57 261.799 l h
289.57 278.401 m f
154.684 170.381 m 158.543 161.006 l 159.305 159.159 161.898 159.096 162.746
 160.905 c 167.207 170.381 l 190.152 170.381 l 203.402 170.381 214.137 181.358
 213.742 194.698 c 213.359 207.534 202.492 217.58 189.648 217.58 c 118.43
 217.58 l 118.43 170.381 l h
154.684 170.381 m f
1 0.384314 0.654902 rg
255.746 90.401 m 233.301 90.401 l 220.461 90.401 209.594 100.448 209.211
 113.288 c 208.816 126.623 219.551 137.6 232.801 137.6 c 368.297 137.6 l
 381.141 137.6 392.008 127.549 392.391 114.713 c 392.785 101.377 382.051
 90.401 368.801 90.401 c 268.27 90.401 l 264.406 81.026 l 263.648 79.178
 261.055 79.112 260.203 80.92 c h
255.746 90.401 m f
1 0.811765 0.34902 rg
141.332 184.799 m 41.301 184.799 l 28.461 184.799 17.59 194.85 17.211 207.686
 c 16.816 221.026 27.551 231.998 40.801 231.998 c 176.297 231.998 l 189.141
 231.998 200.008 221.952 200.391 209.116 c 200.785 195.776 190.051 184.799
 176.801 184.799 c 153.855 184.799 l 149.395 175.323 l 148.543 173.514 145.953
 173.577 145.191 175.424 c h
141.332 184.799 m f
1 0.384314 0.654902 rg
255.746 277.6 m 233.301 277.6 l 220.461 277.6 209.594 287.651 209.211 300.487
 c 208.816 313.823 219.551 324.799 232.801 324.799 c 368.297 324.799 l 381.141
 324.799 392.008 314.752 392.391 301.916 c 392.785 288.577 382.051 277.6
 368.801 277.6 c 268.27 277.6 l 264.406 268.225 l 263.648 266.377 261.055
 266.315 260.203 268.123 c h
255.746 277.6 m f
0.988235 0.329412 0.47451 rg
226.012 97.346 m 225.613 110.686 236.348 121.663 249.602 121.663 c 385.098
 121.663 l 387.258 121.663 389.359 121.37 391.367 120.838 c 388.34 130.608
 379.008 137.6 368.297 137.6 c 232.801 137.6 l 219.551 137.6 208.816 126.623
 209.211 113.288 c 209.527 102.608 217.102 93.866 227.031 91.225 c 226.43
 93.166 226.074 95.217 226.012 97.346 c h
226.012 97.346 m f
1 0.709804 0.360784 rg
34.012 191.748 m 33.613 205.084 44.348 216.061 57.602 216.061 c 193.098
 216.061 l 195.258 216.061 197.359 215.772 199.367 215.237 c 196.34 225.006
 187.008 231.998 176.297 231.998 c 40.801 231.998 l 27.551 231.998 16.816
 221.026 17.211 207.686 c 17.527 197.01 25.102 188.264 35.031 185.623 c 
34.43 187.569 34.074 189.62 34.012 191.748 c h
34.012 191.748 m f
0.988235 0.329412 0.47451 rg
226.012 284.549 m 225.613 297.885 236.348 308.862 249.602 308.862 c 385.098
 308.862 l 387.258 308.862 389.359 308.573 391.367 308.038 c 388.34 317.807
 379.008 324.799 368.297 324.799 c 232.801 324.799 l 219.551 324.799 208.816
 313.823 209.211 300.487 c 209.527 289.807 217.102 281.065 227.031 278.424
 c 226.43 280.366 226.074 282.42 226.012 284.549 c h
226.012 284.549 m f
0.356863 0.341176 0.34902 rg
167.586 355.998 m 163.516 355.998 160.035 359.038 159.488 363.069 c 156.855
 382.401 l 252.742 382.401 l 250.109 363.069 l 249.562 359.038 246.082 355.998
 242.016 355.998 c h
167.586 355.998 m f
0 g
368.801 143.202 m 318.398 143.202 l 318.398 271.998 l 368.801 271.998 l
 384.902 271.998 398 285.1 398 301.202 c 398 317.299 384.902 330.401 368.801
 330.401 c 318.398 330.401 l 318.398 390.705 l 318.398 401.123 309.926 409.6
 299.508 409.6 c 108.492 409.6 l 98.074 409.6 89.602 401.123 89.602 390.705
 c 89.602 237.6 l 40.801 237.6 l 24.699 237.6 11.602 224.502 11.602 208.401
 c 11.602 192.299 24.699 179.202 40.801 179.202 c 89.602 179.202 l 89.602
 18.893 l 89.602 8.475 98.074 -0.002 108.492 -0.002 c 299.508 -0.002 l 309.926
 -0.002 318.398 8.475 318.398 18.893 c 318.398 84.799 l 368.801 84.799 l
 384.902 84.799 398 97.901 398 113.998 c 398 130.1 384.902 143.202 368.801
 143.202 c h
368.801 318.401 m 378.285 318.401 386 310.686 386 301.202 c 386 291.717
 378.285 283.998 368.801 283.998 c 268 283.998 l 265.57 283.998 263.379 
282.534 262.453 280.284 c 262.035 279.268 l 261.43 280.553 l 260.438 282.659
 258.324 283.998 256 283.998 c 232.801 283.998 l 223.316 283.998 215.602
 291.717 215.602 301.202 c 215.602 310.686 223.316 318.401 232.801 318.401
 c h
306.398 271.998 m 306.398 143.202 l 295.172 143.202 l 295.172 271.998 l
 h
101.602 390.705 m 101.602 394.506 104.691 397.6 108.492 397.6 c 299.508
 397.6 l 303.309 397.6 306.398 394.506 306.398 390.705 c 306.398 330.401
 l 295.172 330.401 l 295.172 372.123 l 295.172 380.877 288.051 387.998 279.297
 387.998 c 128.703 387.998 l 119.953 387.998 112.828 380.877 112.828 372.123
 c 112.828 237.6 l 101.602 237.6 l h
245.41 375.998 m 243.77 363.932 l 243.652 363.057 242.895 362.401 242.016
 362.401 c 167.586 362.401 l 166.703 362.401 165.949 363.057 165.832 363.932
 c 164.188 375.998 l h
40.801 191.202 m 31.316 191.202 23.602 198.916 23.602 208.401 c 23.602 
217.885 31.316 225.6 40.801 225.6 c 176.801 225.6 l 186.285 225.6 194 217.885
 194 208.401 c 194 198.916 186.285 191.202 176.801 191.202 c 153.602 191.202
 l 151.277 191.202 149.16 189.858 148.172 187.756 c 147.566 186.467 l 147.148
 187.483 l 146.223 189.733 144.031 191.202 141.602 191.202 c h
306.398 18.893 m 306.398 15.088 303.312 11.998 299.508 11.998 c 108.492
 11.998 l 104.688 11.998 101.602 15.088 101.602 18.893 c 101.602 179.202
 l 112.828 179.202 l 112.828 113.518 l 112.828 109.471 116.871 106.674 120.66
 108.096 c 120.77 108.135 120.879 108.174 120.984 108.213 c 123.285 109.057
 124.828 111.225 124.828 113.67 c 124.828 179.202 l 137.582 179.202 l 141.652
 169.315 l 142.559 167.116 144.676 165.663 147.051 165.604 c 147.102 165.6
 147.152 165.6 147.199 165.6 c 149.52 165.6 151.637 166.94 152.629 169.045
 c 157.406 179.202 l 176.254 179.202 l 192.199 179.202 205.613 191.756 205.992
 207.698 c 206.379 224.116 193.137 237.6 176.801 237.6 c 124.828 237.6 l
 124.828 372.123 l 124.828 374.264 126.562 375.998 128.703 375.998 c 152.078
 375.998 l 153.941 362.315 l 154.863 355.522 160.73 350.401 167.586 350.401
 c 242.016 350.401 l 248.867 350.401 254.734 355.522 255.66 362.315 c 257.523
 375.998 l 279.297 375.998 l 281.438 375.998 283.172 374.264 283.172 372.123
 c 283.172 330.401 l 233.348 330.401 l 217.402 330.401 203.984 317.846 203.609
 301.905 c 203.219 285.483 216.465 271.998 232.801 271.998 c 252.191 271.998
 l 256.973 261.846 l 257.961 259.741 260.078 258.401 262.398 258.401 c 262.449
 258.401 262.5 258.401 262.547 258.401 c 264.926 258.459 267.043 259.916
 267.949 262.116 c 272.02 271.998 l 283.172 271.998 l 283.172 143.202 l 
233.348 143.202 l 217.402 143.202 203.984 130.643 203.609 114.705 c 203.219
 98.284 216.465 84.799 232.801 84.799 c 252.191 84.799 l 256.973 74.647 
l 257.961 72.538 260.078 71.202 262.398 71.202 c 262.449 71.202 262.5 71.202
 262.547 71.202 c 264.926 71.26 267.043 72.717 267.949 74.916 c 272.02 84.799
 l 283.172 84.799 l 283.172 37.772 l 283.172 35.467 281.301 33.6 279 33.6
 c 129 33.6 l 126.695 33.6 124.828 35.467 124.828 37.772 c 124.828 78.131
 l 124.828 80.596 123.289 82.78 120.984 83.647 c 120.934 83.666 120.883 
83.686 120.832 83.705 c 116.973 85.174 112.828 82.358 112.828 78.225 c 112.828
 37.772 l 112.828 28.838 120.07 21.6 129 21.6 c 279 21.6 l 287.93 21.6 295.172
 28.842 295.172 37.772 c 295.172 84.799 l 306.398 84.799 l h
368.801 96.799 m 268 96.799 l 265.57 96.799 263.379 95.334 262.453 93.084
 c 262.035 92.069 l 261.43 93.354 l 260.438 95.459 258.324 96.799 256 96.799
 c 232.801 96.799 l 223.316 96.799 215.602 104.514 215.602 113.998 c 215.602
 123.483 223.316 131.202 232.801 131.202 c 368.801 131.202 l 378.285 131.202
 386 123.483 386 113.998 c 386 104.514 378.285 96.799 368.801 96.799 c h
368.801 96.799 m f
Q Q
showpage
%%Trailer
end restore
%%EOF
