%!PS-Adobe-3.0 EPSF-3.0
%%Creator: cairo 1.14.2 (http://cairographics.org)
%%CreationDate: Mon Feb 19 09:15:05 2018
%%Pages: 1
%%DocumentData: Clean7Bit
%%LanguageLevel: 2
%%BoundingBox: 0 -1 410 410
%%EndComments
%%BeginProlog
save
50 dict begin
/q { gsave } bind def
/Q { grestore } bind def
/cm { 6 array astore concat } bind def
/w { setlinewidth } bind def
/J { setlinecap } bind def
/j { setlinejoin } bind def
/M { setmiterlimit } bind def
/d { setdash } bind def
/m { moveto } bind def
/l { lineto } bind def
/c { curveto } bind def
/h { closepath } bind def
/re { exch dup neg 3 1 roll 5 3 roll moveto 0 rlineto
      0 exch rlineto 0 rlineto closepath } bind def
/S { stroke } bind def
/f { fill } bind def
/f* { eofill } bind def
/n { newpath } bind def
/W { clip } bind def
/W* { eoclip } bind def
/BT { } bind def
/ET { } bind def
/pdfmark where { pop globaldict /?pdfmark /exec load put }
    { globaldict begin /?pdfmark /pop load def /pdfmark
    /cleartomark load def end } ifelse
/BDC { mark 3 1 roll /BDC pdfmark } bind def
/EMC { mark /EMC pdfmark } bind def
/cairo_store_point { /cairo_point_y exch def /cairo_point_x exch def } def
/Tj { show currentpoint cairo_store_point } bind def
/TJ {
  {
    dup
    type /stringtype eq
    { show } { -0.001 mul 0 cairo_font_matrix dtransform rmoveto } ifelse
  } forall
  currentpoint cairo_store_point
} bind def
/cairo_selectfont { cairo_font_matrix aload pop pop pop 0 0 6 array astore
    cairo_font exch selectfont cairo_point_x cairo_point_y moveto } bind def
/Tf { pop /cairo_font exch def /cairo_font_matrix where
      { pop cairo_selectfont } if } bind def
/Td { matrix translate cairo_font_matrix matrix concatmatrix dup
      /cairo_font_matrix exch def dup 4 get exch 5 get cairo_store_point
      /cairo_font where { pop cairo_selectfont } if } bind def
/Tm { 2 copy 8 2 roll 6 array astore /cairo_font_matrix exch def
      cairo_store_point /cairo_font where { pop cairo_selectfont } if } bind def
/g { setgray } bind def
/rg { setrgbcolor } bind def
/d1 { setcachedevice } bind def
%%EndProlog
%%BeginSetup
%%EndSetup
%%Page: 1 1
%%BeginPageSetup
%%PageBoundingBox: 0 -1 410 410
%%EndPageSetup
q 0 -1 410 411 rectclip q
1 0.811765 0.34902 rg
154.109 255.307 m 148.98 255.307 l 133.77 255.307 121.441 267.639 121.441
 282.85 c 121.441 340.061 l 121.441 355.268 133.77 367.6 148.98 367.6 c 
259.82 367.6 l 275.031 367.6 287.359 355.268 287.359 340.061 c 287.359 282.846
 l 287.359 267.639 275.031 255.307 259.82 255.307 c 175.883 255.307 l 160.34
 236.155 l 158.262 233.588 154.109 235.061 154.109 238.362 c h
154.109 255.307 m f
1 0.709804 0.360784 rg
259.82 367.6 m 148.98 367.6 l 134.879 367.6 123.262 356.998 121.641 343.334
 c 223.18 343.334 l 238.391 343.334 250.723 331.002 250.723 315.795 c 250.723
 258.58 l 250.723 257.475 250.648 256.381 250.52 255.307 c 259.82 255.307
 l 275.031 255.307 287.359 267.639 287.359 282.846 c 287.359 340.061 l 287.359
 355.268 275.031 367.6 259.82 367.6 c h
259.82 367.6 m f
1 0.811765 0.34902 rg
207.316 54.51 m 123.379 54.51 l 108.172 54.51 95.84 66.838 95.84 82.049
 c 95.84 139.26 l 95.84 154.471 108.172 166.799 123.379 166.799 c 234.223
 166.799 l 249.43 166.799 261.762 154.471 261.762 139.26 c 261.762 82.049
 l 261.762 66.838 249.43 54.51 234.223 54.51 c 229.094 54.51 l 229.094 37.565
 l 229.094 34.26 224.941 32.788 222.859 35.354 c h
207.316 54.51 m f
1 0.709804 0.360784 rg
124.801 60.85 m 124.801 118.061 l 124.801 133.268 137.129 145.6 152.34 
145.6 c 261.02 145.6 l 258.152 157.752 247.246 166.799 234.219 166.799 c
 123.379 166.799 l 108.172 166.799 95.84 154.471 95.84 139.26 c 95.84 82.049
 l 95.84 66.838 108.172 54.506 123.379 54.506 c 125.543 54.506 l 125.062
 56.545 124.801 58.666 124.801 60.85 c h
124.801 60.85 m f
0.247059 0.152941 0.145098 rg
387.633 177.83 m 377.305 187.998 363.66 193.6 349.207 193.6 c 348.922 193.6
 348.633 193.6 348.348 193.592 c 318.602 193.139 294.398 168.19 294.398 
137.975 c 294.398 65.686 l 294.398 58.014 297.555 50.538 303.059 45.163 
c 308.211 40.131 l 389.711 37.631 l 395.254 43.002 l 400.812 48.385 404 
55.893 404 63.604 c 404 138.799 l 404 153.573 398.188 167.432 387.633 177.83
 c h
387.633 177.83 m f
0.980392 0.827451 0.576471 rg
336.801 47.596 m 336.801 93.604 l 344.129 91.659 l 345.82 91.209 347.527
 90.983 349.199 90.983 c 350.414 90.983 351.668 91.108 352.922 91.346 c 
360 92.709 l 360 47.596 l h
336.801 47.596 m f
0.929412 0.717647 0.411765 rg
344.129 91.659 m 336.801 93.604 l 336.801 47.596 l 348.398 47.596 l 348.398
 91.01 l 346.984 91.073 345.555 91.284 344.129 91.659 c h
344.129 91.659 m f
1 0.384314 0.654902 rg
314.309 5.6 m 309.508 5.6 305.602 9.506 305.602 14.311 c 305.602 27.62 
l 305.602 44.592 319.41 58.401 336.383 58.401 c 360.418 58.401 l 377.391
 58.401 391.199 44.592 391.199 27.616 c 391.199 14.307 l 391.199 9.506 387.293
 5.6 382.492 5.6 c h
314.309 5.6 m f
0.980392 0.827451 0.576471 rg
349.82 80.807 m 329.902 80.463 313.602 97.112 313.602 117.03 c 313.602 
131.03 l 313.602 132.307 314.594 133.362 315.867 133.444 c 319.602 133.674
 l 337.613 134.803 352.344 148.452 354.836 166.327 c 355.723 172.674 l 355.867
 173.721 356.977 174.334 357.941 173.905 c 363.793 171.28 l 376.555 165.561
 384.801 152.811 384.801 138.799 c 384.801 116.401 l 384.801 96.975 369.164
 81.135 349.82 80.807 c h
349.82 80.807 m f
0.929412 0.717647 0.411765 rg
337.543 127.893 m 337.543 128.772 338.156 129.549 339.02 129.721 c 355.035
 132.916 367.586 145.92 369.895 162.463 c 370.566 167.288 l 368.488 168.846
 366.223 170.194 363.793 171.28 c 357.941 173.901 l 357.172 174.248 356.312
 173.92 355.926 173.237 c 355.09 167.252 l 354.836 165.428 354.441 163.655
 353.949 161.924 c 349.844 146.252 336.102 134.705 319.602 133.674 c 315.867
 133.444 l 314.594 133.362 313.602 132.307 313.602 131.03 c 313.602 117.03
 l 313.602 97.319 329.352 80.873 349.066 80.799 c 358.711 80.764 367.473
 84.592 373.91 90.811 c 353.844 90.866 337.543 107.737 337.543 127.893 c
 h
337.543 127.893 m f
0.980392 0.827451 0.576471 rg
36.801 250.057 m 36.801 303.858 l 44 301.92 l 45.82 301.432 47.52 301.194
 49.199 301.194 c 50.422 301.194 51.668 301.323 53.012 301.584 c 60 302.955
 l 60 250.057 l h
36.801 250.057 m f
0.929412 0.717647 0.411765 rg
44 301.92 m 36.801 303.858 l 36.801 250.057 l 48.398 250.057 l 48.398 301.221
 l 46.977 301.288 45.531 301.51 44 301.92 c h
44 301.92 m f
0 0.443137 0.717647 rg
14.309 210.401 m 9.508 210.401 5.602 214.307 5.602 219.108 c 5.602 232.416
 l 5.602 249.389 19.41 263.202 36.383 263.202 c 60.418 263.202 l 77.391 
263.202 91.199 249.389 91.199 232.416 c 91.199 219.108 l 91.199 214.307 
87.293 210.401 82.492 210.401 c h
14.309 210.401 m f
0.988235 0.329412 0.47451 rg
336.801 14.311 m 336.801 27.62 l 336.801 43.377 348.707 56.405 364 58.186
 c 362.824 58.323 361.629 58.401 360.418 58.401 c 336.383 58.401 l 319.41
 58.401 305.602 44.592 305.602 27.616 c 305.602 14.307 l 305.602 9.506 309.508
 5.6 314.309 5.6 c 345.508 5.6 l 340.707 5.6 336.801 9.506 336.801 14.311
 c h
336.801 14.311 m f
0.0235294 0.352941 0.517647 rg
36.801 219.108 m 36.801 232.416 l 36.801 248.178 48.707 261.202 64 262.987
 c 62.824 263.123 61.629 263.202 60.418 263.202 c 36.383 263.202 l 19.41
 263.202 5.602 249.389 5.602 232.416 c 5.602 219.108 l 5.602 214.307 9.508
 210.401 14.309 210.401 c 45.508 210.401 l 40.707 210.401 36.801 214.307
 36.801 219.108 c h
36.801 219.108 m f
0.980392 0.827451 0.576471 rg
49.199 285.6 m 26.043 285.6 7.199 304.44 7.199 327.6 c 7.199 358.401 l 
91.199 358.401 l 91.199 327.6 l 91.199 304.44 72.359 285.6 49.199 285.6 
c h
49.199 285.6 m f
0.929412 0.717647 0.411765 rg
41.219 327.6 m 41.219 358.401 l 7.199 358.401 l 7.199 327.6 l 7.199 304.44
 26.043 285.6 49.199 285.6 c 55.254 285.6 61.004 286.897 66.211 289.213 
c 51.504 295.756 41.219 310.495 41.219 327.6 c h
41.219 327.6 m f
0.207843 g
7.199 357.6 m 7.199 365.705 l 7.199 386.819 24.379 403.998 45.496 403.998
 c 109.234 403.998 l 115.172 403.998 120 399.17 120 393.233 c 120 376.495
 108.184 361.58 91.902 357.768 c 91.184 357.6 l h
7.199 357.6 m f
0 g
259.82 373.202 m 148.98 373.202 l 130.676 373.202 115.84 358.362 115.84
 340.061 c 115.84 282.846 l 115.84 264.733 130.453 249.963 148.508 249.709
 c 148.508 229.78 l 148.508 227.534 149.668 225.385 151.645 224.327 c 152.562
 223.834 153.539 223.6 154.508 223.6 c 156.281 223.6 158.008 224.389 159.168
 225.819 c 178.551 249.709 l 196.492 249.709 l 199.805 249.709 202.492 252.393
 202.492 255.709 c 202.492 259.022 199.805 261.709 196.492 261.709 c 175.691
 261.709 l 173.883 261.709 172.172 260.893 171.031 259.487 c 160.508 246.518
 l 160.508 255.709 l 160.508 259.022 157.824 261.709 154.508 261.709 c 148.98
 261.709 l 137.305 261.709 127.84 271.174 127.84 282.846 c 127.84 340.061
 l 127.84 351.737 137.305 361.202 148.98 361.202 c 259.82 361.202 l 271.496
 361.202 280.961 351.737 280.961 340.061 c 280.961 282.846 l 280.961 271.174
 271.496 261.709 259.82 261.709 c 235.531 261.709 l 232.219 261.709 229.531
 259.022 229.531 255.709 c 229.531 252.393 232.219 249.709 235.531 249.709
 c 259.82 249.709 l 278.125 249.709 292.961 264.545 292.961 282.846 c 292.961
 340.061 l 292.961 358.362 278.125 373.202 259.82 373.202 c h
259.82 373.202 m f
234.219 172.401 m 123.379 172.401 l 105.105 172.401 90.238 157.534 90.238
 139.26 c 90.238 82.049 l 90.238 63.776 105.105 48.909 123.379 48.909 c 
204.652 48.909 l 224.031 25.018 l 225.195 23.588 226.918 22.799 228.691 
22.799 c 229.363 22.799 230.043 22.913 230.699 23.147 c 233.094 23.995 234.691
 26.26 234.691 28.799 c 234.691 48.913 l 252.75 49.166 267.359 63.932 267.359
 82.049 c 267.359 139.26 l 267.359 157.534 252.492 172.401 234.219 172.401
 c h
255.359 82.049 m 255.359 70.393 245.875 60.909 234.219 60.909 c 228.691
 60.909 l 225.375 60.909 222.691 58.225 222.691 54.909 c 222.691 45.717 
l 212.168 58.69 l 211.027 60.092 209.316 60.909 207.508 60.909 c 123.379
 60.909 l 111.723 60.909 102.238 70.393 102.238 82.049 c 102.238 139.26 
l 102.238 150.916 111.723 160.401 123.379 160.401 c 234.223 160.401 l 245.875
 160.401 255.359 150.916 255.359 139.26 c h
255.359 82.049 m f
96.801 219.108 m 96.801 232.416 l 96.801 250.721 83.215 265.901 65.602 
268.424 c 65.602 282.913 l 83.793 289.608 96.801 307.112 96.801 327.6 c 
96.801 353.33 l 113.754 358.952 125.602 374.995 125.602 393.233 c 125.602
 402.256 118.258 409.6 109.234 409.6 c 45.496 409.6 l 21.293 409.6 1.602
 389.909 1.602 365.705 c 1.602 327.6 l 1.602 307.721 13.855 290.659 31.199
 283.545 c 31.199 268.424 l 13.586 265.901 0 250.721 0 232.416 c 0 219.108
 l 0 211.221 6.418 204.799 14.309 204.799 c 82.492 204.799 l 90.379 204.799
 96.801 211.221 96.801 219.108 c h
13.602 327.6 m 13.602 351.998 l 34 351.998 l 37.312 351.998 40 354.686 
40 357.998 c 40 361.315 37.312 363.998 34 363.998 c 13.602 363.998 l 13.602
 365.705 l 13.602 383.291 27.91 397.6 45.496 397.6 c 109.234 397.6 l 111.641
 397.6 113.602 395.643 113.602 393.233 c 113.602 379.291 103.918 367.155
 90.445 363.998 c 57.199 363.998 l 53.887 363.998 51.199 361.315 51.199 
357.998 c 51.199 354.686 53.887 351.998 57.199 351.998 c 84.801 351.998 
l 84.801 327.6 l 84.801 307.971 68.828 291.998 49.199 291.998 c 29.57 291.998
 13.602 307.971 13.602 327.6 c h
49.199 279.998 m 50.684 279.998 52.152 280.077 53.602 280.209 c 53.602 
268.799 l 43.199 268.799 l 43.199 280.393 l 45.168 280.143 47.168 279.998
 49.199 279.998 c h
84.801 219.108 m 84.801 217.834 83.766 216.799 82.492 216.799 c 14.309 
216.799 l 13.035 216.799 12 217.834 12 219.108 c 12 232.416 l 12 245.862
 22.938 256.799 36.383 256.799 c 60.418 256.799 l 73.863 256.799 84.801 
245.862 84.801 232.416 c h
84.801 219.108 m f
391.562 181.819 m 379.934 193.272 364.551 199.428 348.262 199.194 c 315.477
 198.694 288.801 171.229 288.801 137.975 c 288.801 65.686 l 288.801 55.155
 293.676 45.288 301.781 38.85 c 300.629 35.307 300 31.538 300 27.62 c 300
 14.311 l 300 6.42 306.418 -0.002 314.309 -0.002 c 382.492 -0.002 l 390.379
 -0.002 396.801 6.42 396.801 14.311 c 396.801 27.62 l 396.801 30.545 396.445
 33.389 395.789 36.12 c 404.438 42.561 409.602 52.799 409.602 63.6 c 409.602
 138.799 l 409.602 155.084 403.195 170.362 391.562 181.819 c h
384.801 14.311 m 384.801 13.038 383.766 11.998 382.492 11.998 c 314.309
 11.998 l 313.035 11.998 312 13.038 312 14.311 c 312 27.62 l 312 41.061 
322.938 51.998 336.383 51.998 c 360.418 51.998 l 373.863 51.998 384.801 
41.061 384.801 27.616 c h
349.199 87.202 m 333.098 87.202 320 100.299 320 116.401 c 320 127.288 l
 341.125 128.608 358.293 144.768 361.176 165.44 c 371.465 160.83 378.398
 150.514 378.398 138.799 c 378.398 116.401 l 378.398 100.299 365.301 87.202
 349.199 87.202 c h
349.199 75.202 m 350.688 75.202 352.152 75.284 353.602 75.436 c 353.602
 63.998 l 343.199 63.998 l 343.199 75.643 l 345.16 75.354 347.16 75.202 
349.199 75.202 c h
397.602 63.6 m 397.602 57.545 395.098 51.76 390.801 47.596 c 385.191 56.1
 376.117 62.12 365.602 63.623 c 365.602 78.616 l 380.18 84.967 390.398 99.51
 390.398 116.401 c 390.398 138.799 l 390.398 158.709 376.199 175.752 356.629
 179.319 c 354.836 179.647 352.98 179.135 351.605 177.936 c 350.227 176.729
 349.477 174.963 349.559 173.139 c 349.586 172.627 349.602 172.116 349.602
 171.6 c 349.602 153.733 335.066 139.202 317.199 139.202 c 316.383 139.202
 315.496 139.241 314.492 139.323 c 312.816 139.467 311.168 138.893 309.934
 137.756 c 308.703 136.62 308 135.018 308 133.342 c 308 116.401 l 308 100.131
 317.477 86.041 331.199 79.346 c 331.199 63.623 l 321.594 62.248 313.188
 57.104 307.527 49.741 c 303.293 53.881 300.801 59.612 300.801 65.686 c 
300.801 137.975 l 300.801 164.713 322.176 186.795 348.445 187.194 c 361.523
 187.393 373.82 182.448 383.141 173.268 c 392.465 164.084 397.602 151.846
 397.602 138.799 c h
397.602 63.6 m f
Q Q
showpage
%%Trailer
end restore
%%EOF
