%!PS-Adobe-3.0 EPSF-3.0
%%Creator: cairo 1.14.2 (http://cairographics.org)
%%CreationDate: Mon Feb 19 09:15:05 2018
%%Pages: 1
%%DocumentData: Clean7Bit
%%LanguageLevel: 2
%%BoundingBox: 0 16 410 393
%%EndComments
%%BeginProlog
save
50 dict begin
/q { gsave } bind def
/Q { grestore } bind def
/cm { 6 array astore concat } bind def
/w { setlinewidth } bind def
/J { setlinecap } bind def
/j { setlinejoin } bind def
/M { setmiterlimit } bind def
/d { setdash } bind def
/m { moveto } bind def
/l { lineto } bind def
/c { curveto } bind def
/h { closepath } bind def
/re { exch dup neg 3 1 roll 5 3 roll moveto 0 rlineto
      0 exch rlineto 0 rlineto closepath } bind def
/S { stroke } bind def
/f { fill } bind def
/f* { eofill } bind def
/n { newpath } bind def
/W { clip } bind def
/W* { eoclip } bind def
/BT { } bind def
/ET { } bind def
/pdfmark where { pop globaldict /?pdfmark /exec load put }
    { globaldict begin /?pdfmark /pop load def /pdfmark
    /cleartomark load def end } ifelse
/BDC { mark 3 1 roll /BDC pdfmark } bind def
/EMC { mark /EMC pdfmark } bind def
/cairo_store_point { /cairo_point_y exch def /cairo_point_x exch def } def
/Tj { show currentpoint cairo_store_point } bind def
/TJ {
  {
    dup
    type /stringtype eq
    { show } { -0.001 mul 0 cairo_font_matrix dtransform rmoveto } ifelse
  } forall
  currentpoint cairo_store_point
} bind def
/cairo_selectfont { cairo_font_matrix aload pop pop pop 0 0 6 array astore
    cairo_font exch selectfont cairo_point_x cairo_point_y moveto } bind def
/Tf { pop /cairo_font exch def /cairo_font_matrix where
      { pop cairo_selectfont } if } bind def
/Td { matrix translate cairo_font_matrix matrix concatmatrix dup
      /cairo_font_matrix exch def dup 4 get exch 5 get cairo_store_point
      /cairo_font where { pop cairo_selectfont } if } bind def
/Tm { 2 copy 8 2 roll 6 array astore /cairo_font_matrix exch def
      cairo_store_point /cairo_font where { pop cairo_selectfont } if } bind def
/g { setgray } bind def
/rg { setrgbcolor } bind def
/d1 { setcachedevice } bind def
%%EndProlog
%%BeginSetup
%%EndSetup
%%Page: 1 1
%%BeginPageSetup
%%PageBoundingBox: 0 16 410 393
%%EndPageSetup
q 0 16 410 377 rectclip q
0.917647 0.231373 0.219608 rg
301.641 367.189 m 298.789 370.041 297.613 374.123 298.605 378.24 c 298.848
 379.255 299.242 380.232 299.777 381.127 c 302.125 385.076 306.27 387.209
 310.688 386.884 c 313.527 386.677 316.172 385.349 318.188 383.334 c 319.426
 382.095 l 320.664 383.337 l 322.676 385.345 325.309 386.673 328.145 386.888
 c 332.551 387.212 336.688 385.099 339.051 381.166 c 339.586 380.271 339.988
 379.295 340.234 378.283 c 341.242 374.15 340.066 370.052 337.207 367.189
 c 325.629 355.572 l 322.207 352.134 316.645 352.134 313.223 355.572 c h
301.641 367.189 m f
0.894118 0.00392157 0.211765 rg
314.789 367.189 m 311.938 370.041 310.762 374.123 311.75 378.24 c 311.996
 379.255 312.391 380.232 312.922 381.13 c 313.828 382.65 315.004 383.9 316.355
 384.845 c 314.676 385.998 312.734 386.736 310.684 386.888 c 306.27 387.209
 302.125 385.076 299.777 381.13 c 299.242 380.232 298.848 379.255 298.602
 378.24 c 297.613 374.123 298.789 370.041 301.641 367.189 c 313.219 355.572
 l 316.641 352.134 322.203 352.134 325.625 355.572 c 325.996 355.943 l h
314.789 367.189 m f
0.917647 0.231373 0.219608 rg
160.566 326.31 m 157.715 329.162 156.535 333.24 157.527 337.361 c 157.77
 338.373 158.168 339.353 158.699 340.248 c 161.047 344.197 165.191 346.326
 169.609 346.005 c 172.453 345.798 175.094 344.47 177.109 342.455 c 178.348
 341.216 l 179.59 342.459 l 181.598 344.466 184.234 345.795 187.07 346.005
 c 191.473 346.334 195.609 344.22 197.973 340.287 c 198.512 339.392 198.91
 338.416 199.156 337.404 c 200.164 333.267 198.992 329.17 196.133 326.31
 c 184.551 314.689 l 181.129 311.255 175.566 311.255 172.145 314.689 c h
160.566 326.31 m f
0.937255 0.72549 0.247059 rg
361.293 300.173 m 212.48 300.173 l 205.023 300.173 198.953 294.103 198.953
 286.642 c 198.953 260.896 l 198.668 181.166 l 307.191 181.166 l 307.191
 152.755 l 330.238 181.166 l 361.293 181.166 l 368.75 181.166 374.82 187.232
 374.82 194.693 c 374.82 286.642 l 374.82 294.103 368.75 300.173 361.293
 300.173 c h
361.293 300.173 m f
0.788235 0.517647 0.0352941 rg
361.293 300.173 m 212.48 300.173 l 205.023 300.173 198.953 293.58 198.953
 285.478 c 198.953 257.509 l 256.027 225.216 l 286.887 205.185 l 374.82 
262.263 l 374.82 285.478 l 374.82 293.58 368.75 300.173 361.293 300.173 
c h
361.293 300.173 m f
0.909804 0.662745 0.176471 rg
266.699 181.166 m 266.699 248.744 l 266.699 260.443 257.18 269.962 245.48
 269.962 c 198.953 269.962 l 198.953 260.896 l 198.668 181.166 l h
266.699 181.166 m f
1 0.811765 0.34902 rg
369.711 184.123 m 372.336 186.216 374.156 189.267 374.66 192.74 c 374.699
 192.994 374.734 193.248 374.758 193.494 c 374.793 193.888 374.82 194.291
 374.82 194.693 c 374.82 266.205 l 313.539 229.584 l h
369.711 184.123 m f
0.886275 0.603922 0.0470588 rg
318.406 225.646 m 374.82 262.263 l 374.82 266.205 l 313.539 229.584 l h
318.406 225.646 m f
0.956863 0.67451 0.270588 rg
361.293 300.173 m 212.48 300.173 l 205.023 300.173 198.953 294.103 198.953
 286.642 c 198.953 260.896 l 256.027 231.166 l 286.887 212.724 l 374.82 
265.271 l 374.82 286.642 l 374.82 294.103 368.75 300.173 361.293 300.173
 c h
361.293 300.173 m f
0.929412 0.596078 0.160784 rg
266.699 224.787 m 266.699 248.744 l 266.699 260.443 257.18 269.962 245.48
 269.962 c 198.953 269.962 l 198.953 260.896 l 256.027 231.166 l h
266.699 224.787 m f
1 0.811765 0.34902 rg
99.434 111.513 m 54.277 111.513 l 43.535 111.513 34.793 120.255 34.793 
131.002 c 34.793 242.209 l 34.793 252.955 43.531 261.697 54.277 261.697 
c 237.34 261.697 l 248.086 261.697 256.828 252.955 256.828 242.209 c 256.828
 131.002 l 256.828 120.255 248.086 111.513 237.34 111.513 c 128.402 111.513
 l 99.43 75.802 l 99.43 111.513 l h
99.434 111.513 m f
0.886275 0.603922 0.0470588 rg
34.793 212.99 m 34.793 240.099 l 34.793 252.029 43.516 261.697 54.277 261.697
 c 237.34 261.697 l 248.102 261.697 256.828 252.025 256.828 240.099 c 256.828
 212.994 l 145.809 139.459 l h
34.793 212.99 m f
0.909804 0.698039 0.227451 rg
87.648 131.002 m 87.648 242.209 l 87.648 252.955 96.391 261.697 107.137
 261.697 c 54.277 261.697 l 43.535 261.697 34.793 252.955 34.793 242.209
 c 34.793 131.002 l 34.793 120.255 43.531 111.513 54.277 111.513 c 99.434
 111.513 l 99.434 75.802 l 128.406 111.513 l 107.137 111.513 l 96.391 111.513
 87.648 120.255 87.648 131.002 c h
87.648 131.002 m f
0.788235 0.513726 0.0235294 rg
87.648 242.209 m 87.648 252.955 96.391 261.697 107.137 261.697 c 54.273
 261.697 l 43.516 261.693 34.793 252.025 34.793 240.099 c 34.793 212.99 
l 87.652 177.978 l 87.652 242.209 l h
87.648 242.209 m f
0.937255 0.72549 0.247059 rg
239.41 111.627 m 243.566 112.064 247.332 113.818 250.297 116.459 c 180.41
 173.021 l 145.809 152.345 l 111.211 173.021 l 41.324 116.459 l 44.285 113.818
 48.055 112.064 52.211 111.627 c 53.07 111.564 l 53.473 111.537 53.871 111.513
 54.277 111.513 c 99.434 111.513 l 99.434 75.802 l 128.406 111.513 l 237.344
 111.513 l 237.75 111.513 238.152 111.537 238.551 111.564 c h
239.41 111.627 m f
0.788235 0.517647 0.0352941 rg
145.809 139.459 m 187.645 167.166 l 180.406 173.021 l 145.809 152.345 l
 111.211 173.021 l 103.977 167.166 l h
145.809 139.459 m f
0.909804 0.662745 0.176471 rg
87.648 131.002 m 87.648 153.955 l 41.324 116.459 l 41.691 116.13 42.074
 115.818 42.465 115.517 c 42.469 115.513 42.469 115.513 42.473 115.509 c
 42.855 115.22 43.246 114.943 43.652 114.677 c 43.684 114.658 43.711 114.638
 43.742 114.619 c 44.539 114.107 45.375 113.65 46.242 113.255 c 46.289 113.232
 46.34 113.212 46.387 113.189 c 46.82 112.998 47.258 112.818 47.707 112.658
 c 47.723 112.65 47.738 112.646 47.75 112.642 c 48.188 112.486 48.633 112.345
 49.082 112.22 c 49.129 112.209 49.172 112.197 49.219 112.185 c 49.672 112.06
 50.133 111.955 50.598 111.865 c 50.656 111.853 50.719 111.845 50.777 111.834
 c 51.25 111.748 51.727 111.673 52.207 111.623 c 53.066 111.564 l 53.469
 111.537 53.867 111.513 54.273 111.513 c 99.43 111.513 l 99.43 75.802 l 
128.402 111.513 l 107.133 111.513 l 96.391 111.513 87.648 120.255 87.648
 131.002 c h
87.648 131.002 m f
0.956863 0.67451 0.270588 rg
34.793 217.755 m 34.793 242.212 l 34.793 252.974 43.516 261.697 54.277 
261.697 c 237.34 261.697 l 248.102 261.697 256.828 252.974 256.828 242.212
 c 256.828 217.755 l 145.809 151.416 l h
34.793 217.755 m f
0.929412 0.596078 0.160784 rg
87.648 242.209 m 87.648 252.955 96.391 261.697 107.137 261.697 c 54.277
 261.697 l 43.535 261.697 34.793 252.955 34.793 242.209 c 34.793 217.755
 l 87.652 186.17 l 87.652 242.209 l h
87.648 242.209 m f
0.917647 0.231373 0.219608 rg
348.648 63.072 m 345.566 66.154 343.867 70.255 343.867 74.623 c 343.867
 80.427 346.867 85.763 352.129 88.861 c 353.312 89.556 354.594 90.084 355.922
 90.42 c 361.812 91.912 367.672 90.255 371.754 86.177 c 373.93 83.998 l 
375.824 85.892 l 378.863 88.931 382.918 90.837 387.219 90.951 c 392.629 
91.091 397.676 88.63 400.938 84.158 c 402.465 82.064 403.457 79.599 403.82
 77.037 c 404.566 71.787 402.859 66.716 399.211 63.072 c 380.133 43.927 
l 376.711 40.49 371.148 40.49 367.727 43.927 c h
348.648 63.072 m f
226.293 63.392 m 223.441 66.244 222.266 70.326 223.258 74.443 c 223.5 75.459
 223.895 76.435 224.43 77.334 c 226.777 81.279 230.922 83.412 235.336 83.091
 c 238.18 82.884 240.824 81.552 242.84 79.537 c 244.074 78.298 l 245.316
 79.541 l 247.328 81.552 249.961 82.88 252.797 83.091 c 257.203 83.42 261.34
 81.302 263.703 77.369 c 264.238 76.478 264.641 75.502 264.887 74.486 c 
265.895 70.353 264.719 66.255 261.859 63.396 c 250.281 51.775 l 246.859 
48.341 241.297 48.341 237.871 51.775 c h
226.293 63.392 m f
33.148 37.08 m 31.355 38.877 30.367 41.259 30.367 43.795 c 30.367 46.33
 31.355 48.712 33.145 50.505 c 34.895 52.255 37.34 53.259 39.859 53.259 
c 42.375 53.259 44.82 52.255 46.57 50.505 c 47.691 49.388 l 48.809 50.505
 l 50.559 52.255 53.004 53.259 55.523 53.259 c 58.039 53.259 60.484 52.255
 62.234 50.505 c 64.027 48.712 65.012 46.33 65.012 43.795 c 65.012 41.259
 64.027 38.877 62.234 37.084 c 53.895 28.712 l 50.473 25.279 44.91 25.279
 41.488 28.712 c h
33.148 37.08 m f
13.094 349.642 m 12.816 350.009 l 10.387 352.439 l 7.301 355.521 5.605 
359.623 5.605 363.99 c 5.605 369.795 8.602 375.13 13.867 378.228 c 15.047
 378.923 16.328 379.451 17.66 379.787 c 23.547 381.283 29.406 379.627 33.488
 375.545 c 35.664 373.369 l 37.559 375.259 l 40.598 378.298 44.656 380.205
 48.953 380.318 c 54.363 380.459 59.41 377.998 62.672 373.525 c 64.199 371.431
 65.191 368.97 65.559 366.404 c 66.301 361.154 64.594 356.084 60.949 352.439
 c 58.523 350.013 l 58.266 349.67 l 41.859 333.259 l 38.441 329.841 32.895
 329.841 29.473 333.259 c h
13.094 349.642 m f
0.894118 0.00392157 0.211765 rg
178.676 327.771 m 175.824 330.623 174.648 334.705 175.637 338.826 c 175.883
 339.837 176.277 340.814 176.812 341.712 c 176.941 341.931 177.078 342.138
 177.219 342.345 c 177.109 342.455 l 175.098 344.47 172.453 345.802 169.609
 346.009 c 165.191 346.33 161.051 344.197 158.699 340.252 c 158.168 339.353
 157.773 338.377 157.527 337.361 c 156.539 333.244 157.715 329.162 160.566
 326.31 c 172.145 314.693 l 175.566 311.259 181.129 311.259 184.551 314.693
 c 188.129 318.287 l h
178.676 327.771 m f
366.762 64.533 m 363.676 67.615 361.98 71.716 361.98 76.084 c 361.98 81.076
 364.203 85.716 368.168 88.888 c 364.566 90.908 360.254 91.517 355.926 90.42
 c 354.594 90.084 353.312 89.556 352.129 88.861 c 346.867 85.763 343.867
 80.427 343.867 74.623 c 343.867 70.255 345.566 66.154 348.648 63.072 c 
367.727 43.927 l 371.148 40.49 376.711 40.49 380.133 43.927 c 383.715 47.517
 l h
366.762 64.533 m f
244.406 64.857 m 241.555 67.709 240.375 71.787 241.367 75.908 c 241.609
 76.923 242.008 77.9 242.539 78.795 c 242.668 79.013 242.809 79.224 242.949
 79.431 c 242.84 79.541 l 240.824 81.556 238.18 82.884 235.34 83.091 c 230.922
 83.412 226.777 81.283 224.43 77.334 c 223.898 76.439 223.5 75.459 223.258
 74.447 c 222.266 70.326 223.445 66.244 226.293 63.396 c 237.871 51.775 
l 241.293 48.341 246.855 48.341 250.277 51.775 c 253.859 55.369 l h
244.406 64.857 m f
51.262 38.541 m 49.465 40.337 48.477 42.72 48.477 45.255 c 48.477 47.791
 49.465 50.173 51.258 51.966 c 51.461 52.17 51.676 52.361 51.898 52.545 
c 50.746 52.076 49.691 51.384 48.812 50.505 c 47.691 49.384 l 46.57 50.505
 l 44.824 52.255 42.375 53.255 39.859 53.255 c 37.344 53.255 34.898 52.255
 33.148 50.505 c 31.355 48.712 30.367 46.33 30.367 43.795 c 30.367 41.259
 31.355 38.877 33.148 37.08 c 41.488 28.712 l 44.91 25.279 50.473 25.279
 53.895 28.712 c 57.477 32.306 l h
51.262 38.541 m f
31.203 351.103 m 30.93 351.47 l 28.496 353.9 l 25.414 356.982 23.715 361.087
 23.715 365.451 c 23.715 370.443 25.938 375.084 29.902 378.255 c 26.301 
380.275 21.988 380.884 17.66 379.787 c 16.328 379.451 15.047 378.923 13.867
 378.228 c 8.605 375.134 5.605 369.795 5.605 363.99 c 5.605 359.623 7.301
 355.521 10.387 352.439 c 12.816 350.009 l 13.094 349.642 l 29.473 333.263
 l 32.895 329.841 38.438 329.841 41.859 333.263 c 45.453 336.853 l h
31.203 351.103 m f
0 g
361.293 305.783 m 212.48 305.783 l 201.93 305.783 193.344 297.197 193.344
 286.642 c 193.344 267.306 l 54.277 267.306 l 40.438 267.306 29.18 256.048
 29.18 242.209 c 29.18 131.002 l 29.18 117.162 40.438 105.904 54.277 105.904
 c 93.82 105.904 l 93.82 76.931 l 93.82 74.388 95.426 72.119 97.824 71.267
 c 98.48 71.033 99.16 70.92 99.832 70.92 c 101.609 70.92 103.336 71.709 
104.5 73.142 c 131.078 105.9 l 237.34 105.9 l 251.18 105.9 262.438 117.162
 262.438 130.998 c 262.438 175.552 l 301.578 175.552 l 301.578 153.884 l
 301.578 151.337 303.184 149.068 305.582 148.216 c 306.238 147.986 306.918
 147.873 307.59 147.873 c 309.367 147.873 311.098 148.662 312.258 150.095
 c 332.914 175.552 l 361.293 175.552 l 371.844 175.552 380.43 184.138 380.43
 194.689 c 380.43 286.642 l 380.43 297.197 371.844 305.783 361.293 305.783
 c h
237.34 117.927 m 128.211 117.927 l 126.402 117.927 124.688 117.111 123.543
 115.705 c 105.844 93.888 l 105.844 111.916 l 105.844 115.236 103.152 117.927
 99.832 117.927 c 54.277 117.927 l 53.977 117.927 53.684 117.951 53.387 
117.974 c 111.766 165.224 l 142.727 146.72 l 143.676 146.154 144.742 145.869
 145.809 145.869 c 146.879 145.869 147.945 146.154 148.895 146.72 c 179.855
 165.224 l 238.234 117.974 l 237.938 117.951 237.641 117.927 237.34 117.927
 c h
250.414 131.002 m 250.414 128.716 249.824 126.572 248.789 124.701 c 248.52
 125.045 248.211 125.369 247.855 125.654 c 190.848 171.791 l 250.414 207.384
 l h
250.414 221.396 m 145.809 158.884 l 92.277 190.877 l 89.91 192.287 86.891
 191.912 84.941 189.966 c 82.172 187.197 82.746 182.564 86.109 180.552 c
 100.77 171.795 l 43.766 125.654 l 43.41 125.369 43.102 125.048 42.828 124.705
 c 41.797 126.572 41.203 128.72 41.203 131.002 c 41.203 207.388 l 51.48 
201.248 l 53.844 199.834 56.867 200.209 58.812 202.158 c 61.582 204.927 
61.008 209.56 57.648 211.568 c 41.203 221.396 l 41.203 242.212 l 41.203 
249.431 47.059 255.287 54.277 255.287 c 237.34 255.287 l 244.562 255.287
 250.414 249.431 250.414 242.212 c h
330.047 187.576 m 328.238 187.576 326.523 186.759 325.379 185.353 c 313.602
 170.837 l 313.602 181.568 l 313.602 184.888 310.91 187.58 307.59 187.58
 c 262.438 187.58 l 262.438 220.798 l 283.805 208.029 l 284.754 207.462 
285.82 207.177 286.887 207.177 c 287.953 207.177 289.023 207.462 289.973
 208.029 c 313.719 222.22 l 356.523 187.576 l h
368.406 194.693 m 368.406 194.291 368.367 193.896 368.301 193.513 c 324.711
 228.791 l 368.406 254.9 l h
368.406 268.908 m 286.887 220.193 l 262.438 234.802 l 262.438 242.209 l
 262.438 256.048 251.18 267.306 237.34 267.306 c 205.367 267.306 l 205.367
 286.642 l 205.367 290.568 208.559 293.759 212.48 293.759 c 361.293 293.759
 l 365.215 293.759 368.406 290.568 368.406 286.642 c h
368.406 268.908 m f
34.199 321.861 m 34.695 321.732 35.203 321.67 35.711 321.67 c 37.25 321.67
 38.789 322.255 39.961 323.427 c 62.5 345.966 l 62.707 346.173 62.898 346.392
 63.066 346.623 c 64.918 348.47 l 73.477 357.029 73.477 370.955 64.918 379.513
 c 60.77 383.658 55.258 385.943 49.398 385.943 c 44.344 385.943 39.551 384.244
 35.668 381.123 c 31.785 384.244 26.992 385.943 21.938 385.943 c 16.074 
385.943 10.562 383.658 6.418 379.513 c -2.141 370.955 -2.141 357.029 6.418
 348.47 c 8.262 346.627 l 8.434 346.396 8.625 346.177 8.832 345.966 c 31.371
 323.427 l 32.152 322.646 33.137 322.115 34.199 321.861 c h
17.379 354.513 m 14.918 356.974 l 11.051 360.841 11.051 367.138 14.918 
371.009 c 16.793 372.884 19.285 373.916 21.938 373.916 c 24.59 373.916 27.082
 372.884 28.957 371.009 c 31.414 368.548 l 32.543 367.423 34.07 366.791 
35.668 366.791 c 37.262 366.791 38.789 367.423 39.918 368.548 c 42.375 371.009
 l 46.246 374.877 52.543 374.877 56.414 371.009 c 60.281 367.138 60.281 
360.841 56.414 356.974 c 53.953 354.513 l 53.75 354.31 53.566 354.095 53.398
 353.869 c 35.668 336.134 l 17.953 353.853 l 17.777 354.084 17.59 354.302
 17.379 354.513 c h
17.379 354.513 m f
403.18 90.142 m 399.035 94.291 393.523 96.572 387.66 96.572 c 382.605 96.572
 377.812 94.877 373.93 91.752 c 370.047 94.877 365.258 96.572 360.203 96.572
 c 354.34 96.572 348.828 94.291 344.684 90.142 c 336.125 81.587 336.125 
67.662 344.684 59.103 c 346.527 57.259 l 346.695 57.029 346.891 56.806 347.098
 56.599 c 369.637 34.06 l 370.418 33.279 371.402 32.744 372.461 32.49 c 
372.957 32.365 373.469 32.298 373.977 32.298 c 375.516 32.298 377.055 32.884
 378.227 34.06 c 400.766 56.599 l 400.973 56.806 401.164 57.025 401.332 
57.255 c 403.18 59.103 l 411.738 67.662 411.738 81.587 403.18 90.142 c h
394.68 67.603 m 392.219 65.146 l 392.016 64.943 391.832 64.728 391.664 
64.498 c 373.93 46.767 l 356.215 64.486 l 356.043 64.712 355.852 64.935 
355.645 65.146 c 353.184 67.603 l 349.312 71.474 349.312 77.771 353.184 
81.642 c 355.059 83.517 357.551 84.548 360.203 84.548 c 362.855 84.548 365.348
 83.513 367.219 81.642 c 369.68 79.181 l 370.809 78.052 372.336 77.42 373.93
 77.42 c 375.527 77.42 377.055 78.056 378.184 79.181 c 380.641 81.642 l 
384.512 85.509 390.809 85.509 394.68 81.642 c 398.547 77.771 398.547 71.474
 394.68 67.603 c h
394.68 67.603 m f
157.801 321.138 m 157.949 320.947 158.113 320.763 158.289 320.591 c 174.066
 304.81 l 174.855 304.021 175.852 303.482 176.926 303.228 c 177.398 303.111
 177.887 303.052 178.379 303.052 c 179.973 303.052 181.504 303.685 182.629
 304.81 c 198.406 320.587 l 198.578 320.763 198.742 320.943 198.891 321.134
 c 200.098 322.341 l 206.793 329.037 206.793 339.927 200.098 346.623 c 196.855
 349.865 192.543 351.65 187.957 351.65 c 184.48 351.65 181.164 350.623 178.348
 348.712 c 175.531 350.623 172.215 351.65 168.734 351.65 c 164.152 351.65
 159.84 349.865 156.598 346.623 c 149.902 339.927 149.902 329.037 156.598
 322.341 c h
165.098 338.123 m 167.105 340.127 170.367 340.127 172.375 338.123 c 174.098
 336.4 l 175.223 335.271 176.754 334.638 178.348 334.638 c 179.941 334.638
 181.469 335.271 182.598 336.4 c 184.32 338.123 l 185.289 339.091 186.582
 339.627 187.957 339.627 c 189.332 339.627 190.625 339.095 191.594 338.123
 c 193.602 336.115 193.602 332.853 191.594 330.845 c 189.875 329.127 l 189.699
 328.951 189.539 328.771 189.391 328.58 c 178.348 317.537 l 167.305 328.576
 l 167.156 328.767 166.992 328.951 166.82 329.127 c 165.098 330.845 l 163.094
 332.849 163.094 336.115 165.098 338.123 c h
165.098 338.123 m f
298.879 362.021 m 299.027 361.83 299.188 361.646 299.363 361.47 c 315.141
 345.693 l 315.934 344.9 316.93 344.361 318.004 344.107 c 318.473 343.994
 318.961 343.931 319.457 343.931 c 321.051 343.931 322.578 344.564 323.707
 345.693 c 339.484 361.47 l 339.656 361.642 339.82 361.826 339.965 362.013
 c 341.176 363.224 l 347.867 369.916 347.867 380.806 341.176 387.502 c 337.934
 390.744 333.621 392.529 329.035 392.529 c 325.559 392.529 322.238 391.505
 319.426 389.595 c 316.609 391.505 313.289 392.529 309.812 392.529 c 305.227
 392.529 300.914 390.744 297.672 387.502 c 290.98 380.81 290.98 369.92 297.672
 363.22 c h
306.176 379.002 m 308.18 381.009 311.445 381.005 313.453 379.002 c 315.172
 377.279 l 316.301 376.154 317.828 375.521 319.422 375.521 c 321.02 375.521
 322.547 376.154 323.672 377.279 c 325.395 379.002 l 326.367 379.974 327.66
 380.509 329.035 380.509 c 330.406 380.509 331.699 379.974 332.672 379.002
 c 334.676 376.994 334.676 373.732 332.672 371.724 c 330.949 370.005 l 330.777
 369.83 330.617 369.65 330.469 369.462 c 319.422 358.416 l 308.379 369.459
 l 308.23 369.65 308.07 369.834 307.898 370.005 c 306.176 371.724 l 304.168
 373.732 304.168 376.998 306.176 379.002 c h
306.176 379.002 m f
253.688 88.736 m 250.211 88.736 246.891 87.709 244.074 85.798 c 241.262
 87.709 237.941 88.736 234.465 88.736 c 229.879 88.736 225.566 86.951 222.324
 83.709 c 215.629 77.013 215.629 66.123 222.324 59.427 c 223.527 58.224 
l 223.676 58.033 223.84 57.849 224.016 57.673 c 239.793 41.896 l 240.586
 41.107 241.578 40.564 242.656 40.314 c 243.125 40.197 243.613 40.134 244.105
 40.134 c 245.699 40.134 247.23 40.767 248.355 41.896 c 264.133 57.673 l
 264.309 57.845 264.469 58.029 264.617 58.216 c 265.824 59.427 l 272.52 
66.123 272.52 77.013 265.824 83.709 c 262.586 86.951 258.273 88.736 253.688
 88.736 c h
257.324 67.931 m 255.602 66.209 l 255.43 66.037 255.27 65.853 255.121 65.666
 c 244.074 54.619 l 233.035 65.662 l 232.883 65.853 232.723 66.037 232.551
 66.209 c 230.828 67.931 l 228.824 69.935 228.824 73.201 230.828 75.205 
c 232.836 77.212 236.098 77.212 238.105 75.205 c 239.828 73.486 l 240.953
 72.357 242.48 71.724 244.078 71.724 c 245.672 71.724 247.199 72.357 248.328
 73.482 c 250.051 75.205 l 251.02 76.177 252.312 76.712 253.688 76.712 c
 255.062 76.712 256.355 76.177 257.324 75.205 c 259.332 73.201 259.332 69.935
 257.324 67.931 c h
257.324 67.931 m f
66.203 54.474 m 63.348 57.326 59.555 58.9 55.523 58.9 c 52.719 58.9 50.027
 58.138 47.691 56.716 c 45.352 58.138 42.664 58.9 39.859 58.9 c 35.824 58.9
 32.031 57.326 29.18 54.474 c 26.328 51.623 24.754 47.83 24.754 43.795 c
 24.754 39.759 26.324 35.966 29.18 33.115 c 30.121 32.173 l 30.254 32.005
 30.402 31.841 30.555 31.689 c 43.414 18.83 l 44.301 17.943 45.402 17.392
 46.559 17.181 c 46.938 17.107 47.328 17.068 47.715 17.068 c 49.254 17.068
 50.793 17.658 51.965 18.83 c 64.824 31.689 l 64.977 31.841 65.121 32.002
 65.254 32.17 c 66.203 33.115 l 69.055 35.97 70.625 39.759 70.625 43.795
 c 70.625 47.83 69.055 51.623 66.203 54.474 c h
57.699 41.619 m 56.297 40.216 l 56.145 40.064 56 39.9 55.867 39.732 c 47.691
 31.56 l 39.523 39.728 l 39.387 39.896 39.238 40.06 39.086 40.216 c 37.684
 41.615 l 37.102 42.197 36.781 42.97 36.781 43.795 c 36.781 44.619 37.102
 45.388 37.684 45.97 c 38.848 47.134 40.875 47.134 42.039 45.97 c 43.441
 44.568 l 45.789 42.22 49.594 42.22 51.941 44.568 c 53.344 45.97 l 54.508
 47.134 56.535 47.134 57.699 45.97 c 58.281 45.388 58.602 44.619 58.602 
43.795 c 58.602 42.97 58.281 42.201 57.699 41.619 c h
57.699 41.619 m f
Q Q
showpage
%%Trailer
end restore
%%EOF
