%!PS-Adobe-3.0 EPSF-3.0
%%Creator: cairo 1.14.2 (http://cairographics.org)
%%CreationDate: Mon Feb 19 09:15:05 2018
%%Pages: 1
%%DocumentData: Clean7Bit
%%LanguageLevel: 2
%%BoundingBox: 56 -1 354 410
%%EndComments
%%BeginProlog
save
50 dict begin
/q { gsave } bind def
/Q { grestore } bind def
/cm { 6 array astore concat } bind def
/w { setlinewidth } bind def
/J { setlinecap } bind def
/j { setlinejoin } bind def
/M { setmiterlimit } bind def
/d { setdash } bind def
/m { moveto } bind def
/l { lineto } bind def
/c { curveto } bind def
/h { closepath } bind def
/re { exch dup neg 3 1 roll 5 3 roll moveto 0 rlineto
      0 exch rlineto 0 rlineto closepath } bind def
/S { stroke } bind def
/f { fill } bind def
/f* { eofill } bind def
/n { newpath } bind def
/W { clip } bind def
/W* { eoclip } bind def
/BT { } bind def
/ET { } bind def
/pdfmark where { pop globaldict /?pdfmark /exec load put }
    { globaldict begin /?pdfmark /pop load def /pdfmark
    /cleartomark load def end } ifelse
/BDC { mark 3 1 roll /BDC pdfmark } bind def
/EMC { mark /EMC pdfmark } bind def
/cairo_store_point { /cairo_point_y exch def /cairo_point_x exch def } def
/Tj { show currentpoint cairo_store_point } bind def
/TJ {
  {
    dup
    type /stringtype eq
    { show } { -0.001 mul 0 cairo_font_matrix dtransform rmoveto } ifelse
  } forall
  currentpoint cairo_store_point
} bind def
/cairo_selectfont { cairo_font_matrix aload pop pop pop 0 0 6 array astore
    cairo_font exch selectfont cairo_point_x cairo_point_y moveto } bind def
/Tf { pop /cairo_font exch def /cairo_font_matrix where
      { pop cairo_selectfont } if } bind def
/Td { matrix translate cairo_font_matrix matrix concatmatrix dup
      /cairo_font_matrix exch def dup 4 get exch 5 get cairo_store_point
      /cairo_font where { pop cairo_selectfont } if } bind def
/Tm { 2 copy 8 2 roll 6 array astore /cairo_font_matrix exch def
      cairo_store_point /cairo_font where { pop cairo_selectfont } if } bind def
/g { setgray } bind def
/rg { setrgbcolor } bind def
/d1 { setcachedevice } bind def
%%EndProlog
%%BeginSetup
%%EndSetup
%%Page: 1 1
%%BeginPageSetup
%%PageBoundingBox: 56 -1 354 410
%%EndPageSetup
q 56 -1 298 411 rectclip q
0.909804 0.882353 0.839216 rg
243.398 149.558 m 90.387 149.558 l 104.98 156.839 l 112.09 160.382 117.051
 167.265 117.84 175.167 c 117.859 175.339 l 117.988 178.034 l 117.988 341.816
 l 117.988 345.667 121.109 348.792 124.961 348.792 c 340.652 348.792 l 344.504
 348.792 347.629 345.667 347.629 341.816 c 347.629 177.96 l 347.629 162.273
 334.91 149.558 319.223 149.558 c 279.348 149.558 l 264.75 118.148 l 263.5
 115.464 259.691 115.445 258.414 118.116 c h
243.398 149.558 m f
0.764706 0.854902 0.25098 rg
141.191 295.163 m 141.191 319.202 l 141.191 322.288 143.691 324.784 146.773
 324.784 c 223.621 324.784 l 226.707 324.784 229.203 322.284 229.203 319.202
 c 229.203 295.163 l 229.203 292.077 226.703 289.581 223.621 289.581 c 146.773
 289.581 l 143.688 289.581 141.191 292.077 141.191 295.163 c h
141.191 295.163 m f
0.678431 0.737255 0.0823529 rg
223.621 324.788 m 146.773 324.788 l 143.688 324.788 141.191 322.288 141.191
 319.202 c 141.191 314.386 l 208.914 314.386 l 212 314.386 214.496 311.886
 214.496 308.8 c 214.496 289.581 l 223.621 289.581 l 226.707 289.581 229.203
 292.081 229.203 295.163 c 229.203 319.202 l 229.207 322.288 226.707 324.788
 223.621 324.788 c h
223.621 324.788 m f
0.886275 0.8 0.686275 rg
90.383 149.558 m 74.719 149.558 61.977 162.3 61.977 177.96 c 61.977 397.027
 l 61.977 400.87 65.105 403.999 68.949 403.999 c 301.445 403.999 l 305.289
 403.999 308.418 400.87 308.418 397.027 c 308.418 347.991 l 124.957 347.991
 l 121.555 347.991 118.785 345.222 118.785 341.816 c 118.785 178.03 l 118.656
 175.28 l 118.656 175.28 118.656 175.292 118.656 175.3 c 117.293 160.624
 105.145 149.558 90.383 149.558 c h
90.383 149.558 m f
0.839216 0.709804 0.556863 rg
115.488 328.07 m 111.262 328.07 107.832 324.64 107.832 320.413 c 107.832
 188.714 l 107.703 185.968 l 107.699 185.968 107.703 185.976 107.703 185.988
 c 106.34 171.308 94.191 160.238 79.426 160.238 c 74.5 160.238 69.863 161.499
 65.82 163.718 c 70.742 155.257 79.906 149.554 90.379 149.554 c 105.145 
149.554 117.297 160.62 118.656 175.3 c 118.656 175.292 118.656 175.28 118.656
 175.28 c 118.785 178.03 l 118.785 328.07 l h
115.488 328.07 m f
1 0.384314 0.654902 rg
297.695 3.929 m 230.328 3.929 l 226.613 3.929 223.605 6.941 223.605 10.655
 c 223.605 23.534 l 223.605 45.851 241.695 63.941 264.012 63.941 c 286.328
 63.941 304.418 45.851 304.418 23.534 c 304.418 10.655 l 304.418 6.941 301.406
 3.929 297.695 3.929 c h
297.695 3.929 m f
0.988235 0.329412 0.47451 rg
248.473 10.655 m 248.473 23.534 l 248.473 41.511 260.215 56.738 276.445
 61.984 c 272.527 63.249 268.352 63.941 264.012 63.941 c 241.695 63.941 
223.605 45.847 223.605 23.534 c 223.605 10.652 l 223.605 6.941 226.613 3.929
 230.328 3.929 c 255.195 3.929 l 251.484 3.929 248.473 6.941 248.473 10.655
 c h
248.473 10.655 m f
1 0.384314 0.654902 rg
263.586 42.269 m 249.637 42.269 238.289 53.616 238.289 67.566 c 238.289
 81.511 249.637 92.859 263.586 92.859 c 277.531 92.859 288.879 81.511 288.879
 67.566 c 288.879 53.62 277.531 42.269 263.586 42.269 c h
263.586 42.269 m f
0.988235 0.329412 0.47451 rg
263.156 67.566 m 263.156 76.995 268.348 85.234 276.02 89.581 c 272.344 
91.663 268.102 92.863 263.586 92.863 c 249.637 92.863 238.289 81.515 238.289
 67.57 c 238.289 53.62 249.637 42.273 263.586 42.273 c 268.102 42.273 272.344
 43.468 276.02 45.554 c 268.348 49.902 263.156 58.136 263.156 67.566 c h
263.156 67.566 m f
0 g
340.652 354.39 m 314.02 354.39 l 314.02 397.027 l 314.02 403.96 308.379
 409.601 301.445 409.601 c 68.949 409.601 l 62.016 409.601 56.375 403.96
 56.375 397.027 c 56.375 177.96 l 56.375 159.21 71.629 143.956 90.379 143.956
 c 239.863 143.956 l 256.195 109.765 l 257.191 107.679 259.301 106.347 261.609
 106.347 c 261.641 106.347 l 263.965 106.363 266.074 107.714 267.055 109.82
 c 282.918 143.956 l 319.219 143.956 l 337.969 143.956 353.227 159.21 353.227
 177.96 c 353.227 341.816 l 353.227 348.749 347.586 354.39 340.652 354.39
 c h
341.227 177.96 m 341.227 165.808 331.375 155.956 319.223 155.956 c 279.09
 155.956 l 276.754 155.956 274.633 154.601 273.648 152.484 c 261.535 126.429
 l 249.062 152.542 l 248.066 154.628 245.961 155.956 243.648 155.956 c 116.387
 155.956 l 120.734 161.105 123.578 167.605 124.238 174.831 c 124.289 175.363
 124.258 175.886 124.172 176.39 c 124.309 176.89 124.387 177.417 124.387
 177.96 c 124.387 215.706 l 124.387 219.023 121.699 221.71 118.387 221.71
 c 115.07 221.71 112.387 219.023 112.387 215.706 c 112.387 177.96 l 112.387
 177.616 112.422 177.277 112.477 176.948 c 112.387 176.62 112.32 176.277
 112.289 175.925 c 111.234 164.405 101.602 155.753 89.969 155.96 c 77.91
 156.175 68.379 166.312 68.379 178.374 c 68.379 397.027 l 68.379 397.343
 68.633 397.597 68.949 397.597 c 301.445 397.597 l 301.762 397.597 302.02
 397.343 302.02 397.027 c 302.02 354.39 l 124.957 354.39 l 118.016 354.39
 112.383 348.761 112.383 341.816 c 112.383 254.757 l 112.383 251.441 115.07
 248.753 118.387 248.753 c 121.699 248.753 124.387 251.441 124.387 254.757
 c 124.387 341.816 l 124.387 342.132 124.641 342.39 124.957 342.39 c 340.652
 342.39 l 340.969 342.39 341.223 342.132 341.223 341.816 c 341.223 177.96
 l h
341.227 177.96 m f
228.805 283.98 m 232.121 283.98 234.805 286.667 234.805 289.98 c 234.805
 324.386 l 234.805 327.698 232.121 330.386 228.805 330.386 c 141.59 330.386
 l 138.277 330.386 135.59 327.698 135.59 324.386 c 135.59 289.98 l 135.59
 286.667 138.277 283.98 141.59 283.98 c h
147.59 318.386 m 222.805 318.386 l 222.805 295.98 l 147.59 295.98 l h
147.59 318.386 m f
321.621 270.378 m 143.992 270.378 l 140.676 270.378 137.988 267.691 137.988
 264.374 c 137.988 261.062 140.676 258.374 143.992 258.374 c 321.621 258.374
 l 324.938 258.374 327.621 261.062 327.621 264.374 c 327.621 267.691 324.938
 270.378 321.621 270.378 c h
321.621 270.378 m f
321.621 239.171 m 143.992 239.171 l 140.676 239.171 137.988 236.484 137.988
 233.171 c 137.988 229.855 140.676 227.171 143.992 227.171 c 321.621 227.171
 l 324.938 227.171 327.621 229.859 327.621 233.171 c 327.621 236.484 324.938
 239.171 321.621 239.171 c h
321.621 239.171 m f
321.621 207.964 m 143.992 207.964 l 140.676 207.964 137.988 205.277 137.988
 201.964 c 137.988 198.652 140.676 195.964 143.992 195.964 c 321.621 195.964
 l 324.938 195.964 327.621 198.652 327.621 201.964 c 327.621 205.28 324.938
 207.964 321.621 207.964 c h
321.621 207.964 m f
299.762 43.89 m 296.625 42.82 294.953 39.405 296.023 36.269 c 297.078 33.171
 297.617 29.917 297.617 26.605 c 297.617 12.937 l 297.617 12.421 297.195
 12.003 296.68 12.003 c 231.16 12.003 l 230.645 12.003 230.227 12.421 230.227
 12.937 c 230.227 26.605 l 230.227 34.831 233.637 42.632 239.504 48.241 
c 245.172 41.191 253.859 36.671 263.586 36.671 c 280.621 36.671 294.48 50.53
 294.48 67.566 c 294.48 84.601 280.621 98.46 263.586 98.46 c 246.547 98.46
 232.688 84.601 232.688 67.566 c 232.688 64.679 233.094 61.886 233.84 59.234
 c 224.016 51.304 218.223 39.312 218.223 26.605 c 218.223 12.937 l 218.223
 5.804 224.027 -0.001 231.16 -0.001 c 296.68 -0.001 l 303.816 -0.001 309.621
 5.804 309.621 12.937 c 309.621 26.605 l 309.621 31.238 308.867 35.796 307.383
 40.148 c 306.312 43.284 302.902 44.96 299.762 43.89 c h
263.586 86.46 m 274.004 86.46 282.477 77.984 282.477 67.566 c 282.477 57.148
 274 48.671 263.586 48.671 c 253.168 48.671 244.691 57.148 244.691 67.566
 c 244.691 77.984 253.168 86.46 263.586 86.46 c h
263.586 86.46 m f
Q Q
showpage
%%Trailer
end restore
%%EOF
