%!PS-Adobe-3.0 EPSF-3.0
%%Creator: cairo 1.14.2 (http://cairographics.org)
%%CreationDate: Mon Feb 19 09:15:05 2018
%%Pages: 1
%%DocumentData: Clean7Bit
%%LanguageLevel: 2
%%BoundingBox: 16 -1 393 410
%%EndComments
%%BeginProlog
save
50 dict begin
/q { gsave } bind def
/Q { grestore } bind def
/cm { 6 array astore concat } bind def
/w { setlinewidth } bind def
/J { setlinecap } bind def
/j { setlinejoin } bind def
/M { setmiterlimit } bind def
/d { setdash } bind def
/m { moveto } bind def
/l { lineto } bind def
/c { curveto } bind def
/h { closepath } bind def
/re { exch dup neg 3 1 roll 5 3 roll moveto 0 rlineto
      0 exch rlineto 0 rlineto closepath } bind def
/S { stroke } bind def
/f { fill } bind def
/f* { eofill } bind def
/n { newpath } bind def
/W { clip } bind def
/W* { eoclip } bind def
/BT { } bind def
/ET { } bind def
/pdfmark where { pop globaldict /?pdfmark /exec load put }
    { globaldict begin /?pdfmark /pop load def /pdfmark
    /cleartomark load def end } ifelse
/BDC { mark 3 1 roll /BDC pdfmark } bind def
/EMC { mark /EMC pdfmark } bind def
/cairo_store_point { /cairo_point_y exch def /cairo_point_x exch def } def
/Tj { show currentpoint cairo_store_point } bind def
/TJ {
  {
    dup
    type /stringtype eq
    { show } { -0.001 mul 0 cairo_font_matrix dtransform rmoveto } ifelse
  } forall
  currentpoint cairo_store_point
} bind def
/cairo_selectfont { cairo_font_matrix aload pop pop pop 0 0 6 array astore
    cairo_font exch selectfont cairo_point_x cairo_point_y moveto } bind def
/Tf { pop /cairo_font exch def /cairo_font_matrix where
      { pop cairo_selectfont } if } bind def
/Td { matrix translate cairo_font_matrix matrix concatmatrix dup
      /cairo_font_matrix exch def dup 4 get exch 5 get cairo_store_point
      /cairo_font where { pop cairo_selectfont } if } bind def
/Tm { 2 copy 8 2 roll 6 array astore /cairo_font_matrix exch def
      cairo_store_point /cairo_font where { pop cairo_selectfont } if } bind def
/g { setgray } bind def
/rg { setrgbcolor } bind def
/d1 { setcachedevice } bind def
%%EndProlog
%%BeginSetup
%%EndSetup
%%Page: 1 1
%%BeginPageSetup
%%PageBoundingBox: 16 -1 393 410
%%EndPageSetup
q 16 -1 377 411 rectclip q
1 0.384314 0.654902 rg
317.34 3.33 m 278.93 3.33 247.68 34.576 247.68 72.986 c 247.68 111.396 
278.93 142.642 317.34 142.642 c 355.746 142.642 386.996 111.396 386.996 
72.986 c 386.996 34.576 355.75 3.33 317.34 3.33 c h
317.34 3.33 m f
1 0.811765 0.34902 rg
346.641 77.482 m 342.766 80.334 l 291.91 80.334 l 288.035 77.482 l 275.371
 68.154 267.812 53.228 267.812 37.552 c 267.812 32.709 268.512 27.92 269.895
 23.314 c 270.434 21.517 l 271.852 20.291 l 284.508 9.353 300.664 3.33 317.34
 3.33 c 334.016 3.33 350.172 9.353 362.828 20.291 c 364.246 21.521 l 364.785
 23.318 l 366.164 27.923 366.863 32.712 366.863 37.552 c 366.863 53.228 
359.305 68.154 346.641 77.482 c h
346.641 77.482 m f
317.34 69.361 m 297.137 69.361 280.699 85.798 280.699 106.002 c 280.699
 125.533 295.969 141.603 315.461 142.595 c 316.105 142.619 l 316.516 142.63
 316.926 142.642 317.34 142.642 c 317.754 142.642 318.164 142.63 318.57 
142.619 c 319.219 142.595 l 338.711 141.607 353.98 125.533 353.98 106.002
 c 353.98 85.798 337.543 69.361 317.34 69.361 c h
317.34 69.361 m f
0.192157 0.823529 0.968627 rg
317.34 305.716 m 290.254 305.716 268.215 327.752 268.215 354.837 c 268.215
 381.927 290.254 403.962 317.34 403.962 c 344.426 403.962 366.461 381.927
 366.461 354.837 c 366.461 327.752 344.426 305.716 317.34 305.716 c h
317.34 305.716 m f
0.764706 0.854902 0.25098 rg
339.273 357.123 m 335.523 360.154 l 299.152 360.154 l 295.402 357.123 l
 287.246 350.521 282.379 340.345 282.379 329.912 c 282.379 326.716 282.816
 323.533 283.676 320.459 c 284.211 318.548 l 285.73 317.271 l 294.574 309.822
 305.797 305.716 317.34 305.716 c 328.879 305.716 340.105 309.822 348.945
 317.271 c 350.465 318.548 l 351 320.459 l 351.859 323.537 352.297 326.716
 352.297 329.912 c 352.301 340.349 347.43 350.521 339.273 357.123 c h
339.273 357.123 m f
317.34 352.17 m 303.062 352.17 291.441 363.787 291.441 378.068 c 291.441
 392.345 303.059 403.962 317.34 403.962 c 331.621 403.962 343.234 392.345
 343.234 378.068 c 343.234 363.787 331.617 352.17 317.34 352.17 c h
317.34 352.17 m f
77.363 294.443 m 47.168 294.443 22.602 319.009 22.602 349.201 c 22.602 
379.396 47.168 403.962 77.363 403.962 c 107.555 403.962 132.121 379.396 
132.121 349.201 c 132.121 319.009 107.555 294.443 77.363 294.443 c h
77.363 294.443 m f
0.192157 0.823529 0.968627 rg
101.312 352.111 m 97.52 355.08 l 57.203 355.08 l 53.41 352.111 l 44.016
 344.759 38.402 333.271 38.402 321.392 c 38.402 317.74 38.914 314.115 39.918
 310.619 c 40.453 308.752 l 41.934 307.49 l 51.828 299.076 64.41 294.443
 77.359 294.443 c 90.312 294.443 102.895 299.076 112.789 307.49 c 114.27
 308.748 l 114.805 310.619 l 115.809 314.115 116.32 317.74 116.32 321.392
 c 116.32 333.271 110.711 344.755 101.312 352.111 c h
101.312 352.111 m f
77.363 346.271 m 61.457 346.271 48.516 359.212 48.516 375.119 c 48.516 
390.49 60.535 403.142 75.883 403.923 c 76.41 403.943 l 76.727 403.955 77.043
 403.962 77.363 403.962 c 77.68 403.962 77.996 403.955 78.309 403.943 c 
78.84 403.927 l 94.188 403.146 106.207 390.49 106.207 375.119 c 106.207 
359.212 93.266 346.271 77.363 346.271 c h
77.363 346.271 m f
1 0.709804 0.360784 rg
300.406 20.291 m 298.988 21.517 l 298.449 23.314 l 297.066 27.92 296.367
 32.709 296.367 37.552 c 296.367 53.228 303.93 68.154 316.59 77.482 c 320.465
 80.334 l 291.91 80.334 l 288.035 77.482 l 275.371 68.154 267.812 53.228
 267.812 37.552 c 267.812 32.709 268.512 27.92 269.891 23.314 c 270.43 21.517
 l 271.852 20.291 l 284.508 9.353 300.66 3.33 317.336 3.33 c 322.168 3.33
 326.945 3.849 331.613 4.834 c 320.16 7.244 309.398 12.521 300.406 20.291
 c h
300.406 20.291 m f
309.254 106.002 m 309.254 121.134 318.422 134.185 331.617 139.759 c 327.781
 141.377 323.609 142.373 319.219 142.595 c 318.574 142.619 l 318.164 142.63
 317.754 142.642 317.34 142.642 c 316.926 142.642 316.516 142.63 316.105
 142.619 c 315.461 142.595 l 295.969 141.603 280.699 125.533 280.699 106.002
 c 280.699 85.798 297.137 69.361 317.34 69.361 c 322.402 69.361 327.227 
70.392 331.617 72.259 c 318.484 77.837 309.254 90.861 309.254 106.002 c 
h
309.254 106.002 m f
0.678431 0.737255 0.0823529 rg
314.285 317.271 m 312.77 318.548 l 312.234 320.459 l 311.371 323.533 310.934
 326.716 310.934 329.912 c 310.934 340.349 315.805 350.521 323.961 357.123
 c 327.707 360.158 l 299.156 360.158 l 295.406 357.123 l 287.25 350.521 
282.379 340.349 282.379 329.912 c 282.379 326.716 282.816 323.537 283.68
 320.459 c 284.215 318.548 l 285.73 317.271 l 294.574 309.822 305.801 305.716
 317.34 305.716 c 322.207 305.716 327.016 306.455 331.617 307.857 c 325.309
 309.783 319.398 312.962 314.285 317.271 c h
314.285 317.271 m f
320 378.068 m 320 387.072 324.621 395.013 331.617 399.658 c 327.52 402.373
 322.613 403.962 317.34 403.962 c 303.062 403.962 291.441 392.345 291.441
 378.064 c 291.441 363.787 303.059 352.17 317.34 352.17 c 322.613 352.17
 327.52 353.759 331.617 356.474 c 324.621 361.119 320 369.06 320 378.068
 c h
320 378.068 m f
0.0745098 0.67451 0.909804 rg
70.488 307.49 m 69.008 308.748 l 68.473 310.619 l 67.469 314.111 66.957
 317.74 66.957 321.392 c 66.957 333.271 72.57 344.755 81.965 352.111 c 85.758
 355.08 l 57.203 355.08 l 53.41 352.111 l 44.016 344.755 38.402 333.271 
38.402 321.392 c 38.402 317.736 38.914 314.111 39.918 310.619 c 40.453 308.748
 l 41.934 307.49 l 51.828 299.076 64.41 294.443 77.359 294.443 c 82.211 
294.443 87.012 295.091 91.637 296.349 c 83.914 298.443 76.676 302.228 70.488
 307.49 c h
70.488 307.49 m f
77.07 375.119 m 77.07 385.826 82.91 395.212 91.637 400.189 c 87.84 402.353
 83.492 403.689 78.84 403.927 c 78.309 403.943 l 77.996 403.955 77.68 403.962
 77.363 403.962 c 77.043 403.962 76.727 403.955 76.414 403.943 c 75.883 
403.927 l 60.535 403.142 48.516 390.49 48.516 375.119 c 48.516 359.212 61.457
 346.271 77.363 346.271 c 82.555 346.271 87.426 347.658 91.637 350.068 c
 82.945 355.045 77.07 364.404 77.07 375.119 c h
77.07 375.119 m f
0 g
323.379 148.041 m 323.379 154.068 l 323.379 157.377 320.828 160.259 317.523
 160.361 c 314.105 160.462 311.301 157.72 311.301 154.322 c 311.301 148.041
 l 286.352 146.048 264.793 131.845 252.621 111.423 c 250.484 113.771 l 248.258
 116.22 244.434 116.638 241.922 114.49 c 239.32 112.263 239.09 108.349 241.375
 105.834 c 246.945 99.705 l 243.781 91.396 242.043 82.392 242.043 72.986
 c 242.043 51.091 251.441 31.357 266.406 17.584 c 266.695 17.267 267.008
 16.974 267.352 16.732 c 276.035 9.005 286.516 3.267 298.078 0.205 c 301.922
 -0.811 305.695 2.06 305.695 6.037 c 305.695 8.771 303.855 11.162 301.211
 11.865 c 291.793 14.353 283.23 18.974 276.066 25.166 c 274.867 29.166 274.258
 33.326 274.258 37.556 c 274.258 51.271 280.91 64.228 291.859 72.295 c 298.949
 66.923 307.777 63.728 317.34 63.728 c 326.902 63.728 335.73 66.923 342.82
 72.295 c 353.77 64.228 360.422 51.271 360.422 37.556 c 360.422 33.326 359.812
 29.17 358.613 25.166 c 352.367 19.767 345.051 15.572 337.035 12.935 c 334.57
 12.123 332.914 9.81 332.914 7.216 c 332.914 7.205 l 332.914 3.072 336.969
 0.189 340.895 1.486 c 350.762 4.74 359.734 9.974 367.328 16.732 c 367.676
 16.978 367.984 17.271 368.273 17.587 c 383.238 31.357 392.637 51.095 392.637
 72.986 c 392.633 112.47 362.082 144.951 323.379 148.041 c h
262.355 41.857 m 257.125 51.052 254.125 61.673 254.125 72.986 c 254.125
 93.248 263.715 111.298 278.586 122.877 c 276.324 117.705 275.062 112.002
 275.062 106.002 c 275.062 96.634 278.129 87.974 283.305 80.959 c 271.242
 71.462 263.57 57.209 262.355 41.857 c h
317.34 75.806 m 300.688 75.806 287.141 89.353 287.141 106.002 c 287.141
 122.134 299.855 135.353 315.789 136.162 c 316.305 136.173 316.82 136.201
 317.34 136.201 c 317.859 136.201 318.371 136.173 318.891 136.162 c 334.824
 135.353 347.539 122.134 347.539 106.002 c 347.539 89.353 333.992 75.806
 317.34 75.806 c h
351.375 80.959 m 356.551 87.974 359.617 96.638 359.617 106.002 c 359.617
 111.998 358.355 117.701 356.094 122.877 c 370.965 111.298 380.555 93.248
 380.555 72.986 c 380.555 61.673 377.555 51.052 372.324 41.857 c 371.105
 57.209 363.434 71.462 351.375 80.959 c h
351.375 80.959 m f
117.324 303.97 m 117.676 304.216 117.988 304.513 118.281 304.83 c 129.602
 315.279 136.93 329.986 137.688 346.384 c 146.613 346.384 l 149.949 346.384
 152.656 349.087 152.656 352.423 c 152.656 355.759 149.953 358.462 146.613
 358.462 c 137.047 358.462 l 132.578 387.384 107.516 409.599 77.363 409.599
 c 44.059 409.599 16.965 382.505 16.965 349.201 c 16.965 331.677 24.477 
315.877 36.438 304.834 c 36.734 304.513 37.047 304.216 37.398 303.97 c 47.508
 295.033 60.613 289.42 75 288.865 c 81.016 282.248 l 82.207 280.935 83.844
 280.271 85.488 280.271 c 86.938 280.271 88.391 280.787 89.547 281.841 c
 91.953 284.025 92.18 287.705 90.117 290.173 c 100.402 292.392 109.711 297.24
 117.324 303.97 c h
46.109 312.396 m 45.273 315.306 44.844 318.326 44.844 321.392 c 44.844 
331.427 49.566 340.92 57.383 347.037 c 63.023 343.013 69.918 340.634 77.363
 340.634 c 84.805 340.634 91.699 343.013 97.34 347.037 c 105.156 340.92 
109.879 331.427 109.879 321.392 c 109.879 318.326 109.449 315.306 108.613
 312.396 c 100.184 305.224 89.273 300.884 77.363 300.884 c 65.453 300.884
 54.539 305.224 46.109 312.396 c h
77.363 397.521 m 77.746 397.521 78.129 397.502 78.512 397.49 c 90.332 396.888
 99.766 387.084 99.766 375.119 c 99.766 362.763 89.715 352.712 77.363 352.712
 c 65.008 352.712 54.957 362.763 54.957 375.119 c 54.957 387.084 64.391 
396.892 76.211 397.49 c 76.594 397.502 76.977 397.521 77.363 397.521 c h
125.68 349.201 m 125.68 342.025 124.094 335.212 121.273 329.087 c 119.438
 339.459 113.945 348.939 105.84 355.701 c 109.625 361.236 111.844 367.92
 111.844 375.119 c 111.844 378.263 111.414 381.306 110.621 384.201 c 119.887
 375.392 125.68 362.966 125.68 349.201 c h
44.102 384.201 m 43.309 381.302 42.879 378.259 42.879 375.115 c 42.879 
367.92 45.098 361.232 48.883 355.697 c 40.777 348.939 35.285 339.459 33.445
 329.084 c 30.629 335.212 29.043 342.025 29.043 349.201 c 29.043 362.966
 34.836 375.392 44.102 384.201 c h
44.102 384.201 m f
234.875 358.462 m 212.812 358.462 l 209.477 358.462 206.77 355.759 206.77
 352.423 c 206.77 349.087 209.477 346.384 212.812 346.384 c 234.875 346.384
 l 238.211 346.384 240.914 349.087 240.914 352.423 c 240.914 355.759 238.211
 358.462 234.875 358.462 c h
234.875 358.462 m f
190.746 346.384 m 194.082 346.384 196.789 349.087 196.789 352.423 c 196.789
 355.759 194.082 358.462 190.746 358.462 c 168.684 358.462 l 165.348 358.462
 162.641 355.759 162.641 352.423 c 162.641 349.087 165.348 346.384 168.684
 346.384 c h
190.746 346.384 m f
256.941 346.384 m 263.234 346.384 l 265.176 333.916 271.344 322.83 280.215
 314.63 c 280.5 314.326 280.801 314.041 281.137 313.802 c 289.375 306.529
 299.805 301.689 311.301 300.42 c 311.301 294.443 l 311.301 291.107 314.004
 288.404 317.34 288.404 c 320.676 288.404 323.379 291.107 323.379 294.443
 c 323.379 300.42 l 334.883 301.689 345.32 306.533 353.559 313.818 c 353.887
 314.052 354.184 314.33 354.461 314.627 c 365.297 324.638 372.102 338.959
 372.102 354.837 c 372.102 384.49 348.406 408.697 318.961 409.56 c 318.422
 409.587 317.883 409.599 317.34 409.599 c 316.797 409.599 316.254 409.587
 315.719 409.56 c 287.484 408.732 264.551 386.439 262.711 358.462 c 256.941
 358.462 l 253.605 358.462 250.902 355.759 250.902 352.423 c 250.902 349.087
 253.605 346.384 256.941 346.384 c h
288.82 329.912 m 288.82 338.556 292.82 346.74 299.457 352.111 c 304.543
 348.599 310.703 346.533 317.34 346.533 c 323.977 346.533 330.137 348.599
 335.223 352.111 c 341.859 346.74 345.855 338.556 345.855 329.912 c 345.855
 327.283 345.496 324.697 344.797 322.197 c 337.367 315.939 327.789 312.158
 317.34 312.158 c 306.887 312.158 297.309 315.939 289.879 322.197 c 289.18
 324.697 288.82 327.287 288.82 329.912 c h
336.793 378.068 m 336.793 367.341 328.066 358.611 317.34 358.611 c 306.613
 358.611 297.887 367.341 297.887 378.068 c 297.887 388.795 306.613 397.521
 317.34 397.521 c 328.066 397.521 336.793 388.795 336.793 378.068 c h
360.02 354.837 m 360.02 349.193 358.906 343.798 356.906 338.861 c 354.965
 347.357 350.324 355.072 343.684 360.767 c 346.957 365.74 348.871 371.681
 348.871 378.068 c 348.871 380.166 348.66 382.22 348.27 384.205 c 355.543
 376.545 360.02 366.209 360.02 354.837 c h
286.41 384.205 m 286.016 382.216 285.805 380.166 285.805 378.068 c 285.805
 371.681 287.719 365.736 290.996 360.767 c 284.355 355.072 279.715 347.357
 277.773 338.861 c 275.773 343.798 274.66 349.189 274.66 354.837 c 274.66
 366.209 279.137 376.545 286.41 384.205 c h
286.41 384.205 m f
317.34 216.408 m 314.004 216.408 311.301 213.705 311.301 210.369 c 311.301
 182.345 l 311.301 179.009 314.004 176.306 317.34 176.306 c 320.676 176.306
 323.379 179.009 323.379 182.345 c 323.379 210.369 l 323.379 213.705 320.676
 216.408 317.34 216.408 c h
317.34 216.408 m f
323.379 266.42 m 323.379 269.752 320.676 272.459 317.34 272.459 c 314 272.459
 311.297 269.755 311.297 266.42 c 311.297 238.392 l 311.297 235.06 314 232.353
 317.34 232.353 c 320.676 232.353 323.379 235.056 323.379 238.392 c h
323.379 266.42 m f
179.043 192.365 m 176.801 194.83 172.98 195.017 170.512 192.771 c 168.043
 190.529 167.859 186.709 170.105 184.24 c 187.922 164.638 l 189.113 163.326
 190.75 162.662 192.395 162.662 c 193.844 162.662 195.297 163.177 196.453
 164.232 c 198.922 166.474 199.102 170.295 196.859 172.763 c h
179.043 192.365 m f
214.68 153.162 m 212.438 155.63 208.617 155.814 206.148 153.568 c 203.68
 151.326 203.496 147.505 205.742 145.037 c 223.559 125.435 l 224.75 124.123
 226.387 123.459 228.027 123.459 c 229.477 123.459 230.934 123.978 232.09
 125.029 c 234.559 127.271 234.738 131.091 232.496 133.56 c h
214.68 153.162 m f
107.773 270.771 m 105.531 273.236 101.711 273.42 99.242 271.177 c 96.773
 268.931 96.59 265.111 98.836 262.642 c 116.652 243.041 l 117.844 241.732
 119.48 241.064 121.125 241.064 c 122.574 241.064 124.027 241.584 125.184
 242.634 c 127.652 244.88 127.836 248.701 125.59 251.17 c h
107.773 270.771 m f
143.41 231.568 m 141.168 234.033 137.348 234.216 134.875 231.974 c 132.41
 229.732 132.227 225.912 134.469 223.443 c 152.289 203.841 l 153.48 202.529
 155.113 201.865 156.758 201.865 c 158.207 201.865 159.66 202.38 160.82 
203.435 c 163.285 205.677 163.469 209.498 161.227 211.966 c h
143.41 231.568 m f
Q Q
showpage
%%Trailer
end restore
%%EOF
