%!PS-Adobe-3.0 EPSF-3.0
%%Creator: cairo 1.14.2 (http://cairographics.org)
%%CreationDate: Mon Feb 19 09:15:05 2018
%%Pages: 1
%%DocumentData: Clean7Bit
%%LanguageLevel: 2
%%BoundingBox: 0 83 410 327
%%EndComments
%%BeginProlog
save
50 dict begin
/q { gsave } bind def
/Q { grestore } bind def
/cm { 6 array astore concat } bind def
/w { setlinewidth } bind def
/J { setlinecap } bind def
/j { setlinejoin } bind def
/M { setmiterlimit } bind def
/d { setdash } bind def
/m { moveto } bind def
/l { lineto } bind def
/c { curveto } bind def
/h { closepath } bind def
/re { exch dup neg 3 1 roll 5 3 roll moveto 0 rlineto
      0 exch rlineto 0 rlineto closepath } bind def
/S { stroke } bind def
/f { fill } bind def
/f* { eofill } bind def
/n { newpath } bind def
/W { clip } bind def
/W* { eoclip } bind def
/BT { } bind def
/ET { } bind def
/pdfmark where { pop globaldict /?pdfmark /exec load put }
    { globaldict begin /?pdfmark /pop load def /pdfmark
    /cleartomark load def end } ifelse
/BDC { mark 3 1 roll /BDC pdfmark } bind def
/EMC { mark /EMC pdfmark } bind def
/cairo_store_point { /cairo_point_y exch def /cairo_point_x exch def } def
/Tj { show currentpoint cairo_store_point } bind def
/TJ {
  {
    dup
    type /stringtype eq
    { show } { -0.001 mul 0 cairo_font_matrix dtransform rmoveto } ifelse
  } forall
  currentpoint cairo_store_point
} bind def
/cairo_selectfont { cairo_font_matrix aload pop pop pop 0 0 6 array astore
    cairo_font exch selectfont cairo_point_x cairo_point_y moveto } bind def
/Tf { pop /cairo_font exch def /cairo_font_matrix where
      { pop cairo_selectfont } if } bind def
/Td { matrix translate cairo_font_matrix matrix concatmatrix dup
      /cairo_font_matrix exch def dup 4 get exch 5 get cairo_store_point
      /cairo_font where { pop cairo_selectfont } if } bind def
/Tm { 2 copy 8 2 roll 6 array astore /cairo_font_matrix exch def
      cairo_store_point /cairo_font where { pop cairo_selectfont } if } bind def
/g { setgray } bind def
/rg { setrgbcolor } bind def
/d1 { setcachedevice } bind def
%%EndProlog
%%BeginSetup
%%EndSetup
%%Page: 1 1
%%BeginPageSetup
%%PageBoundingBox: 0 83 410 327
%%EndPageSetup
q 0 83 410 244 rectclip q
0.917647 0.231373 0.219608 rg
89.898 96.736 m 74.188 112.314 44.914 143.103 25.359 174.216 c 24.934 174.892
 l 24.625 175.529 l 24.207 176.072 l 23.797 176.74 l 11.938 196.17 6.172
 212.138 6.172 225.556 c 6.172 277.373 48.328 319.529 100.145 319.529 c 
151.961 319.529 194.117 277.373 194.117 225.556 c 194.117 184.232 135.566
 121.701 110.391 96.736 c 104.719 91.107 95.57 91.107 89.898 96.736 c h
89.898 96.736 m f
0.894118 0.00392157 0.211765 rg
99.332 149.548 m 58.883 149.548 25.977 182.459 25.977 222.908 c 25.977 
263.357 58.883 296.263 99.332 296.263 c 139.781 296.263 172.691 263.357 
172.691 222.908 c 172.691 182.459 139.781 149.548 99.332 149.548 c h
99.332 149.548 m f
106.562 174.216 m 106.137 174.892 l 105.828 175.529 l 105.41 176.072 l 
105 176.74 l 93.141 196.17 87.371 212.138 87.371 225.556 c 87.371 262.837
 109.199 295.123 140.742 310.295 c 128.449 316.212 114.676 319.529 100.141
 319.529 c 48.324 319.529 6.168 277.373 6.168 225.556 c 6.168 212.138 11.938
 196.17 23.797 176.74 c 24.207 176.072 l 24.625 175.529 l 24.934 174.892
 l 25.359 174.216 l 44.914 143.099 74.188 112.314 89.898 96.736 c 95.57 
91.107 104.719 91.107 110.391 96.736 c 118.211 104.49 129.246 115.865 140.75
 129.107 c 128.875 142.767 116.473 158.451 106.562 174.216 c h
106.562 174.216 m f
1 g
99.332 170.787 m 70.594 170.787 47.211 194.17 47.211 222.908 c 47.211 251.646
 70.594 275.029 99.332 275.029 c 128.07 275.029 151.453 251.646 151.453 
222.908 c 151.453 194.17 128.074 170.787 99.332 170.787 c h
99.332 170.787 m f
1 0.811765 0.34902 rg
299.895 96.736 m 284.184 112.314 254.91 143.103 235.355 174.216 c 234.93
 174.892 l 234.621 175.529 l 234.203 176.072 l 233.793 176.74 l 221.934 
196.17 216.164 212.138 216.164 225.556 c 216.164 277.373 258.32 319.529 
310.137 319.529 c 361.957 319.529 404.113 277.373 404.113 225.556 c 404.113
 184.232 345.559 121.701 320.387 96.736 c 314.715 91.107 305.566 91.107 
299.895 96.736 c h
299.895 96.736 m f
0.976471 0.631373 0.254902 rg
315.613 149.548 m 275.164 149.548 242.254 182.459 242.254 222.908 c 242.254
 263.357 275.164 296.263 315.613 296.263 c 356.062 296.263 388.969 263.357
 388.969 222.908 c 388.969 182.459 356.062 149.548 315.613 149.548 c h
315.613 149.548 m f
316.559 174.216 m 316.133 174.892 l 315.824 175.529 l 315.406 176.072 l
 314.996 176.74 l 303.137 196.17 297.367 212.138 297.367 225.556 c 297.367
 262.837 319.195 295.123 350.738 310.295 c 338.441 316.212 324.672 319.529
 310.137 319.529 c 258.32 319.529 216.164 277.373 216.164 225.556 c 216.164
 212.138 221.93 196.17 233.793 176.74 c 234.203 176.072 l 234.621 175.529
 l 234.93 174.892 l 235.355 174.216 l 254.91 143.099 284.184 112.314 299.891
 96.736 c 305.566 91.107 314.715 91.107 320.387 96.736 c 328.203 104.49 
339.242 115.865 350.742 129.107 c 338.871 142.767 326.469 158.451 316.559
 174.216 c h
316.559 174.216 m f
1 g
309.328 170.787 m 280.59 170.787 257.207 194.17 257.207 222.908 c 257.207
 251.646 280.59 275.029 309.328 275.029 c 338.066 275.029 361.449 251.646
 361.449 222.908 c 361.449 194.17 338.066 170.787 309.328 170.787 c h
309.328 170.787 m f
0.627451 0.458824 0.188235 rg
202.215 148.31 m 199.492 148.31 196.934 149.369 195.008 151.295 c 191.336
 154.966 191.012 160.795 194.25 164.849 c 196.977 167.576 l 198.77 169.017
 201.031 169.806 203.332 169.806 c 206.055 169.806 208.613 168.748 210.539
 166.822 c 212.461 164.896 213.523 162.337 213.523 159.619 c 213.523 156.896
 212.461 154.337 210.539 152.412 c 209.418 151.291 l 207.496 149.369 204.938
 148.31 202.215 148.31 c h
202.215 148.31 m f
0.980392 0.827451 0.576471 rg
222.68 158.134 m 219.957 158.134 217.398 159.193 215.477 161.119 c 189.387
 186.908 l 139.477 190.556 l 108.324 190.556 l 105.32 190.556 102.684 192.63
 102.047 195.564 c 98.281 212.935 98.539 230.888 102.156 249.33 c 102.742
 252.334 105.402 254.486 108.465 254.486 c 149.316 254.486 l 156.77 263.127
 l 159.211 265.962 162.766 267.591 166.504 267.591 c 198.473 267.591 l 253.281
 236.607 l 287.352 202.541 l 288.152 201.736 288.812 200.806 289.316 199.771
 c 289.598 199.193 l 289.691 198.603 l 289.984 198.076 l 290.117 197.427
 l 290.262 196.732 290.336 196.029 290.336 195.337 c 290.336 191.748 288.473
 188.466 285.352 186.56 c 284.523 186.056 283.629 185.685 282.684 185.459
 c 281.844 185.255 280.992 185.15 280.145 185.15 c 277.422 185.15 274.863
 186.209 272.941 188.13 c 270.551 190.482 l 271.465 189.052 272.012 187.447
 272.133 185.802 c 272.422 181.916 270.496 178.24 267.109 176.205 c 266.301
 175.724 265.43 175.365 264.52 175.142 c 263.676 174.939 262.82 174.834 
261.973 174.834 c 259.25 174.834 256.691 175.892 254.766 177.818 c 252.504
 180.084 l 253.379 178.259 253.691 176.197 253.379 174.099 c 253.176 172.72
 252.668 171.377 251.914 170.22 c 249.992 167.263 246.777 165.502 243.309
 165.502 c 243.078 165.502 242.844 165.509 242.613 165.525 c 240.164 165.689
 237.797 166.795 235.953 168.638 c 231.887 172.701 l 232.234 171.99 232.488
 171.248 232.645 170.498 c 233.516 166.302 231.852 162.212 228.309 159.822
 c 227.199 159.072 225.91 158.552 224.586 158.31 c 223.957 158.193 223.312
 158.134 222.68 158.134 c h
222.68 158.134 m f
0.929412 0.717647 0.411765 rg
146.852 200.009 m 138.762 200.603 l 107.609 200.603 l 104.605 200.603 101.969
 202.673 101.332 205.611 c 100.484 209.525 99.852 213.47 99.402 217.443 
c 99.629 210.056 100.488 202.759 102.047 195.564 c 102.688 192.627 105.32
 190.556 108.324 190.556 c 139.477 190.556 l 146.852 190.017 l h
146.852 200.009 m f
187.082 199.361 m 184.691 201.752 181.508 203.068 178.121 203.068 c 174.734
 203.068 171.551 201.752 169.16 199.361 c 158.934 189.134 l 189.387 186.908
 l 190.086 186.212 l 190.547 187.541 190.793 188.951 190.793 190.4 c 190.793
 193.787 189.473 196.966 187.082 199.361 c h
187.082 199.361 m f
156.273 209.834 m 152.855 209.834 149.641 208.502 147.227 206.084 c 141.504
 200.361 l 139.086 197.947 137.758 194.736 137.758 191.314 c 137.758 191.06
 137.77 190.806 137.781 190.556 c 139.477 190.556 l 165.906 188.623 l 167.949
 190.955 169.066 193.908 169.066 197.037 c 169.066 200.455 167.738 203.67
 165.32 206.084 c 162.902 208.502 159.691 209.834 156.273 209.834 c h
156.273 209.834 m f
285.352 186.56 m 285.699 186.775 286.027 187.005 286.344 187.252 c 257.285
 215.974 l 254.145 219.076 248.906 218.314 246.781 214.443 c 246.594 214.099
 l 273.371 187.74 l 275.238 186.072 277.621 185.15 280.145 185.15 c 280.148
 185.15 l 280.992 185.15 281.844 185.252 282.684 185.455 c 283.629 185.685
 284.523 186.056 285.352 186.56 c h
285.352 186.56 m f
261.973 174.83 m 262.82 174.83 263.676 174.935 264.52 175.142 c 265.434
 175.361 266.301 175.72 267.109 176.205 c 267.508 176.443 267.887 176.709
 268.246 176.994 c 239.25 205.654 l 236.109 208.755 230.871 207.994 228.746
 204.123 c 228.559 203.779 l 255.961 176.806 l 257.695 175.533 259.777 174.83
 261.973 174.83 c h
261.973 174.83 m f
210.098 194.654 m 209.91 194.31 l 231.906 172.658 l 231.902 172.67 231.895
 172.685 231.891 172.701 c 233.414 171.173 l 236.551 168.084 l 238.297 166.572
 240.422 165.666 242.613 165.521 c 242.848 165.505 243.078 165.498 243.309
 165.498 c 245.582 165.498 247.742 166.259 249.508 167.615 c 220.602 196.181
 l 217.461 199.287 212.223 198.525 210.098 194.654 c h
210.098 194.654 m f
222.68 158.134 m 223.312 158.134 223.953 158.193 224.586 158.306 c 225.91
 158.548 227.199 159.068 228.309 159.818 c 228.52 159.962 228.727 160.115
 228.926 160.267 c 200.078 188.779 l 196.938 191.884 191.699 191.123 189.574
 187.252 c 189.387 186.908 l 199.688 176.767 l 199.867 176.724 l 208.523
 168.072 l 216.438 160.279 l 218.219 158.892 220.387 158.134 222.68 158.134
 c h
222.68 158.134 m f
0.627451 0.458824 0.188235 rg
185.516 159.607 m 182.793 159.607 180.23 160.666 178.309 162.591 c 174.637
 166.263 174.312 172.091 177.551 176.15 c 177.703 176.337 l 183.531 182.166
 l 183.719 182.318 l 185.512 183.752 187.77 184.537 190.074 184.537 c 192.797
 184.537 195.355 183.478 197.277 181.556 c 199.199 179.634 200.262 177.076
 200.262 174.353 c 200.262 171.63 199.199 169.072 197.277 167.146 c 197.168
 167.041 l 197.023 166.908 l 196.852 166.759 196.68 166.603 196.516 166.439
 c 195.395 165.318 l 195.23 165.158 195.078 164.986 194.93 164.814 c 194.828
 164.697 l 192.719 162.591 l 190.797 160.67 188.238 159.607 185.516 159.607
 c h
185.516 159.607 m f
168.324 170.412 m 165.602 170.412 163.043 171.47 161.121 173.396 c 157.148
 177.369 157.148 183.834 161.121 187.806 c 169.852 196.537 l 171.773 198.459
 174.332 199.517 177.059 199.517 c 179.781 199.517 182.34 198.459 184.262
 196.537 c 186.184 194.615 187.242 192.056 187.242 189.334 c 187.242 186.607
 186.184 184.048 184.262 182.127 c 175.531 173.396 l 173.605 171.47 171.047
 170.412 168.324 170.412 c h
168.324 170.412 m f
151.133 181.709 m 148.41 181.709 145.852 182.767 143.93 184.693 c 142.004
 186.615 140.945 189.173 140.945 191.896 c 140.945 194.623 142.004 197.177
 143.93 199.103 c 148.488 203.662 l 150.41 205.584 152.969 206.642 155.691
 206.642 c 158.414 206.642 160.973 205.584 162.898 203.658 c 164.82 201.736
 165.879 199.177 165.879 196.455 c 165.879 193.732 164.82 191.173 162.895
 189.248 c 158.34 184.693 l 156.414 182.771 153.855 181.709 151.133 181.709
 c h
151.133 181.709 m f
0.509804 0.321569 0.0666667 rg
210.539 166.822 m 209.305 168.052 207.812 168.927 206.188 169.4 c 206.43
 168.517 206.562 167.603 206.562 166.666 c 206.562 163.943 205.504 161.384
 203.578 159.459 c 202.461 158.337 l 200.539 156.416 197.98 155.357 195.254
 155.357 c 194.277 155.357 193.32 155.502 192.406 155.763 c 192.863 154.123
 193.727 152.576 195.008 151.295 c 196.934 149.369 199.492 148.31 202.215
 148.31 c 204.938 148.31 207.496 149.369 209.422 151.291 c 210.539 152.412
 l 212.465 154.337 213.523 156.896 213.523 159.619 c 213.523 162.341 212.465
 164.9 210.539 166.822 c h
210.539 166.822 m f
197.277 181.556 m 196.047 182.787 194.555 183.662 192.926 184.13 c 193.168
 183.252 193.301 182.337 193.301 181.4 c 193.301 178.677 192.242 176.119
 190.32 174.197 c 190.211 174.087 l 190.066 173.959 l 189.891 173.806 189.719
 173.654 189.555 173.49 c 188.434 172.365 l 188.273 172.205 188.117 172.033
 187.969 171.861 c 187.867 171.744 l 185.762 169.638 l 183.836 167.712 181.277
 166.658 178.555 166.658 c 177.574 166.658 176.621 166.798 175.707 167.064
 c 176.164 165.42 177.027 163.873 178.309 162.591 c 180.234 160.666 182.789
 159.607 185.516 159.607 c 188.238 159.607 190.797 160.666 192.719 162.591
 c 194.828 164.697 l 194.93 164.814 l 195.078 164.986 195.23 165.158 195.395
 165.318 c 196.516 166.439 l 196.68 166.603 196.852 166.759 197.023 166.908
 c 197.168 167.041 l 197.277 167.146 l 199.203 169.072 200.262 171.63 200.262
 174.353 c 200.262 177.076 199.203 179.634 197.277 181.556 c h
197.277 181.556 m f
184.262 196.537 m 183.031 197.767 181.535 198.642 179.906 199.111 c 180.152
 198.232 180.285 197.318 180.285 196.38 c 180.285 193.658 179.227 191.099
 177.305 189.173 c 168.57 180.443 l 166.645 178.517 164.09 177.459 161.367
 177.459 c 160.387 177.459 159.434 177.599 158.52 177.865 c 158.973 176.228
 159.836 174.681 161.121 173.396 c 163.047 171.47 165.602 170.412 168.324
 170.412 c 171.047 170.412 173.605 171.474 175.531 173.396 c 184.262 182.13
 l 186.188 184.052 187.246 186.611 187.246 189.334 c 187.242 192.056 186.184
 194.615 184.262 196.537 c h
184.262 196.537 m f
162.895 203.658 m 161.664 204.892 160.172 205.763 158.543 206.236 c 158.785
 205.357 158.922 204.439 158.922 203.502 c 158.922 200.779 157.863 198.22
 155.938 196.295 c 151.379 191.74 l 149.457 189.818 146.898 188.759 144.172
 188.759 c 143.195 188.759 142.238 188.9 141.324 189.166 c 141.785 187.49
 142.668 185.955 143.93 184.693 c 145.852 182.771 148.41 181.712 151.133
 181.712 c 153.855 181.712 156.414 182.771 158.34 184.693 c 162.895 189.252
 l 164.82 191.173 165.879 193.732 165.879 196.455 c 165.879 199.177 164.82
 201.736 162.895 203.658 c h
162.895 203.658 m f
0.929412 0.717647 0.411765 rg
253.285 236.607 m 203.484 264.755 l 201.328 262.154 199.098 259.611 196.785
 257.181 c 194.785 255.076 192.688 253.009 190.895 250.72 c 190.922 250.74
 190.559 250.228 190.41 250.013 c 189.961 249.365 189.508 248.724 189.066
 248.072 c 188.273 246.896 187.508 245.701 186.766 244.486 c 180.652 234.502
 179 231.224 176.207 219.822 c 176.41 219.658 176 219.978 176.207 219.822
 c 179.488 217.365 180.598 214.076 187.883 213.603 c 191.539 213.365 193.52
 213.482 195.973 214.431 c 198.754 215.505 201.176 217.345 203.066 219.65
 c 208.453 226.224 l 211.426 229.849 216.324 231.236 220.773 229.752 c 225.59
 228.146 231.438 226.779 237.41 226.779 c 242.695 226.779 247.496 227.556
 251.598 229.638 c 251.598 229.638 255.734 231.435 257.414 232.658 c h
253.285 236.607 m f
0.627451 0.458824 0.188235 rg
288.387 200.345 m 287.984 201.005 287.508 201.619 286.965 202.158 c 252.312
 236.81 l 248.34 233.759 243.348 232.216 237.41 232.212 c 237.406 232.212
 l 225.574 232.212 213.883 238.416 212.188 239.349 c 196.488 220.205 l 193.941
 217.103 190.191 215.322 186.191 215.322 c 182.742 215.322 179.484 216.63
 176.922 219.076 c 175.129 220.791 173.848 223.005 173.266 225.416 c 172.25
 229.595 173.215 233.81 175.871 237.068 c 201.465 268.431 l 205.945 273.92
 212.578 277.068 219.664 277.068 c 244.141 277.068 l 251.398 277.068 258.367
 273.627 262.781 267.869 c 270.801 257.404 l 307.504 257.404 l 310.691 257.404
 313.422 255.072 313.871 251.92 c 316.195 235.67 316.18 219.615 313.883 
203.752 c 313.426 200.603 310.703 198.283 307.527 198.279 c 289.66 198.252
 l h
288.387 200.345 m f
0.509804 0.321569 0.0666667 rg
295.441 198.533 m 295.137 199.998 l 294.906 200.412 l 294.84 200.841 l 
294.211 202.138 l 293.445 203.724 292.43 205.15 291.195 206.384 c 263.242
 234.337 l 260.777 236.802 256.945 237.091 254.043 235.17 c 253.992 235.134
 l 286.969 202.158 l 287.508 201.619 287.984 201.009 288.387 200.345 c 289.664
 198.252 l 295.227 198.263 l 295.312 198.373 295.352 198.423 295.441 198.533
 c h
295.441 198.533 m f
183.184 220.982 m 182.738 224.615 183.77 228.181 186.086 231.017 c 211.68
 262.377 l 216.16 267.865 222.793 271.013 229.879 271.013 c 254.352 271.013
 l 256.562 271.013 258.746 270.693 260.84 270.087 c 256.461 274.498 250.41
 277.068 244.141 277.068 c 219.664 277.068 l 212.578 277.068 205.945 273.92
 201.465 268.431 c 175.871 237.068 l 173.559 234.232 172.527 230.67 172.969
 227.037 c 173.414 223.4 175.27 220.193 178.199 217.994 c 180.266 216.447
 182.668 215.548 185.207 215.365 c 184.129 217.033 183.434 218.939 183.184
 220.982 c h
183.184 220.982 m f
0 g
309.359 325.662 m 277.633 325.662 247.445 310.392 228.602 284.818 c 228.41
 284.552 228.246 284.279 228.102 283.998 c 219.102 283.998 l 210.688 283.998
 202.777 280.486 197.152 274.314 c 187.77 274.314 l 170.023 306.08 136.824
 325.662 100.242 325.662 c 44.969 325.662 0 280.693 0 225.42 c 0 180.615
 62.484 114.634 89.348 88.349 c 92.352 85.408 96.297 83.939 100.242 83.939
 c 104.188 83.939 108.137 85.408 111.137 88.349 c 114.902 92.033 119.543
 96.673 124.711 102.052 c 126.98 104.416 126.938 108.162 124.625 110.474
 c 122.242 112.861 118.359 112.818 116.027 110.384 c 110.582 104.705 105.957
 100.091 102.73 96.935 c 101.348 95.58 99.141 95.58 97.762 96.935 c 86.691
 107.767 65.305 129.623 46.488 154.24 c 23.938 183.744 12.02 208.357 12.02
 225.42 c 12.02 274.064 51.598 313.642 100.242 313.642 c 130.121 313.642
 157.43 298.795 173.691 274.314 c 158.914 274.314 l 157.168 274.314 155.504
 273.556 154.363 272.228 c 145.594 262.056 l 134.273 275.197 117.977 282.611
 100.484 282.431 c 68.266 282.099 42.086 255.392 42.363 223.17 c 42.645 
191.013 68.887 164.943 101.105 164.943 c 115.039 164.943 128.348 169.826
 138.93 178.748 c 141.797 176.408 145.352 175.134 149.102 175.134 c 149.797
 175.134 150.477 175.193 151.152 175.279 c 151.898 172.673 153.281 170.291
 155.25 168.322 c 157.039 166.533 159.184 165.228 161.516 164.447 c 155.355
 155.748 148.633 147.205 141.938 139.212 c 139.938 136.826 140.094 133.306
 142.297 131.103 c 142.305 131.095 l 144.801 128.599 148.906 128.767 151.172
 131.478 c 158.266 139.959 165.363 149.013 171.891 158.298 c 172.184 157.951
 172.484 157.611 172.809 157.287 c 175.859 154.24 179.91 152.56 184.223 
152.56 c 184.75 152.56 185.273 152.587 185.793 152.634 c 186.523 150.111
 187.879 147.736 189.863 145.748 c 193.148 142.466 197.594 140.771 202.273
 141.052 c 206.312 141.295 210.09 143.146 212.949 146.009 c 213.832 146.892
 l 215.281 148.341 216.41 150.021 217.207 151.845 c 218.793 151.33 220.465
 151.056 222.18 151.056 c 226.492 151.056 230.543 152.732 233.594 155.779
 c 234.824 157.009 235.816 158.412 236.582 159.92 c 236.59 159.908 236.594
 159.896 236.602 159.884 c 257.344 130.017 284.262 102.244 298.465 88.349
 c 301.469 85.408 305.414 83.939 309.359 83.939 c 313.305 83.939 317.25 
85.412 320.254 88.349 c 347.117 114.638 409.602 180.615 409.602 225.42 c
 409.602 280.693 364.633 325.662 309.359 325.662 c h
205.383 265.47 m 208.758 269.607 213.758 271.978 219.102 271.978 c 244.098
 271.978 l 249.566 271.978 254.82 269.388 258.152 265.045 c 266.426 254.252
 l 267.562 252.767 269.324 251.896 271.195 251.896 c 305.551 251.896 l 309.195
 235.22 309.664 219.048 306.965 203.595 c 306.234 203.908 305.434 204.084
 304.59 204.084 c 304.574 204.084 l 294.066 204.056 l 293.539 204.806 292.957
 205.529 292.285 206.197 c 260.734 237.752 l 261.715 240.052 261.18 242.822
 259.211 244.58 c 256.734 246.791 252.934 246.576 250.727 244.099 c 239.359
 231.369 214.617 245.177 214.375 245.314 c 211.832 246.771 208.605 246.173
 206.75 243.908 c 190.566 224.17 l 188.074 221.134 183.66 220.599 180.52
 222.959 c 178.91 224.166 177.891 225.927 177.645 227.923 c 177.402 229.92
 177.969 231.877 179.238 233.435 c h
307.582 182.111 m 308.172 181.927 308.77 181.841 309.359 181.841 c 311.926
 181.841 314.301 183.498 315.098 186.076 c 322.59 210.295 322.605 236.232
 315.148 263.166 c 314.262 266.365 310.953 268.236 307.754 267.357 c 305.922
 266.845 304.523 265.541 303.832 263.916 c 286.418 263.916 l 293.535 268.15
 301.68 270.416 310.223 270.416 c 335.988 270.416 356.949 249.455 356.949
 223.689 c 356.949 197.923 335.988 176.962 310.223 176.962 c 303.113 176.962
 296.281 178.525 290.047 181.525 c 290.832 182.068 291.586 182.673 292.285
 183.373 c 294.734 185.822 296.215 188.869 296.758 192.045 c 304.32 192.064
 l 304.09 191.252 303.867 190.435 303.617 189.627 c 302.637 186.455 304.41
 183.091 307.582 182.111 c h
101.105 176.962 m 75.34 176.962 54.379 197.923 54.379 223.689 c 54.379 
249.455 75.344 270.416 101.105 270.416 c 111.488 270.416 121.309 267.037
 129.332 260.927 c 110.098 260.927 l 109.66 262.802 108.328 264.431 106.398
 265.17 c 103.301 266.357 99.824 264.806 98.637 261.709 c 88.727 235.826
 88.727 209.58 98.637 183.701 c 99.555 181.306 101.832 179.837 104.25 179.837
 c 104.965 179.837 105.691 179.966 106.398 180.236 c 108.223 180.935 109.504
 182.431 110.012 184.17 c 126.059 184.17 l 118.645 179.482 110.039 176.962
 101.105 176.962 c h
156.672 193.013 m 152.016 188.361 l 151.238 187.58 150.203 187.154 149.102
 187.154 c 148.004 187.154 146.969 187.58 146.191 188.357 c 144.586 189.966
 144.586 192.58 146.191 194.185 c 150.844 198.841 l 151.625 199.619 152.66
 200.048 153.762 200.048 c 154.863 200.048 155.895 199.619 156.672 198.841
 c 157.453 198.064 157.879 197.029 157.879 195.927 c 157.879 194.826 157.449
 193.791 156.672 193.013 c h
178.492 185.74 m 178.074 185.322 l 177.871 185.138 177.66 184.962 177.461
 184.763 c 172.809 180.111 l 172.609 179.916 172.438 179.701 172.254 179.498
 c 169.574 176.822 l 168.797 176.041 167.762 175.615 166.66 175.615 c 165.559
 175.615 164.527 176.041 163.746 176.822 c 162.969 177.599 162.539 178.634
 162.539 179.736 c 162.539 180.834 162.969 181.869 163.746 182.646 c 172.664
 191.568 l 173.445 192.345 174.477 192.775 175.578 192.775 c 176.68 192.775
 177.715 192.345 178.492 191.568 c 179.27 190.791 179.699 189.755 179.699
 188.654 c 179.699 187.552 179.27 186.517 178.492 185.74 c h
191.789 170.439 m 191.613 170.263 l 191.41 170.08 191.203 169.908 191.008
 169.716 c 189.863 168.572 l 189.68 168.384 189.516 168.185 189.34 167.994
 c 187.137 165.787 l 185.527 164.177 182.914 164.177 181.309 165.787 c 179.797
 167.295 179.727 169.689 181.059 171.306 c 186.273 176.521 l 187.027 177.142
 187.949 177.474 188.875 177.474 c 189.934 177.474 190.988 177.072 191.789
 176.267 c 193.395 174.662 193.395 172.045 191.789 170.439 c h
205.332 155.388 m 204.191 154.244 l 203.41 153.466 202.379 153.041 201.277
 153.041 c 200.176 153.041 199.141 153.466 198.363 154.244 c 196.852 155.759
 196.781 158.15 198.113 159.767 c 199.82 161.474 l 200.555 162.076 201.457
 162.423 202.418 162.423 c 203.52 162.423 204.555 161.994 205.332 161.216
 c 205.336 161.216 l 206.109 160.439 206.539 159.404 206.539 158.302 c 206.539
 157.201 206.109 156.166 205.332 155.388 c h
246.164 171.802 m 245.387 171.025 244.352 170.599 243.25 170.599 c 242.148
 170.599 241.113 171.025 240.336 171.806 c 234.141 177.998 l 233.961 178.201
 233.785 178.412 233.594 178.603 c 209.539 202.658 l 207.191 205.002 203.387
 205.002 201.039 202.658 c 198.695 200.31 198.695 196.505 201.039 194.158
 c 207.336 187.865 l 207.477 187.689 207.625 187.521 207.785 187.357 c 225.359
 169.787 l 225.957 169.052 226.301 168.154 226.301 167.193 c 226.301 166.091
 225.871 165.056 225.094 164.279 c 223.492 162.67 220.875 162.67 219.27 
164.279 c 213.832 169.712 l 203.574 179.97 l 202.797 181.705 201.711 183.337
 200.289 184.763 c 197.914 187.138 194.926 188.666 191.684 189.232 c 191.543
 193.17 189.992 197.064 186.992 200.064 c 181.926 205.13 174.305 206.111
 168.238 203.017 c 167.477 204.576 166.465 206.045 165.172 207.337 c 162.121
 210.388 158.07 212.064 153.758 212.064 c 149.445 212.064 145.395 210.384
 142.348 207.337 c 137.691 202.681 l 135.809 200.802 134.504 198.564 133.746
 196.189 c 107.105 196.189 l 102 213.716 101.965 231.38 107.012 248.912 
c 147.375 248.912 l 149.125 248.912 150.785 249.67 151.93 250.998 c 161.668
 262.295 l 187.281 262.295 l 169.93 241.033 l 166.57 236.916 165.074 231.74
 165.719 226.466 c 166.363 221.193 169.059 216.529 173.309 213.341 c 176.793
 210.728 180.867 209.459 184.91 209.459 c 190.508 209.459 196.039 211.888
 199.859 216.548 c 213.008 232.584 l 221.055 228.947 238.031 223.005 251.621
 229.865 c 283.789 197.697 l 284.082 197.404 284.305 197.068 284.492 196.716
 c 284.59 196.275 284.738 195.857 284.93 195.459 c 285.137 194.193 284.766
 192.845 283.789 191.869 c 283.012 191.091 281.977 190.662 280.875 190.662
 c 279.773 190.662 278.738 191.091 277.961 191.869 c 253.91 215.923 l 253.438
 216.396 252.906 216.767 252.34 217.048 c 249.676 219.712 l 247.328 222.06
 243.523 222.06 241.176 219.712 c 238.828 217.369 238.828 213.564 241.176
 211.216 c 265.23 187.162 l 266.008 186.384 266.438 185.349 266.438 184.252
 c 266.438 183.15 266.008 182.115 265.23 181.334 c 264.453 180.556 263.414
 180.13 262.316 180.13 c 261.215 180.13 260.18 180.556 259.402 181.337 c
 255.207 185.533 l 255.027 185.732 254.855 185.939 254.664 186.13 c 230.609
 210.181 l 228.266 212.529 224.461 212.529 222.113 210.181 c 219.766 207.834
 219.766 204.029 222.113 201.685 c 226.398 197.396 l 226.539 197.22 226.688
 197.052 226.852 196.888 c 246.426 177.31 l 247.027 176.58 247.375 175.677
 247.375 174.716 c 247.371 173.619 246.941 172.584 246.164 171.802 c h
311.848 96.939 m 310.453 95.572 308.266 95.572 306.867 96.939 c 296.457
 107.127 271.234 132.712 250.914 160.513 c 252.277 161.248 253.539 162.181
 254.66 163.306 c 256.215 164.861 257.406 166.677 258.207 168.654 c 259.535
 168.306 260.906 168.111 262.312 168.111 c 266.625 168.111 270.676 169.791
 273.727 172.837 c 274.648 173.759 275.43 174.787 276.094 175.873 c 286.082
 168.716 297.82 164.943 310.223 164.943 c 342.613 164.943 368.969 191.298
 368.969 223.689 c 368.969 256.08 342.613 282.431 310.223 282.431 c 295.664
 282.431 282.027 277.212 271.285 267.662 c 267.688 272.357 l 262.102 279.646
 253.281 283.998 244.098 283.998 c 243.398 283.998 l 260.051 302.685 284.152
 313.642 309.359 313.642 c 358.004 313.642 397.582 274.064 397.582 225.42
 c 397.582 208.357 385.664 183.74 363.113 154.24 c 344.301 129.623 322.918
 107.771 311.848 96.939 c h
311.848 96.939 m f
Q Q
showpage
%%Trailer
end restore
%%EOF
