%!PS-Adobe-3.0 EPSF-3.0
%%Creator: cairo 1.14.2 (http://cairographics.org)
%%CreationDate: Mon Feb 19 09:15:05 2018
%%Pages: 1
%%DocumentData: Clean7Bit
%%LanguageLevel: 2
%%BoundingBox: 0 81 410 328
%%EndComments
%%BeginProlog
save
50 dict begin
/q { gsave } bind def
/Q { grestore } bind def
/cm { 6 array astore concat } bind def
/w { setlinewidth } bind def
/J { setlinecap } bind def
/j { setlinejoin } bind def
/M { setmiterlimit } bind def
/d { setdash } bind def
/m { moveto } bind def
/l { lineto } bind def
/c { curveto } bind def
/h { closepath } bind def
/re { exch dup neg 3 1 roll 5 3 roll moveto 0 rlineto
      0 exch rlineto 0 rlineto closepath } bind def
/S { stroke } bind def
/f { fill } bind def
/f* { eofill } bind def
/n { newpath } bind def
/W { clip } bind def
/W* { eoclip } bind def
/BT { } bind def
/ET { } bind def
/pdfmark where { pop globaldict /?pdfmark /exec load put }
    { globaldict begin /?pdfmark /pop load def /pdfmark
    /cleartomark load def end } ifelse
/BDC { mark 3 1 roll /BDC pdfmark } bind def
/EMC { mark /EMC pdfmark } bind def
/cairo_store_point { /cairo_point_y exch def /cairo_point_x exch def } def
/Tj { show currentpoint cairo_store_point } bind def
/TJ {
  {
    dup
    type /stringtype eq
    { show } { -0.001 mul 0 cairo_font_matrix dtransform rmoveto } ifelse
  } forall
  currentpoint cairo_store_point
} bind def
/cairo_selectfont { cairo_font_matrix aload pop pop pop 0 0 6 array astore
    cairo_font exch selectfont cairo_point_x cairo_point_y moveto } bind def
/Tf { pop /cairo_font exch def /cairo_font_matrix where
      { pop cairo_selectfont } if } bind def
/Td { matrix translate cairo_font_matrix matrix concatmatrix dup
      /cairo_font_matrix exch def dup 4 get exch 5 get cairo_store_point
      /cairo_font where { pop cairo_selectfont } if } bind def
/Tm { 2 copy 8 2 roll 6 array astore /cairo_font_matrix exch def
      cairo_store_point /cairo_font where { pop cairo_selectfont } if } bind def
/g { setgray } bind def
/rg { setrgbcolor } bind def
/d1 { setcachedevice } bind def
%%EndProlog
%%BeginSetup
%%EndSetup
%%Page: 1 1
%%BeginPageSetup
%%PageBoundingBox: 0 81 410 328
%%EndPageSetup
q 0 81 410 247 rectclip q
0.192157 0.823529 0.968627 rg
301.391 143.881 m 290.793 143.881 281.582 150.998 278.902 161.217 c 263.949
 165.538 l 261.953 166.116 261.953 168.944 263.949 169.522 c 279.156 173.909
 l 282.113 183.616 291.223 190.373 301.391 190.373 c 352.996 190.373 l 365.645
 190.373 376.352 180.475 376.727 167.83 c 377.117 154.694 366.543 143.881
 353.492 143.881 c h
301.391 143.881 m f
0.0745098 0.67451 0.909804 rg
280.188 157.577 m 281.234 157.877 l 284.191 167.584 293.301 174.342 303.469
 174.342 c 355.074 174.342 l 364.098 174.342 372.125 169.303 376.125 161.83
 c 376.574 163.752 376.785 165.76 376.727 167.83 c 376.348 180.475 365.645
 190.373 352.996 190.373 c 301.387 190.373 l 291.223 190.373 282.113 183.612
 279.156 173.909 c 263.949 169.522 l 261.953 168.944 261.953 166.116 263.949
 165.538 c 278.902 161.217 l 279.234 159.955 279.668 158.737 280.188 157.577
 c h
280.188 157.577 m f
1 0.811765 0.34902 rg
19.203 87.772 m 11.707 87.772 5.609 93.87 5.609 101.366 c 5.609 233.69 
l 5.609 241.186 11.707 247.284 19.203 247.284 c 226.879 247.284 l 234.371
 247.284 240.469 241.186 240.469 233.69 c 240.469 101.366 l 240.469 93.87
 234.371 87.772 226.879 87.772 c h
19.203 87.772 m f
0.886275 0.603922 0.0470588 rg
5.609 217.553 m 5.609 231.659 l 5.609 240.288 11.695 247.284 19.203 247.284
 c 226.879 247.284 l 234.383 247.284 240.469 240.288 240.469 231.659 c 240.469
 217.549 l 126.73 132.018 l 124.488 130.334 121.59 130.334 119.352 132.018
 c h
5.609 217.553 m f
0.909804 0.698039 0.227451 rg
41.844 101.366 m 41.844 233.69 l 41.844 241.186 47.941 247.284 55.434 247.284
 c 19.203 247.284 l 11.707 247.284 5.609 241.186 5.609 233.69 c 5.609 101.366
 l 5.609 93.87 11.707 87.772 19.203 87.772 c 55.434 87.772 l 47.941 87.772
 41.844 93.87 41.844 101.366 c h
41.844 101.366 m f
0.788235 0.513726 0.0235294 rg
41.844 233.69 m 41.844 241.186 47.941 247.284 55.434 247.284 c 19.203 247.284
 l 11.695 247.284 5.609 240.288 5.609 231.659 c 5.609 217.553 l 41.844 190.307
 l h
41.844 233.69 m f
0.937255 0.72549 0.247059 rg
147.863 161.799 m 98.219 161.799 l 5.609 122.221 l 5.609 101.366 l 5.609
 93.87 11.707 87.772 19.203 87.772 c 226.879 87.772 l 234.371 87.772 240.469
 93.87 240.469 101.366 c 240.469 122.221 l h
147.863 161.799 m f
0.788235 0.517647 0.0352941 rg
147.863 161.799 m 98.219 161.799 l 86.441 156.768 l 119.352 132.018 l 121.59
 130.334 124.488 130.334 126.73 132.018 c 159.641 156.768 l h
147.863 161.799 m f
0.909804 0.662745 0.176471 rg
41.844 101.366 m 41.844 137.705 l 5.609 122.221 l 5.609 101.366 l 5.609
 93.87 11.707 87.772 19.203 87.772 c 55.434 87.772 l 47.941 87.772 41.844
 93.87 41.844 101.366 c h
41.844 101.366 m f
0.956863 0.67451 0.270588 rg
5.609 221.424 m 5.609 233.69 l 5.609 241.198 11.695 247.284 19.203 247.284
 c 226.879 247.284 l 234.383 247.284 240.469 241.198 240.469 233.69 c 240.469
 221.42 l 126.73 147.018 l 124.488 145.553 121.594 145.553 119.352 147.018
 c h
5.609 221.424 m f
0.929412 0.596078 0.160784 rg
41.844 233.69 m 41.844 241.186 47.941 247.284 55.434 247.284 c 19.203 247.284
 l 11.707 247.284 5.609 241.186 5.609 233.69 c 5.609 221.42 l 41.844 197.721
 l h
41.844 233.69 m f
1 0.384314 0.654902 rg
158.828 275.338 m 141.57 275.338 l 128.922 275.338 118.215 285.237 117.84
 297.881 c 117.453 311.018 128.023 321.83 141.074 321.83 c 380.25 321.83
 l 392.898 321.83 403.605 311.932 403.98 299.288 c 404.371 286.151 393.797
 275.338 380.742 275.338 c 201.512 275.338 l 185.809 245.272 l 183.648 241.135
 177.754 241.069 175.496 245.155 c h
158.828 275.338 m f
0.988235 0.329412 0.47451 rg
143.547 278.252 m 143.16 291.393 153.734 302.202 166.785 302.202 c 403.695
 302.202 l 401.906 313.416 391.906 321.83 380.25 321.83 c 141.074 321.83
 l 128.023 321.83 117.449 311.018 117.84 297.881 c 118.215 285.237 128.922
 275.338 141.57 275.338 c 143.832 275.338 l 143.68 276.291 143.578 277.264
 143.547 278.252 c h
143.547 278.252 m f
0 g
380.742 327.44 m 141.074 327.44 l 125.164 327.44 112.219 314.495 112.219
 298.584 c 112.219 282.67 125.164 269.729 141.074 269.729 c 155.516 269.729
 l 164.812 252.897 l 19.203 252.897 l 8.613 252.893 0 244.28 0 233.69 c 
0 101.366 l 0 90.776 8.613 82.159 19.203 82.159 c 226.879 82.159 l 237.465
 82.159 246.082 90.776 246.082 101.366 c 246.082 233.639 l 246.082 233.69
 246.082 233.639 246.082 233.69 c 246.082 244.28 237.469 252.893 226.879
 252.893 c 196.121 252.893 l 204.914 269.729 l 380.742 269.729 l 396.656
 269.729 409.602 282.67 409.602 298.584 c 409.602 314.495 396.656 327.44
 380.742 327.44 c h
12.023 210.522 m 85.492 162.463 l 12.023 131.061 l h
234.059 101.366 m 234.059 97.405 230.836 94.186 226.875 94.186 c 19.203
 94.186 l 15.246 94.186 12.023 97.405 12.023 101.366 c 12.023 117.987 l 
97.582 154.553 l 119.75 140.053 l 120.75 139.401 121.895 139.073 123.039
 139.073 c 124.188 139.073 125.332 139.401 126.332 140.053 c 148.5 154.553
 l 234.059 117.987 l h
226.875 240.87 m 230.844 240.87 234.059 237.659 234.059 233.69 c 234.059
 224.885 l 208.984 208.487 l 206.27 206.709 205.477 203.096 207.199 200.35
 c 207.223 200.315 207.242 200.28 207.266 200.248 c 209.031 197.42 212.773
 196.596 215.562 198.424 c 234.059 210.522 l 234.059 131.061 l 160.59 162.463
 l 182.781 176.979 l 185.496 178.756 186.281 182.389 184.539 185.127 c 184.512
 185.174 184.484 185.217 184.457 185.26 c 182.68 188.049 178.969 188.85 
176.199 187.041 c 144.672 166.42 l 144.648 166.401 144.625 166.385 144.598
 166.37 c 123.039 152.268 l 101.457 166.385 l 101.445 166.393 101.438 166.397
 101.43 166.405 c 12.023 224.889 l 12.023 233.69 l 12.023 237.655 15.238
 240.87 19.203 240.87 c 171.453 240.87 l 175.492 233.557 l 176.551 231.639
 178.566 230.452 180.754 230.452 c 180.824 230.452 l 183.035 230.475 185.059
 231.717 186.082 233.678 c 189.84 240.87 l h
380.742 281.752 m 201.27 281.752 l 199.031 281.752 196.98 280.506 195.941
 278.522 c 182.555 252.893 l 178.543 252.893 l 164.324 278.643 l 163.266
 280.561 161.25 281.752 159.062 281.752 c 141.074 281.752 l 131.793 281.752
 124.242 289.299 124.242 298.584 c 124.242 307.866 131.793 315.416 141.074
 315.416 c 380.742 315.416 l 390.027 315.416 397.578 307.866 397.578 298.584
 c 397.578 289.299 390.027 281.752 380.742 281.752 c h
380.742 281.752 m f
353.492 195.983 m 301.391 195.983 l 289.836 195.983 279.379 188.948 274.875
 178.514 c 256.836 173.303 l 254.266 172.561 252.492 170.205 252.492 167.526
 c 252.492 164.85 254.262 162.495 256.836 161.752 c 274.492 156.651 l 278.754
 145.67 289.352 138.272 301.391 138.272 c 353.492 138.272 l 369.402 138.272
 382.348 151.213 382.348 167.127 c 382.348 183.038 369.402 195.983 353.492
 195.983 c h
353.492 150.295 m 301.391 150.295 l 293.66 150.295 286.949 155.522 285.066
 163.002 c 284.543 165.077 282.961 166.721 280.902 167.315 c 280.164 167.53
 l 281.145 167.811 l 283.117 168.381 284.664 169.92 285.242 171.889 c 287.336
 178.998 293.973 183.959 301.387 183.959 c 353.488 183.959 l 362.773 183.959
 370.324 176.409 370.324 167.127 c 370.324 157.846 362.773 150.295 353.492
 150.295 c h
353.492 150.295 m f
Q Q
showpage
%%Trailer
end restore
%%EOF
