%!PS-Adobe-3.0 EPSF-3.0
%%Creator: cairo 1.14.2 (http://cairographics.org)
%%CreationDate: Mon Feb 19 09:15:05 2018
%%Pages: 1
%%DocumentData: Clean7Bit
%%LanguageLevel: 2
%%BoundingBox: 0 -1 410 410
%%EndComments
%%BeginProlog
save
50 dict begin
/q { gsave } bind def
/Q { grestore } bind def
/cm { 6 array astore concat } bind def
/w { setlinewidth } bind def
/J { setlinecap } bind def
/j { setlinejoin } bind def
/M { setmiterlimit } bind def
/d { setdash } bind def
/m { moveto } bind def
/l { lineto } bind def
/c { curveto } bind def
/h { closepath } bind def
/re { exch dup neg 3 1 roll 5 3 roll moveto 0 rlineto
      0 exch rlineto 0 rlineto closepath } bind def
/S { stroke } bind def
/f { fill } bind def
/f* { eofill } bind def
/n { newpath } bind def
/W { clip } bind def
/W* { eoclip } bind def
/BT { } bind def
/ET { } bind def
/pdfmark where { pop globaldict /?pdfmark /exec load put }
    { globaldict begin /?pdfmark /pop load def /pdfmark
    /cleartomark load def end } ifelse
/BDC { mark 3 1 roll /BDC pdfmark } bind def
/EMC { mark /EMC pdfmark } bind def
/cairo_store_point { /cairo_point_y exch def /cairo_point_x exch def } def
/Tj { show currentpoint cairo_store_point } bind def
/TJ {
  {
    dup
    type /stringtype eq
    { show } { -0.001 mul 0 cairo_font_matrix dtransform rmoveto } ifelse
  } forall
  currentpoint cairo_store_point
} bind def
/cairo_selectfont { cairo_font_matrix aload pop pop pop 0 0 6 array astore
    cairo_font exch selectfont cairo_point_x cairo_point_y moveto } bind def
/Tf { pop /cairo_font exch def /cairo_font_matrix where
      { pop cairo_selectfont } if } bind def
/Td { matrix translate cairo_font_matrix matrix concatmatrix dup
      /cairo_font_matrix exch def dup 4 get exch 5 get cairo_store_point
      /cairo_font where { pop cairo_selectfont } if } bind def
/Tm { 2 copy 8 2 roll 6 array astore /cairo_font_matrix exch def
      cairo_store_point /cairo_font where { pop cairo_selectfont } if } bind def
/g { setgray } bind def
/rg { setrgbcolor } bind def
/d1 { setcachedevice } bind def
%%EndProlog
%%BeginSetup
%%EndSetup
%%Page: 1 1
%%BeginPageSetup
%%PageBoundingBox: 0 -1 410 410
%%EndPageSetup
q 0 -1 410 411 rectclip q
0.956863 0.67451 0.270588 rg
215.977 76.799 m 214.504 84.413 l 211.055 102.288 195.406 115.202 177.203
 115.202 c 11.367 115.202 l 9.32 115.202 8.488 112.565 10.164 111.389 c 
24.594 101.264 l 19.051 94.491 16 85.963 16 77.202 c 16 56.248 33.047 39.202
 54 39.202 c 216 39.202 l h
215.977 76.799 m f
0.929412 0.596078 0.160784 rg
145.508 59.112 m 89.199 59.112 l 68.246 59.112 51.199 76.163 51.199 97.112
 c 51.199 103.459 52.805 109.678 55.797 115.202 c 11.367 115.202 l 9.32 
115.202 8.488 112.565 10.164 111.389 c 24.594 101.264 l 19.051 94.491 16
 85.963 16 77.202 c 16 56.248 33.047 39.202 54 39.202 c 216 39.202 l 215.988
 59.112 l h
145.508 59.112 m f
0.764706 0.854902 0.25098 rg
113.934 5.6 m 111.098 5.6 108.801 7.897 108.801 10.733 c 108.801 35.6 l
 108.801 36.842 108.738 38.104 108.613 39.455 c 108.598 39.698 l 107.555
 50.038 102.695 59.498 94.902 66.413 c 87.285 73.17 l 85.543 74.717 86.637
 77.6 88.969 77.6 c 208.289 77.6 l 208.801 77.635 l 209.316 77.6 l 232.422
 77.538 251.199 58.721 251.199 35.6 c 251.199 10.733 l 251.199 7.897 248.902
 5.6 246.066 5.6 c h
113.934 5.6 m f
0.678431 0.737255 0.0823529 rg
208.801 77.635 m 208.289 77.6 l 209.316 77.6 l h
208.801 77.635 m f
144.695 10.733 m 144.695 35.6 l 144.695 36.842 144.637 38.104 144.508 39.455
 c 144.492 39.698 l 143.449 50.038 138.594 59.498 130.801 66.413 c 123.184
 73.17 l 121.438 74.717 122.535 77.6 124.863 77.6 c 88.969 77.6 l 86.637
 77.6 85.543 74.717 87.285 73.17 c 94.902 66.413 l 102.695 59.498 107.555
 50.038 108.598 39.698 c 108.613 39.455 l 108.738 38.104 108.801 36.842 
108.801 35.6 c 108.801 10.733 l 108.801 7.897 111.098 5.6 113.934 5.6 c 
149.832 5.6 l 146.996 5.6 144.695 7.897 144.695 10.733 c h
144.695 10.733 m f
0.956863 0.67451 0.270588 rg
395.594 403.998 m 232.395 403.998 l 214.191 403.998 198.547 391.088 195.094
 373.213 c 193.625 365.6 l 193.625 327.998 l 355.602 327.998 l 376.555 327.998
 393.602 345.045 393.602 365.998 c 393.602 374.764 390.551 383.291 385.004
 390.061 c 397.273 398.67 l 399.621 400.315 398.457 403.998 395.594 403.998
 c h
395.594 403.998 m f
0.929412 0.596078 0.160784 rg
347.219 349.6 m 241.547 349.6 l 241.547 387.202 l 243.02 394.815 l 243.645
 398.057 244.676 401.131 246.047 403.998 c 232.395 403.998 l 214.191 403.998
 198.547 391.088 195.094 373.213 c 193.625 365.6 l 193.625 327.998 l 355.602
 327.998 l 370.684 327.998 383.742 336.834 389.875 349.6 c h
347.219 349.6 m f
0.764706 0.854902 0.25098 rg
166.152 294.401 m 161.871 294.401 158.402 297.87 158.402 302.151 c 158.402
 324.401 l 158.402 347.522 177.18 366.338 200.285 366.401 c 200.801 366.436
 l 201.312 366.401 l 320.273 366.401 l 322.73 366.401 323.883 363.362 322.047
 361.733 c 314.699 355.213 l 306.887 348.28 302.023 338.791 301.004 328.487
 c 300.988 328.256 l 300.863 326.905 300.801 325.643 300.801 324.401 c 300.801
 302.151 l 300.801 297.87 297.332 294.401 293.051 294.401 c h
166.152 294.401 m f
0.678431 0.737255 0.0823529 rg
196.125 302.151 m 196.125 324.401 l 196.125 347.522 214.906 366.338 238.012
 366.401 c 201.312 366.401 l 200.801 366.436 l 200.285 366.401 l 177.18 
366.338 158.398 347.522 158.398 324.401 c 158.398 302.151 l 158.398 297.87
 161.871 294.401 166.152 294.401 c 203.875 294.401 l 199.598 294.401 196.125
 297.87 196.125 302.151 c h
196.125 302.151 m f
0.192157 0.823529 0.968627 rg
198.102 176.705 m 94.137 176.705 l 76.527 176.705 61.707 190.569 61.293
 208.174 c 60.863 226.311 75.492 241.202 93.531 241.202 c 317.867 241.202
 l 335.477 241.202 350.293 227.334 350.711 209.729 c 351.137 191.592 336.512
 176.705 318.473 176.705 c 215.152 176.705 l 209.078 159.346 l 208.121 156.616
 204.23 156.69 203.379 159.459 c h
198.102 176.705 m f
0.0745098 0.67451 0.909804 rg
108.891 188.436 m 108.461 206.569 123.09 221.459 141.129 221.459 c 348.141
 221.459 l 343.113 233.116 331.309 241.202 317.863 241.202 c 93.527 241.202
 l 75.488 241.202 60.859 226.311 61.289 208.174 c 61.707 190.569 76.523 
176.705 94.133 176.705 c 111.461 176.705 l 109.902 180.319 108.988 184.268
 108.891 188.436 c h
108.891 188.436 m f
0 g
318.469 246.799 m 94.164 246.799 l 73.441 246.799 56.082 230.405 55.688
 209.686 c 55.285 188.479 72.418 171.104 93.531 171.104 c 126.77 171.104
 l 130.086 171.104 132.77 173.791 132.77 177.104 c 132.77 180.416 130.086
 183.104 126.77 183.104 c 94.047 183.104 l 79.586 183.104 67.441 194.94 
67.688 209.397 c 67.926 223.444 79.426 234.799 93.531 234.799 c 317.957 
234.799 l 332.418 234.799 344.562 222.963 344.312 208.506 c 344.074 194.459
 332.574 183.104 318.469 183.104 c 214.867 183.104 l 212.32 183.104 210.047
 181.495 209.207 179.084 c 206.465 171.252 l 204.133 178.862 l 203.359 181.381
 201.031 183.104 198.395 183.104 c 165.812 183.104 l 162.496 183.104 159.812
 180.416 159.812 177.104 c 159.812 173.791 162.496 171.104 165.812 171.104
 c 193.957 171.104 l 200.168 150.827 l 200.914 148.393 202.93 146.53 205.434
 146.061 c 205.758 145.998 205.914 145.998 206.086 145.998 c 208.629 145.998
 210.902 147.608 211.746 150.018 c 219.125 171.104 l 317.836 171.104 l 338.559
 171.104 355.918 187.498 356.312 208.221 c 356.715 229.424 339.582 246.799
 318.469 246.799 c h
318.469 246.799 m f
409.32 405.409 m 408.531 407.905 406.219 409.6 403.602 409.6 c 232.398 
409.6 l 209.922 409.6 191.363 392.498 189.047 370.62 c 168.266 365.514 152.801
 346.733 152.801 324.401 c 152.801 294.799 l 152.801 291.487 155.484 288.799
 158.801 288.799 c 300.398 288.799 l 303.715 288.799 306.398 291.487 306.398
 294.799 c 306.398 322.401 l 355.602 322.401 l 379.641 322.401 399.199 341.959
 399.199 365.998 c 399.199 374.038 396.965 381.901 392.816 388.702 c 407.047
 398.69 l 409.191 400.194 410.109 402.909 409.32 405.409 c h
294.398 300.799 m 164.801 300.799 l 164.801 324.401 l 164.801 344.03 180.77
 359.998 200.398 359.998 c 200.535 359.998 200.668 360.01 200.801 360.022
 c 200.934 360.01 201.066 359.998 201.199 359.998 c 310.449 359.998 l 301.711
 352.245 295.832 341.334 294.633 329.069 c 294.625 328.995 294.621 328.92
 294.613 328.85 c 294.477 327.381 294.398 325.901 294.398 324.401 c h
355.602 334.401 m 307.84 334.401 l 312.172 349.174 325.844 359.998 342 
359.998 c 370.398 359.998 l 373.715 359.998 376.398 362.686 376.398 365.998
 c 376.398 369.315 373.715 371.998 370.398 371.998 c 201.379 371.998 l 204.191
 386.565 217.027 397.6 232.398 397.6 c 384.605 397.6 l 380.973 395.053 l
 379.598 394.088 378.691 392.588 378.473 390.92 c 378.254 389.256 378.742
 387.573 379.824 386.284 c 384.578 380.612 387.199 373.409 387.199 365.998
 c 387.199 348.577 373.023 334.401 355.602 334.401 c h
355.602 334.401 m f
220.555 81.823 m 218.238 103.698 199.68 120.799 177.199 120.799 c 6 120.799
 l 3.383 120.799 1.066 119.104 0.277 116.608 c -0.508 114.112 0.41 111.393
 2.555 109.889 c 16.781 99.905 l 12.637 93.104 10.398 85.237 10.398 77.202
 c 10.398 53.159 29.957 33.6 54 33.6 c 103.199 33.6 l 103.199 5.998 l 103.199
 2.686 105.887 -0.002 109.199 -0.002 c 250.801 -0.002 l 254.113 -0.002 256.801
 2.686 256.801 5.998 c 256.801 35.6 l 256.801 57.936 241.336 76.713 220.555
 81.823 c h
22.398 77.202 m 22.398 84.608 25.02 91.811 29.777 97.487 c 30.859 98.772
 31.348 100.455 31.129 102.123 c 30.91 103.788 30.004 105.288 28.625 106.252
 c 24.996 108.799 l 177.199 108.799 l 192.574 108.799 205.41 97.764 208.223
 83.202 c 39.199 83.202 l 35.887 83.202 33.199 80.514 33.199 77.202 c 33.199
 73.885 35.887 71.202 39.199 71.202 c 67.602 71.202 l 83.758 71.202 97.426
 60.373 101.762 45.6 c 54 45.6 l 36.574 45.6 22.398 59.776 22.398 77.202
 c h
244.801 11.998 m 115.199 11.998 l 115.199 35.6 l 115.199 37.1 115.121 38.584
 114.984 40.049 c 114.98 40.123 114.977 40.198 114.969 40.268 c 113.77 52.534
 107.891 63.444 99.148 71.202 c 208.398 71.202 l 208.535 71.202 208.668 
71.209 208.801 71.221 c 208.934 71.209 209.066 71.202 209.199 71.202 c 228.828
 71.202 244.801 55.229 244.801 35.6 c h
244.801 11.998 m f
228.645 337.959 m 242.398 337.959 l 245.715 337.959 248.398 340.647 248.398
 343.959 c 248.398 347.276 245.715 349.959 242.398 349.959 c 237.965 349.959
 l 237.652 352.979 235.102 355.33 232 355.33 c 228.809 355.33 226.207 352.838
 226.02 349.694 c 220.078 348.475 215.602 343.209 215.602 336.916 c 215.602
 336.245 l 215.602 329.053 221.453 323.198 228.645 323.198 c 235.355 323.198
 l 235.934 323.198 236.402 322.729 236.402 322.155 c 236.402 321.577 235.934
 321.108 235.355 321.108 c 221.602 321.108 l 218.285 321.108 215.602 318.424
 215.602 315.108 c 215.602 311.795 218.285 309.108 221.602 309.108 c 226.336
 309.108 l 226.336 309.069 l 226.336 305.756 229.02 303.069 232.336 303.069
 c 235.648 303.069 238.336 305.756 238.336 309.069 c 238.336 309.463 l 244.094
 310.819 248.398 315.987 248.398 322.155 c 248.398 329.346 242.547 335.198
 235.355 335.198 c 228.645 335.198 l 228.066 335.198 227.598 335.666 227.598
 336.245 c 227.598 336.916 l 227.602 337.491 228.07 337.959 228.645 337.959
 c h
228.645 337.959 m f
172.645 49.959 m 186.398 49.959 l 189.715 49.959 192.398 52.647 192.398
 55.959 c 192.398 59.276 189.715 61.959 186.398 61.959 c 181.965 61.959 
l 181.652 64.979 179.102 67.33 176 67.33 c 172.809 67.33 170.207 64.838 
170.02 61.694 c 164.078 60.475 159.602 55.209 159.602 48.916 c 159.602 48.245
 l 159.602 41.053 165.453 35.198 172.645 35.198 c 179.355 35.198 l 179.934
 35.198 180.402 34.729 180.402 34.155 c 180.402 33.577 179.934 33.108 179.355
 33.108 c 165.602 33.108 l 162.285 33.108 159.602 30.424 159.602 27.108 
c 159.602 23.795 162.285 21.108 165.602 21.108 c 170.336 21.108 l 170.336
 21.069 l 170.336 17.756 173.02 15.069 176.336 15.069 c 179.648 15.069 182.336
 17.756 182.336 21.069 c 182.336 21.463 l 188.094 22.819 192.398 27.987 
192.398 34.155 c 192.398 41.346 186.547 47.198 179.355 47.198 c 172.645 
47.198 l 172.066 47.198 171.598 47.666 171.598 48.245 c 171.598 48.916 l
 171.602 49.491 172.07 49.959 172.645 49.959 c h
172.645 49.959 m f
118.398 208.401 m 118.398 204.202 114.996 200.799 110.801 200.799 c 106.602
 200.799 103.199 204.202 103.199 208.401 c 103.199 212.596 106.602 215.998
 110.801 215.998 c 114.996 215.998 118.398 212.596 118.398 208.401 c h
118.398 208.401 m f
156 208.401 m 156 204.202 152.598 200.799 148.398 200.799 c 144.203 200.799
 140.801 204.202 140.801 208.401 c 140.801 212.596 144.203 215.998 148.398
 215.998 c 152.598 215.998 156 212.596 156 208.401 c h
156 208.401 m f
193.602 208.401 m 193.602 204.202 190.199 200.799 186 200.799 c 181.801
 200.799 178.398 204.202 178.398 208.401 c 178.398 212.596 181.801 215.998
 186 215.998 c 190.199 215.998 193.602 212.596 193.602 208.401 c h
193.602 208.401 m f
231.199 208.401 m 231.199 204.202 227.797 200.799 223.602 200.799 c 219.402
 200.799 216 204.202 216 208.401 c 216 212.596 219.402 215.998 223.602 215.998
 c 227.797 215.998 231.199 212.596 231.199 208.401 c h
231.199 208.401 m f
268.801 208.401 m 268.801 204.202 265.398 200.799 261.199 200.799 c 257.004
 200.799 253.602 204.202 253.602 208.401 c 253.602 212.596 257.004 215.998
 261.199 215.998 c 265.398 215.998 268.801 212.596 268.801 208.401 c h
268.801 208.401 m f
306.398 208.401 m 306.398 204.202 302.996 200.799 298.801 200.799 c 294.602
 200.799 291.199 204.202 291.199 208.401 c 291.199 212.596 294.602 215.998
 298.801 215.998 c 302.996 215.998 306.398 212.596 306.398 208.401 c h
306.398 208.401 m f
Q Q
showpage
%%Trailer
end restore
%%EOF
