%!PS-Adobe-3.0 EPSF-3.0
%%Creator: cairo 1.14.2 (http://cairographics.org)
%%CreationDate: Mon Feb 19 09:15:05 2018
%%Pages: 1
%%DocumentData: Clean7Bit
%%LanguageLevel: 2
%%BoundingBox: 8 -1 401 410
%%EndComments
%%BeginProlog
save
50 dict begin
/q { gsave } bind def
/Q { grestore } bind def
/cm { 6 array astore concat } bind def
/w { setlinewidth } bind def
/J { setlinecap } bind def
/j { setlinejoin } bind def
/M { setmiterlimit } bind def
/d { setdash } bind def
/m { moveto } bind def
/l { lineto } bind def
/c { curveto } bind def
/h { closepath } bind def
/re { exch dup neg 3 1 roll 5 3 roll moveto 0 rlineto
      0 exch rlineto 0 rlineto closepath } bind def
/S { stroke } bind def
/f { fill } bind def
/f* { eofill } bind def
/n { newpath } bind def
/W { clip } bind def
/W* { eoclip } bind def
/BT { } bind def
/ET { } bind def
/pdfmark where { pop globaldict /?pdfmark /exec load put }
    { globaldict begin /?pdfmark /pop load def /pdfmark
    /cleartomark load def end } ifelse
/BDC { mark 3 1 roll /BDC pdfmark } bind def
/EMC { mark /EMC pdfmark } bind def
/cairo_store_point { /cairo_point_y exch def /cairo_point_x exch def } def
/Tj { show currentpoint cairo_store_point } bind def
/TJ {
  {
    dup
    type /stringtype eq
    { show } { -0.001 mul 0 cairo_font_matrix dtransform rmoveto } ifelse
  } forall
  currentpoint cairo_store_point
} bind def
/cairo_selectfont { cairo_font_matrix aload pop pop pop 0 0 6 array astore
    cairo_font exch selectfont cairo_point_x cairo_point_y moveto } bind def
/Tf { pop /cairo_font exch def /cairo_font_matrix where
      { pop cairo_selectfont } if } bind def
/Td { matrix translate cairo_font_matrix matrix concatmatrix dup
      /cairo_font_matrix exch def dup 4 get exch 5 get cairo_store_point
      /cairo_font where { pop cairo_selectfont } if } bind def
/Tm { 2 copy 8 2 roll 6 array astore /cairo_font_matrix exch def
      cairo_store_point /cairo_font where { pop cairo_selectfont } if } bind def
/g { setgray } bind def
/rg { setrgbcolor } bind def
/d1 { setcachedevice } bind def
%%EndProlog
%%BeginSetup
%%EndSetup
%%Page: 1 1
%%BeginPageSetup
%%PageBoundingBox: 8 -1 401 410
%%EndPageSetup
q 8 -1 393 411 rectclip q
0.207843 g
282.625 295.712 m 280.551 298.072 l 280.473 308.095 272.945 317.865 259.871
 324.9 c 247.094 331.779 229.969 335.564 211.652 335.564 c 193.336 335.564
 176.211 331.779 163.434 324.9 c 150.363 317.865 142.836 308.095 142.754
 298.072 c 140.703 295.736 l 132.594 287.627 128.129 276.861 128.129 265.423
 c 128.129 229.013 l 295.18 229.013 l 295.18 265.423 l 295.18 276.861 290.711
 287.623 282.625 295.712 c h
282.625 295.712 m f
0.188235 0.164706 0.129412 rg
210.148 295.736 m 212.199 298.072 l 212.281 308.095 219.809 317.865 232.879
 324.9 c 236.965 327.103 241.504 328.982 246.375 330.525 c 236.016 333.81
 224.113 335.564 211.652 335.564 c 193.336 335.564 176.211 331.779 163.434
 324.9 c 150.363 317.865 142.836 308.095 142.754 298.072 c 140.703 295.736
 l 132.594 287.627 128.129 276.861 128.129 265.423 c 128.129 229.013 l 197.574
 229.013 l 197.574 265.423 l 197.574 276.861 202.039 287.627 210.148 295.736
 c h
210.148 295.736 m f
1 0.384314 0.654902 rg
86.914 330.595 m 32.637 330.595 l 22.699 330.595 14.641 338.654 14.641 
348.591 c 14.641 385.638 l 14.641 395.58 22.699 403.634 32.637 403.634 c
 104.414 403.634 l 114.352 403.634 122.406 395.58 122.406 385.638 c 122.406
 348.591 l 122.406 338.654 114.352 330.595 104.41 330.595 c 101.199 330.595
 l 99.777 319.787 l 99.562 318.146 97.492 317.56 96.449 318.845 c h
86.914 330.595 m f
0.988235 0.329412 0.47451 rg
47.516 340.052 m 47.516 377.099 l 47.516 387.037 55.57 395.095 65.512 395.095
 c 119.703 395.095 l 116.531 400.212 110.879 403.634 104.414 403.634 c 32.637
 403.634 l 22.699 403.634 14.641 395.576 14.641 385.638 c 14.641 348.591
 l 14.641 338.654 22.699 330.595 32.637 330.595 c 50.219 330.595 l 48.516
 333.345 47.516 336.58 47.516 340.052 c h
47.516 340.052 m f
93.844 322.056 m 96.449 318.845 l 97.492 317.56 99.562 318.146 99.777 319.787
 c 100.078 322.056 l h
93.844 322.056 m f
1 0.811765 0.34902 rg
323.176 361.193 m 310.242 361.193 l 298.355 361.193 288.309 370.923 288.508
 382.814 c 288.703 394.365 298.164 403.705 309.762 403.705 c 373.219 403.705
 l 385.109 403.705 395.156 393.974 394.957 382.084 c 394.762 370.533 385.301
 361.193 373.703 361.193 c 334.426 361.193 l 330.41 354.619 l 329.676 353.42
 327.93 353.42 327.195 354.619 c h
323.176 361.193 m f
0.976471 0.631373 0.254902 rg
314.609 371.216 m 314.805 382.771 324.262 392.107 335.859 392.107 c 392.531
 392.107 l 388.875 398.986 381.496 403.705 373.219 403.705 c 309.762 403.705
 l 298.164 403.705 288.703 394.369 288.508 382.814 c 288.309 370.923 298.355
 361.193 310.242 361.193 c 317.031 361.193 l 315.438 364.197 314.547 367.607
 314.609 371.216 c h
314.609 371.216 m f
0.858824 0.682353 0.431373 rg
131.539 196.439 m 122.328 196.439 114.832 203.935 114.832 213.146 c 114.832
 222.361 122.328 229.857 131.539 229.857 c 146.258 229.857 l 146.258 196.439
 l h
131.539 196.439 m f
277.051 196.439 m 277.051 229.857 l 291.766 229.857 l 300.98 229.857 308.477
 222.361 308.477 213.146 c 308.477 203.931 300.98 196.435 291.766 196.435
 c 277.051 196.435 l h
277.051 196.439 m f
0.192157 0.823529 0.968627 rg
154.723 34.896 m 154.723 64.697 l 154.723 81.349 168.266 94.896 184.918
 94.896 c 237.059 94.896 l 253.707 94.896 267.254 81.349 267.254 64.697 
c 267.238 34.884 l h
154.723 34.896 m f
0.0745098 0.67451 0.909804 rg
190.797 34.896 m 190.797 64.697 l 190.797 64.884 190.797 65.068 190.801
 65.255 c 190.91 71.248 197.109 75.002 202.609 72.615 c 205.211 71.486 208.078
 70.865 211.094 70.88 c 222.809 70.939 232.133 80.791 232.133 92.505 c 232.133
 94.896 l 184.918 94.896 l 168.242 94.896 154.723 81.377 154.723 64.697 
c 154.723 34.896 l 267.238 34.88 l 267.238 34.888 l h
190.797 34.896 m f
0.427451 0.266667 0.176471 rg
94.938 5.892 m 89.891 5.892 85.785 10.002 85.785 15.048 c 85.785 26.205
 l 85.785 31.255 89.891 35.361 94.938 35.361 c 326.684 35.361 l 331.73 35.361
 335.84 31.255 335.84 26.205 c 335.84 15.048 l 335.84 10.002 331.73 5.892
 326.684 5.892 c h
94.938 5.892 m f
0.368627 0.207843 0.129412 rg
139.98 20.146 m 134.934 20.146 130.828 24.255 130.828 29.302 c 130.828 
35.361 l 94.938 35.361 l 89.891 35.361 85.785 31.252 85.785 26.205 c 85.785
 15.045 l 85.785 9.998 89.891 5.892 94.938 5.892 c 326.684 5.892 l 331.73
 5.892 335.84 9.998 335.84 15.045 c 335.84 20.146 l h
139.98 20.146 m f
0.980392 0.827451 0.576471 rg
210.988 85.595 m 202.691 85.595 195.941 92.345 195.941 100.642 c 195.941
 137.459 l 203.508 136.513 l 206.352 136.158 209.016 135.986 211.652 135.986
 c 213.926 135.986 216.262 136.111 218.594 136.357 c 226.035 137.146 l 226.035
 100.642 l 226.035 92.345 219.285 85.595 210.988 85.595 c h
210.988 85.595 m f
0.929412 0.717647 0.411765 rg
210.988 100.642 m 210.988 135.998 l 208.566 136.025 206.113 136.189 203.508
 136.513 c 195.941 137.455 l 195.941 100.642 l 195.941 92.345 202.691 85.595
 210.988 85.595 c 213.73 85.595 216.297 86.345 218.512 87.63 c 214.023 90.24
 210.988 95.087 210.988 100.642 c h
210.988 100.642 m f
0.980392 0.827451 0.576471 rg
211 122.642 m 174.535 122.998 145.414 153.259 145.414 189.724 c 145.414
 265.423 l 145.414 267.834 145.75 270.224 146.414 272.529 c 147.715 277.029
 153.098 278.865 156.875 276.087 c 169.832 266.564 189.797 261.103 211.652
 261.103 c 233.148 261.103 253.625 266.709 266.438 276.095 c 270.215 278.861
 275.594 277.025 276.891 272.525 c 277.555 270.212 277.891 267.822 277.891
 265.42 c 277.891 188.88 l 277.895 152.138 247.824 122.287 211 122.642 c
 h
211 122.642 m f
0.929412 0.717647 0.411765 rg
276.891 272.525 m 275.594 277.025 270.215 278.865 266.438 276.095 c 253.629
 266.709 233.148 261.103 211.652 261.103 c 189.895 261.103 170.012 266.517
 157.051 275.962 c 153.266 278.716 147.895 276.97 146.414 272.529 c 145.75
 270.224 145.414 267.834 145.414 265.423 c 145.414 189.724 l 145.414 153.255
 174.535 122.998 211 122.642 c 219.988 122.556 228.57 124.279 236.414 127.455
 c 213.844 138.834 198.426 162.47 198.426 189.408 c 198.426 223.232 l 198.426
 230.439 204.309 236.193 211.52 236.189 c 211.652 236.189 l 233.812 236.189
 254.926 241.966 268.129 251.642 c 271.367 254.013 275.738 253.099 277.891
 250.056 c 277.891 266.349 l 277.895 268.447 277.555 270.533 276.891 272.525
 c h
276.891 272.525 m f
0.207843 g
284.508 107.318 m 281.922 107.318 279.488 108.326 277.66 110.154 c 271.711
 116.103 l 269.883 117.935 268.875 120.365 268.875 122.951 c 268.875 125.537
 269.883 127.97 271.715 129.798 c 273.539 131.627 275.969 132.63 278.559
 132.63 c 281.145 132.63 283.578 131.623 285.406 129.795 c 291.355 123.841
 l 293.184 122.013 294.191 119.584 294.191 116.998 c 294.191 114.408 293.184
 111.978 291.355 110.15 c 289.531 108.326 287.098 107.318 284.508 107.318
 c h
284.508 107.318 m f
0 g
373.703 409.599 m 309.762 409.599 l 294.793 409.599 282.613 397.42 282.613
 382.451 c 282.613 367.478 294.793 355.302 309.762 355.302 c 318.742 355.302
 l 322.402 343.345 l 323.203 340.736 325.586 338.931 328.316 338.88 c 328.359
 338.877 328.398 338.877 328.441 338.877 c 331.121 338.877 333.512 340.568
 334.398 343.107 c 338.668 355.298 l 373.703 355.298 l 388.672 355.298 400.852
 367.478 400.852 382.447 c 400.852 397.42 388.672 409.599 373.703 409.599
 c h
373.703 367.931 m 334.188 367.931 l 331.957 367.931 329.93 366.759 328.801
 364.908 c 327.672 366.752 325.648 367.931 323.414 367.931 c 309.762 367.931
 l 301.754 367.931 295.242 374.443 295.242 382.451 c 295.242 390.459 301.754
 396.97 309.762 396.97 c 373.703 396.97 l 381.711 396.97 388.223 390.455
 388.223 382.451 c 388.223 374.443 381.711 367.931 373.703 367.931 c h
373.703 367.931 m f
326.684 41.255 m 314.367 41.255 l 314.367 95.56 l 314.367 97.232 313.703
 98.837 312.52 100.025 c 299.551 112.994 l 299.895 114.287 300.086 115.627
 300.086 116.998 c 300.086 121.158 298.465 125.072 295.523 128.009 c 289.57
 133.962 l 286.629 136.904 282.715 138.525 278.559 138.525 c 274.398 138.525
 270.484 136.908 267.543 133.966 c 264.602 131.021 262.98 127.111 262.98
 122.951 c 262.98 118.791 264.602 114.877 267.543 111.935 c 273.496 105.986
 l 276.438 103.041 280.348 101.423 284.508 101.423 c 287.004 101.423 289.406
 102.013 291.566 103.115 c 301.738 92.943 l 301.738 41.252 l 273.129 41.252
 l 273.133 41.38 273.148 41.505 273.148 41.63 c 273.148 64.697 l 273.148
 84.599 256.957 100.787 237.059 100.787 c 231.855 100.787 l 231.898 101.337
 231.93 101.892 231.93 102.451 c 231.93 119.67 l 261.859 128.451 283.785
 156.146 283.785 188.88 c 283.785 190.545 l 291.766 190.545 l 304.23 190.545
 314.367 200.685 314.367 213.15 c 314.367 222.295 308.906 230.185 301.07
 233.74 c 301.07 265.423 l 301.07 278.365 296.047 290.545 286.922 299.752
 c 286.328 300.423 l 284.164 323.63 252.145 341.459 211.652 341.459 c 171.164
 341.459 139.141 323.63 136.977 300.423 c 136.387 299.752 l 127.258 290.545
 122.234 278.365 122.234 265.423 c 122.234 233.736 l 114.402 230.185 108.938
 222.295 108.938 213.146 c 108.938 200.685 119.074 190.545 131.539 190.545
 c 139.52 190.545 l 139.52 188.88 l 139.52 156.63 160.797 129.259 190.047
 120.056 c 190.047 102.451 l 190.047 101.892 190.078 101.337 190.121 100.787
 c 184.918 100.787 l 165.02 100.787 148.828 84.599 148.828 64.697 c 148.828
 41.63 l 148.828 41.505 148.844 41.38 148.848 41.252 c 94.938 41.252 l 86.641
 41.252 79.891 34.502 79.891 26.205 c 79.891 15.045 l 79.891 6.748 86.641
 -0.002 94.938 -0.002 c 326.684 -0.002 l 334.98 -0.002 341.73 6.748 341.73
 15.045 c 341.73 26.209 l 341.73 34.502 334.98 41.255 326.684 41.255 c h
286.594 114.916 m 285.844 114.162 284.965 114.052 284.508 114.052 c 284.055
 114.052 283.176 114.162 282.426 114.916 c 276.473 120.869 l 275.723 121.619
 275.609 122.494 275.609 122.951 c 275.609 123.408 275.723 124.283 276.473
 125.037 c 277.223 125.787 278.102 125.9 278.559 125.9 c 279.012 125.9 279.891
 125.787 280.641 125.037 c 286.594 119.08 l 287.344 118.33 287.457 117.455
 287.457 116.998 c 287.457 116.541 287.344 115.666 286.594 114.916 c h
301.738 213.146 m 301.738 207.65 297.266 203.173 291.766 203.173 c 283.785
 203.173 l 283.785 223.123 l 291.766 223.123 l 297.266 223.123 301.738 218.646
 301.738 213.146 c h
139.52 203.173 m 131.539 203.173 l 126.039 203.173 121.566 207.646 121.566
 213.146 c 121.566 218.646 126.039 223.123 131.539 223.123 c 139.52 223.123
 l h
149.824 285.341 m 147.676 285.341 145.676 284.252 144.512 282.447 c 141.246
 277.369 139.52 271.482 139.52 265.423 c 139.52 235.752 l 134.863 235.752
 l 134.863 265.423 l 134.863 275.06 138.629 284.134 145.465 290.97 c 145.562
 291.068 145.66 291.17 145.75 291.275 c 147.922 293.752 l 148.934 294.904
 149.488 296.38 149.488 297.912 c 149.488 312.841 174.469 328.83 211.652
 328.83 c 248.836 328.83 273.816 312.845 273.816 297.912 c 273.816 296.38
 274.375 294.9 275.387 293.752 c 277.559 291.271 l 277.648 291.17 277.742
 291.068 277.84 290.97 c 284.68 284.134 288.441 275.06 288.441 265.423 c
 288.441 235.752 l 283.785 235.752 l 283.785 265.423 l 283.785 270.869 282.371
 276.236 279.699 280.947 c 278.59 282.908 276.52 284.123 274.27 284.146 
c 269.441 284.193 l 269.379 284.193 l 267.883 284.193 266.434 283.662 265.293
 282.689 c 253.902 273.009 233.348 266.998 211.656 266.998 c 189.066 266.998
 168.102 273.377 156.938 283.65 c 155.789 284.705 154.289 285.302 152.727
 285.318 c 149.887 285.345 l 149.824 285.345 l h
152.148 188.88 m 152.148 265.423 l 152.148 267.209 152.398 268.97 152.887
 270.662 c 166.871 260.384 188.309 254.369 211.652 254.369 c 234.828 254.369
 256.426 260.408 270.418 270.662 c 270.906 268.966 271.156 267.205 271.156
 265.423 c 271.156 188.88 l 271.156 156.068 244.465 129.377 211.652 129.377
 c 178.844 129.377 152.148 156.068 152.148 188.88 c h
219.301 117.158 m 219.301 102.455 l 219.301 97.869 215.57 94.142 210.988
 94.142 c 206.406 94.142 202.676 97.869 202.676 102.455 c 202.676 117.326
 l 205.621 116.959 208.609 116.748 211.652 116.748 c 214.234 116.748 216.785
 116.892 219.301 117.158 c h
329.102 15.048 m 329.102 13.712 328.02 12.627 326.684 12.627 c 94.938 12.627
 l 93.602 12.627 92.52 13.709 92.52 15.048 c 92.52 26.205 l 92.52 27.541
 93.602 28.627 94.938 28.627 c 206.746 28.627 l 210.336 28.627 213.246 31.533
 213.246 35.123 c 213.246 35.127 l 213.246 38.716 210.336 41.627 206.75 
41.627 c 161.457 41.63 l 161.457 64.697 l 161.457 77.654 171.961 88.158 
184.918 88.158 c 195.703 88.158 l 199.527 84.072 204.961 81.509 210.988 
81.509 c 217.016 81.509 222.449 84.072 226.273 88.158 c 237.059 88.158 l
 249.996 88.158 260.52 77.634 260.52 64.697 c 260.508 41.619 l 248.203 41.619
 l 244.613 41.619 241.703 38.709 241.703 35.123 c 241.703 31.533 244.613
 28.627 248.199 28.627 c 326.684 28.627 l 328.02 28.627 329.102 27.541 329.102
 26.205 c h
329.102 15.048 m f
95.93 310.13 m 97.152 308.627 98.965 307.795 100.832 307.795 c 101.539 
307.795 102.25 307.916 102.941 308.162 c 105.461 309.056 107.145 311.439
 107.145 314.111 c 107.145 324.857 l 119.035 326.22 128.301 336.345 128.301
 348.591 c 128.301 385.638 l 128.301 398.81 117.586 409.529 104.414 409.529
 c 32.637 409.529 l 19.465 409.529 8.746 398.81 8.746 385.638 c 8.746 348.591
 l 8.746 335.42 19.465 324.701 32.637 324.701 c 84.105 324.701 l h
21.375 348.591 m 21.375 385.638 l 21.375 391.849 26.43 396.9 32.637 396.9
 c 104.414 396.9 l 110.621 396.9 115.672 391.849 115.672 385.638 c 115.672
 348.591 l 115.672 342.38 110.621 337.33 104.414 337.33 c 100.832 337.33
 l 97.625 337.33 94.98 334.943 94.57 331.849 c 92.02 334.994 l 90.82 336.474
 89.02 337.33 87.117 337.33 c 32.637 337.33 l 26.43 337.33 21.375 342.38
 21.375 348.591 c h
21.375 348.591 m f
Q Q
showpage
%%Trailer
end restore
%%EOF
