%!PS-Adobe-3.0 EPSF-3.0
%%Creator: cairo 1.14.2 (http://cairographics.org)
%%CreationDate: Mon Feb 19 09:15:05 2018
%%Pages: 1
%%DocumentData: Clean7Bit
%%LanguageLevel: 2
%%BoundingBox: 0 32 410 378
%%EndComments
%%BeginProlog
save
50 dict begin
/q { gsave } bind def
/Q { grestore } bind def
/cm { 6 array astore concat } bind def
/w { setlinewidth } bind def
/J { setlinecap } bind def
/j { setlinejoin } bind def
/M { setmiterlimit } bind def
/d { setdash } bind def
/m { moveto } bind def
/l { lineto } bind def
/c { curveto } bind def
/h { closepath } bind def
/re { exch dup neg 3 1 roll 5 3 roll moveto 0 rlineto
      0 exch rlineto 0 rlineto closepath } bind def
/S { stroke } bind def
/f { fill } bind def
/f* { eofill } bind def
/n { newpath } bind def
/W { clip } bind def
/W* { eoclip } bind def
/BT { } bind def
/ET { } bind def
/pdfmark where { pop globaldict /?pdfmark /exec load put }
    { globaldict begin /?pdfmark /pop load def /pdfmark
    /cleartomark load def end } ifelse
/BDC { mark 3 1 roll /BDC pdfmark } bind def
/EMC { mark /EMC pdfmark } bind def
/cairo_store_point { /cairo_point_y exch def /cairo_point_x exch def } def
/Tj { show currentpoint cairo_store_point } bind def
/TJ {
  {
    dup
    type /stringtype eq
    { show } { -0.001 mul 0 cairo_font_matrix dtransform rmoveto } ifelse
  } forall
  currentpoint cairo_store_point
} bind def
/cairo_selectfont { cairo_font_matrix aload pop pop pop 0 0 6 array astore
    cairo_font exch selectfont cairo_point_x cairo_point_y moveto } bind def
/Tf { pop /cairo_font exch def /cairo_font_matrix where
      { pop cairo_selectfont } if } bind def
/Td { matrix translate cairo_font_matrix matrix concatmatrix dup
      /cairo_font_matrix exch def dup 4 get exch 5 get cairo_store_point
      /cairo_font where { pop cairo_selectfont } if } bind def
/Tm { 2 copy 8 2 roll 6 array astore /cairo_font_matrix exch def
      cairo_store_point /cairo_font where { pop cairo_selectfont } if } bind def
/g { setgray } bind def
/rg { setrgbcolor } bind def
/d1 { setcachedevice } bind def
%%EndProlog
%%BeginSetup
%%EndSetup
%%Page: 1 1
%%BeginPageSetup
%%PageBoundingBox: 0 32 410 378
%%EndPageSetup
q 0 32 410 346 rectclip q
1 0.811765 0.34902 rg
378.969 276.178 m 362.859 292.694 341.336 302.123 318.359 302.729 c 309.02
 302.979 l 261.359 141.78 l 264.184 137.924 l 277.82 119.307 292.449 102.381
 302.32 91.459 c 305.859 87.545 310.719 85.385 316 85.385 c 321.281 85.385
 326.141 87.541 329.68 91.459 c 357.438 122.166 404 179.018 404 214.764 
c 404 237.823 395.109 259.635 378.969 276.178 c h
378.969 276.178 m f
0.968627 0.639216 0.282353 rg
340.254 299.37 m 333.199 301.389 325.855 302.534 318.355 302.729 c 309.02
 302.979 l 261.359 141.78 l 264.184 137.924 l 267.809 132.979 271.5 128.159
 275.152 123.534 c 278.688 128.104 282.223 132.776 285.73 137.526 c 325.148
 190.94 345.133 233.006 345.133 262.561 c 345.133 275.291 343.43 287.631
 340.254 299.37 c h
340.254 299.37 m f
329.992 123.256 m 323.727 123.256 317.688 126.221 313.844 131.186 c 310.207
 135.885 308.832 141.819 310.004 147.623 c 299.949 148.975 290.332 152.541
 281.781 158.139 c 262.012 171.08 l 274.645 191.053 l 296.602 225.752 301.207
 245.354 301.207 255.686 c 301.207 256.584 301.191 257.565 301.152 258.776
 c 300.27 287.026 l 328.289 283.315 l 362.137 278.834 387.656 249.666 387.656
 215.463 c 387.656 198.635 381.379 182.35 370.25 169.87 c 369.906 168.1 
369.508 166.362 369.051 164.666 c 365.98 153.241 360.477 143.858 352.703
 136.784 c 343.672 128.569 l 339.906 125.143 335.047 123.256 329.992 123.256
 c h
329.992 123.256 m f
0.909804 0.882353 0.839216 rg
330.359 156.139 m 331.199 159.385 331.652 162.756 331.711 166.166 c 327.629
 165.131 323.422 164.608 319.199 164.608 c 309.281 164.608 299.676 167.463
 291.422 172.862 c 286.148 176.315 l 289.52 181.639 l 308.953 212.358 318.809
 237.268 318.809 255.686 c 318.809 256.768 318.789 257.924 318.742 259.323
 c 318.508 266.858 l 325.98 265.87 l 351.109 262.541 370.059 240.873 370.059
 215.463 c 370.059 201.33 364.102 187.725 353.715 178.12 c 353.371 175.041
 352.812 172.053 352.059 169.237 c 349.871 161.112 346.105 154.573 340.859
 149.803 c 331.828 141.588 l 329.801 139.741 326.609 141.663 327.297 144.323
 c h
330.359 156.139 m f
0.886275 0.8 0.686275 rg
325.98 265.87 m 318.508 266.858 l 318.742 259.323 l 318.785 258.053 318.805
 256.987 318.805 255.987 c 343.273 252.088 361.562 230.748 361.562 205.791
 c 361.562 191.655 355.605 178.053 345.219 168.448 c 344.875 165.366 344.32
 162.377 343.562 159.561 c 342.367 155.123 340.684 151.174 338.562 147.713
 c 340.859 149.803 l 346.105 154.573 349.871 161.112 352.059 169.237 c 352.812
 172.053 353.371 175.041 353.715 178.12 c 364.102 187.725 370.059 201.33
 370.059 215.463 c 370.059 240.873 351.109 262.541 325.98 265.87 c h
325.98 265.87 m f
1 0.384314 0.654902 rg
99.02 303.104 m 89.496 302.666 l 66.891 301.62 45.781 292.006 30.062 275.588
 c 14.289 259.12 5.602 237.518 5.602 214.764 c 5.602 179.014 52.164 122.166
 79.922 91.459 c 83.461 87.545 88.32 85.385 93.602 85.385 c 98.883 85.385
 103.738 87.541 107.281 91.459 c 116.906 102.112 131.199 118.627 144.621
 136.842 c 147.473 140.709 l 157.828 155.76 l h
99.02 303.104 m f
0.956863 0.270588 0.45098 rg
89.496 302.666 m 81.984 302.319 74.641 301.022 67.605 298.846 c 64.52 287.264
 62.867 275.1 62.867 262.561 c 62.867 233.006 82.852 190.94 122.27 137.526
 c 126.039 132.42 129.84 127.405 133.637 122.506 c 137.289 127.108 140.984
 131.909 144.621 136.842 c 147.473 140.709 l 157.824 155.76 l 99.02 303.108
 l h
89.496 302.666 m f
105.297 124.248 m 98.875 124.248 92.688 127.288 88.746 132.377 c 85.355
 136.756 83.887 142.182 84.555 147.6 c 51.07 152.041 25.141 180.784 25.141
 215.463 c 25.141 246.998 46.488 274.315 77.051 281.897 c 107.57 289.463
 l 106.82 258.03 l 106.805 257.252 106.793 256.467 106.793 255.686 c 106.793
 244.12 112.457 221.901 139.438 181.741 c 146 171.971 l 142.293 160.799 
l 139.078 151.108 133.969 143.026 127.102 136.78 c 119.305 129.69 l 115.445
 126.182 110.473 124.248 105.297 124.248 c h
105.297 124.248 m f
0.909804 0.882353 0.839216 rg
104.758 156.139 m 105.598 159.385 106.055 162.756 106.109 166.166 c 102.027
 165.131 97.824 164.608 93.602 164.608 c 65.559 164.608 42.742 187.42 42.742
 215.463 c 42.742 238.893 58.594 259.186 81.289 264.815 c 89.426 266.83 
l 89.227 258.448 l 89.203 257.53 89.191 256.608 89.191 255.686 c 89.191 
235.303 101.18 207.123 124.828 171.924 c 126.578 169.319 l 125.59 166.342
 l 123.336 159.553 119.863 153.987 115.258 149.803 c 107.461 142.709 l 105.066
 140.53 101.305 142.799 102.113 145.936 c h
104.758 156.139 m f
0.886275 0.8 0.686275 rg
55.578 206.334 m 55.578 228.03 69.18 247.03 89.219 254.19 c 89.203 254.694
 89.191 255.194 89.191 255.686 c 89.191 256.608 89.203 257.53 89.227 258.448
 c 89.426 266.83 l 81.289 264.815 l 58.594 259.186 42.742 238.893 42.742
 215.463 c 42.742 195.553 54.25 178.291 70.957 169.944 c 61.48 179.186 55.578
 192.08 55.578 206.334 c h
55.578 206.334 m f
0.917647 0.231373 0.219608 rg
204 77.795 m 201.918 77.795 199.977 78.627 198.543 80.143 c 188.277 90.987
 161.742 119.811 137.055 153.264 c 104.766 197.018 88.391 231.475 88.391
 255.686 c 88.391 319.432 140.254 371.291 204 371.291 c 267.746 371.291 
319.609 319.432 319.609 255.686 c 319.609 231.475 303.234 197.018 270.945
 153.264 c 246.258 119.811 219.723 90.987 209.457 80.147 c 208.023 78.627
 206.082 77.795 204 77.795 c h
204 77.795 m f
0.894118 0.00392157 0.211765 rg
209.523 340.78 m 220.027 350.44 232.324 358.186 245.844 363.452 c 232.863
 368.51 218.75 371.291 204 371.291 c 140.254 371.291 88.391 319.432 88.391
 255.686 c 88.391 231.475 104.766 197.018 137.055 153.264 c 161.742 119.811
 188.277 90.987 198.543 80.143 c 199.977 78.627 201.918 77.795 204 77.795
 c 206.082 77.795 208.023 78.627 209.457 80.143 c 216.234 87.299 230.102
 102.295 245.844 121.28 c 239.691 128.702 233.254 136.729 226.84 145.135
 c 236.215 151.143 l 251.961 161.237 262.137 177.795 265.867 199.272 c 280.234
 214.795 288.359 235.342 288.359 256.604 c 288.359 301.268 253.473 337.928
 209.523 340.78 c h
209.523 340.78 m f
0.909804 0.882353 0.839216 rg
217.25 173.534 m 219.371 179.381 220.492 185.569 220.582 191.932 c 215.172
 190.545 209.598 189.846 204 189.846 c 165.984 189.846 135.289 221.788 137.336
 260.241 c 139.141 294.084 166.523 321.467 200.371 323.268 c 238.82 325.315
 270.758 294.62 270.758 256.608 c 270.758 238.034 262.93 220.166 249.273
 207.557 c 247.156 188.444 239.359 174.065 226.719 165.963 c 220.059 161.694
 l 217.062 159.772 213.336 162.752 214.551 166.1 c h
217.25 173.534 m f
0.886275 0.8 0.686275 rg
200.371 323.268 m 178.25 322.092 158.895 309.987 147.633 292.291 c 158.777
 302.791 173.496 309.534 189.707 310.397 c 228.16 312.444 260.098 281.748
 260.098 243.733 c 260.098 230.967 256.398 218.534 249.648 207.909 c 263.07
 220.502 270.758 238.209 270.758 256.608 c 270.762 294.62 238.82 325.315
 200.371 323.268 c h
200.371 323.268 m f
0 g
204 328.967 m 164.102 328.967 131.641 296.506 131.641 256.608 c 131.641
 216.705 164.102 184.248 204 184.248 c 207.484 184.248 210.961 184.498 214.402
 184.998 c 212.375 171.705 205.77 163.881 205.711 163.811 c 204.008 161.877
 203.73 159.073 205.023 156.842 c 206.109 154.963 208.105 153.846 210.215
 153.846 c 210.613 153.846 211.012 153.889 211.414 153.967 c 243.492 160.502
 252.281 187.733 254.59 204.881 c 268.453 218.452 276.359 237.174 276.359
 256.608 c 276.359 296.506 243.898 328.967 204 328.967 c h
244.832 212.163 m 243.762 211.182 243.086 209.842 242.93 208.397 c 241.52
 195.487 236.793 180.022 223.266 171.35 c 225.32 177.01 226.945 184.1 226.988
 192.416 c 226.996 194.284 226.137 196.049 224.66 197.194 c 223.598 198.018
 222.305 198.448 220.988 198.448 c 220.477 198.448 219.961 198.385 219.457
 198.252 c 214.418 196.92 209.219 196.245 204 196.245 c 170.719 196.245 
143.641 223.323 143.641 256.604 c 143.641 289.889 170.719 316.967 204 316.967
 c 237.281 316.967 264.359 289.889 264.359 256.604 c 264.359 239.772 257.242
 223.573 244.832 212.163 c h
244.832 212.163 m f
168.977 270.881 m 201.234 270.881 l 204.547 270.881 207.234 273.569 207.234
 276.881 c 207.234 280.198 204.547 282.881 201.234 282.881 c 168.977 282.881
 l 165.664 282.881 162.977 280.198 162.977 276.881 c 162.977 273.569 165.664
 270.881 168.977 270.881 c h
168.977 270.881 m f
236.258 282.881 m 222.895 282.881 l 219.582 282.881 216.895 280.198 216.895
 276.881 c 216.895 273.569 219.582 270.881 222.895 270.881 c 236.258 270.881
 l 239.57 270.881 242.258 273.569 242.258 276.881 c 242.258 280.198 239.57
 282.881 236.258 282.881 c h
236.258 282.881 m f
236.258 254.311 m 166.211 254.311 l 162.898 254.311 160.211 251.627 160.211
 248.311 c 160.211 244.998 162.898 242.311 166.211 242.311 c 236.258 242.311
 l 239.57 242.311 242.258 244.998 242.258 248.311 c 242.258 251.627 239.57
 254.311 236.258 254.311 c h
236.258 254.311 m f
79.199 215.159 m 64.867 215.159 l 61.555 215.159 58.867 212.471 58.867 
209.159 c 58.867 205.842 61.555 203.159 64.867 203.159 c 79.199 203.159 
l 82.512 203.159 85.199 205.842 85.199 209.159 c 85.199 212.471 82.512 215.159
 79.199 215.159 c h
79.199 215.159 m f
316 308.366 m 315.059 308.366 314.113 308.346 313.172 308.323 c 293.543
 348.866 251.984 376.893 204 376.893 c 156.027 376.893 114.473 348.877 94.84
 308.346 c 94.426 308.354 94.012 308.366 93.602 308.366 c 41.988 308.366
 0 266.373 0 214.764 c 0 177.143 47.469 119.01 75.766 87.705 c 80.316 82.674
 86.816 79.788 93.602 79.788 c 100.383 79.788 106.883 82.674 111.434 87.705
 c 120.82 98.092 134.246 113.608 147.125 130.819 c 166.168 106.83 184.562
 86.764 194.477 76.295 c 196.941 73.69 200.414 72.194 204 72.194 c 207.586
 72.194 211.059 73.69 213.527 76.295 c 223.578 86.913 242.367 107.413 261.703
 131.862 c 274.805 114.248 288.566 98.327 298.168 87.705 c 302.715 82.67
 309.215 79.788 316 79.788 c 322.785 79.788 329.285 82.67 333.836 87.705
 c 362.129 119.006 409.602 177.139 409.602 214.764 c 409.602 266.373 367.609
 308.366 316 308.366 c h
325.207 255.686 m 325.207 256.971 325.18 258.248 325.141 259.522 c 347.035
 256.623 363.656 237.995 363.656 215.463 c 363.656 203.065 358.414 191.135
 349.273 182.729 c 348.203 181.748 347.527 180.409 347.371 178.963 c 347.062
 176.159 346.562 173.448 345.875 170.901 c 344.004 163.944 340.887 158.479
 336.555 154.538 c 337.473 158.08 338.094 162.139 338.117 166.651 c 338.125
 168.518 337.266 170.284 335.789 171.428 c 334.312 172.573 332.391 172.963
 330.582 172.483 c 326.875 171.502 323.047 171.006 319.199 171.006 c 310.469
 171.006 302.141 173.495 294.926 178.217 c 300.195 186.545 305.055 194.916
 309.27 203.159 c 344.73 203.159 l 348.047 203.159 350.73 205.842 350.73
 209.159 c 350.73 212.471 348.047 215.159 344.73 215.159 c 314.973 215.159
 l 321.324 229.702 325.207 243.549 325.207 255.686 c h
102.531 95.752 m 100.223 93.194 97.047 91.788 93.602 91.788 c 90.152 91.788
 86.98 93.194 84.668 95.752 c 62.82 119.924 12 179.905 12 214.764 c 12 258.479
 46.559 294.276 89.789 296.272 c 86.922 288.221 84.871 279.784 83.762 271.057
 c 56.973 266.358 37.141 242.998 37.141 215.463 c 37.141 184.334 62.469 
159.006 93.602 159.006 c 95.664 159.006 97.723 159.12 99.766 159.346 c 98.059
 150.913 94.016 146.084 93.824 145.858 c 92.121 143.924 91.84 141.116 93.133
 138.885 c 94.223 137.01 96.215 135.893 98.324 135.893 c 98.723 135.893 
99.125 135.932 99.523 136.014 c 112.18 138.592 121.699 145.69 127.562 156.737
 c 131.465 151.268 135.457 145.881 139.469 140.639 c 126.289 122.752 112.223
 106.471 102.531 95.752 c h
204.809 84.545 m 204.535 84.256 204.219 84.194 204 84.194 c 203.781 84.194
 203.465 84.256 203.191 84.545 c 191.508 96.885 149.754 142.123 121.609 
187.151 c 120.066 189.623 116.961 190.573 114.273 189.44 c 114.227 189.42
 114.176 189.401 114.129 189.377 c 110.777 187.991 109.539 183.889 111.453
 180.811 c 114.039 176.643 116.734 172.483 119.512 168.35 c 117.602 162.596
 114.742 157.983 110.953 154.538 c 111.863 158.049 112.48 162.065 112.516
 166.53 c 112.527 167.799 112.18 169.069 111.449 170.108 c 109.953 172.233
 107.367 173.116 104.984 172.483 c 101.277 171.502 97.445 171.006 93.602
 171.006 c 69.086 171.006 49.145 190.948 49.145 215.463 c 49.145 236.1 63.285
 253.756 82.828 258.6 c 82.805 257.631 82.793 256.659 82.793 255.686 c 82.793
 249.784 83.723 243.475 85.391 236.881 c 67.223 236.881 l 63.934 236.881
 61.07 234.35 60.973 231.065 c 60.871 227.666 63.594 224.881 66.969 224.881
 c 89.125 224.881 l 90.32 221.596 91.668 218.264 93.145 214.893 c 94.551
 211.686 98.457 210.584 101.461 212.385 c 101.496 212.405 101.531 212.428
 101.566 212.448 c 104.109 213.94 105.195 217.053 104.008 219.752 c 98.277
 232.811 94.793 245.1 94.793 255.686 c 94.793 315.901 143.781 364.893 204
 364.893 c 264.219 364.893 313.207 315.901 313.207 255.686 c 313.207 201.764
 222.91 103.663 204.809 84.545 c h
324.934 95.752 m 322.621 93.194 319.449 91.788 316 91.788 c 312.551 91.788
 309.379 93.194 307.066 95.752 c 297.16 106.713 282.742 123.416 269.348 
141.705 c 275.852 150.245 282.297 159.139 288.367 168.17 c 297.535 162.17
 308.113 159.006 319.199 159.006 c 321.262 159.006 323.32 159.12 325.367
 159.346 c 323.66 150.913 319.613 146.084 319.422 145.858 c 317.719 143.924
 317.441 141.116 318.734 138.885 c 319.82 137.01 321.812 135.893 323.926
 135.893 c 324.324 135.893 324.723 135.932 325.125 136.014 c 341.594 139.37
 352.777 150.358 357.465 167.784 c 358.129 170.241 358.648 172.815 359.023
 175.455 c 369.621 186.014 375.66 200.471 375.66 215.467 c 375.66 244.959
 353.23 269.194 324.148 271.702 c 323.02 280.225 321 288.463 318.191 296.334
 c 362.176 295.17 397.602 259.026 397.602 214.764 c 397.602 179.905 346.781
 119.924 324.934 95.752 c h
324.934 95.752 m f
342.629 236.881 m 333.602 236.881 l 330.285 236.881 327.602 234.198 327.602
 230.881 c 327.602 227.569 330.285 224.881 333.602 224.881 c 342.629 224.881
 l 345.945 224.881 348.629 227.569 348.629 230.881 c 348.629 234.198 345.945
 236.881 342.629 236.881 c h
342.629 236.881 m f
105.406 69.284 m 102.141 70.85 98.836 72.506 95.582 74.209 c 92.645 75.748
 89.02 74.608 87.484 71.674 c 85.949 68.737 87.082 65.112 90.02 63.577 c
 93.395 61.811 96.828 60.088 100.219 58.463 c 101.055 58.061 101.938 57.87
 102.809 57.87 c 105.043 57.87 107.191 59.127 108.223 61.276 c 109.656 64.264
 108.395 67.85 105.406 69.284 c h
105.406 69.284 m f
192.891 44.963 m 185.441 45.471 177.848 46.413 170.324 47.764 c 167.059
 48.346 163.941 46.178 163.359 42.913 c 162.773 39.651 164.945 36.534 168.207
 35.948 c 176.16 34.526 184.191 33.53 192.07 32.991 c 192.207 32.979 192.348
 32.975 192.484 32.975 c 195.613 32.975 198.25 35.397 198.465 38.565 c 198.691
 41.87 196.195 44.737 192.891 44.963 c h
192.891 44.963 m f
148.117 52.92 m 140.961 54.959 133.668 57.401 126.445 60.182 c 123.352 
61.377 119.879 59.834 118.691 56.741 c 117.5 53.647 119.039 50.174 122.133
 48.987 c 129.691 46.073 137.328 43.514 144.832 41.377 c 145.379 41.221 
145.934 41.147 146.477 41.147 c 149.09 41.147 151.496 42.866 152.246 45.502
 c 153.152 48.69 151.305 52.01 148.117 52.92 c h
148.117 52.92 m f
238.16 47.061 m 230.707 45.842 223.113 45.049 215.59 44.702 c 212.281 44.549
 209.723 41.741 209.875 38.432 c 210.023 35.213 212.676 32.709 215.863 32.709
 c 215.957 32.709 216.051 32.709 216.145 32.713 c 224.129 33.084 232.191
 33.924 240.098 35.221 c 243.367 35.752 245.586 38.838 245.051 42.108 c 
244.516 45.377 241.43 47.6 238.16 47.061 c h
238.16 47.061 m f
281.863 59.342 m 274.75 56.495 267.504 54.022 260.328 51.995 c 257.141 
51.096 255.281 47.78 256.184 44.592 c 256.93 41.948 259.336 40.221 261.953
 40.221 c 262.492 40.221 263.043 40.291 263.586 40.448 c 271.172 42.588 
278.82 45.198 286.324 48.202 c 289.402 49.432 290.898 52.924 289.664 56.002
 c 288.434 59.08 284.938 60.573 281.863 59.342 c h
281.863 59.342 m f
312.219 74.1 m 309.039 72.28 305.805 70.514 302.609 68.862 c 299.664 67.338
 298.516 63.717 300.039 60.776 c 301.105 58.713 303.199 57.53 305.371 57.53
 c 306.301 57.53 307.242 57.748 308.125 58.202 c 311.473 59.936 314.855 
61.78 318.18 63.686 c 321.059 65.334 322.055 68.998 320.406 71.873 c 318.758
 74.748 315.094 75.745 312.219 74.1 c h
312.219 74.1 m f
Q Q
showpage
%%Trailer
end restore
%%EOF
