%!PS-Adobe-3.0 EPSF-3.0
%%Creator: cairo 1.14.2 (http://cairographics.org)
%%CreationDate: Mon Feb 19 09:15:05 2018
%%Pages: 1
%%DocumentData: Clean7Bit
%%LanguageLevel: 2
%%BoundingBox: 0 -1 410 410
%%EndComments
%%BeginProlog
save
50 dict begin
/q { gsave } bind def
/Q { grestore } bind def
/cm { 6 array astore concat } bind def
/w { setlinewidth } bind def
/J { setlinecap } bind def
/j { setlinejoin } bind def
/M { setmiterlimit } bind def
/d { setdash } bind def
/m { moveto } bind def
/l { lineto } bind def
/c { curveto } bind def
/h { closepath } bind def
/re { exch dup neg 3 1 roll 5 3 roll moveto 0 rlineto
      0 exch rlineto 0 rlineto closepath } bind def
/S { stroke } bind def
/f { fill } bind def
/f* { eofill } bind def
/n { newpath } bind def
/W { clip } bind def
/W* { eoclip } bind def
/BT { } bind def
/ET { } bind def
/pdfmark where { pop globaldict /?pdfmark /exec load put }
    { globaldict begin /?pdfmark /pop load def /pdfmark
    /cleartomark load def end } ifelse
/BDC { mark 3 1 roll /BDC pdfmark } bind def
/EMC { mark /EMC pdfmark } bind def
/cairo_store_point { /cairo_point_y exch def /cairo_point_x exch def } def
/Tj { show currentpoint cairo_store_point } bind def
/TJ {
  {
    dup
    type /stringtype eq
    { show } { -0.001 mul 0 cairo_font_matrix dtransform rmoveto } ifelse
  } forall
  currentpoint cairo_store_point
} bind def
/cairo_selectfont { cairo_font_matrix aload pop pop pop 0 0 6 array astore
    cairo_font exch selectfont cairo_point_x cairo_point_y moveto } bind def
/Tf { pop /cairo_font exch def /cairo_font_matrix where
      { pop cairo_selectfont } if } bind def
/Td { matrix translate cairo_font_matrix matrix concatmatrix dup
      /cairo_font_matrix exch def dup 4 get exch 5 get cairo_store_point
      /cairo_font where { pop cairo_selectfont } if } bind def
/Tm { 2 copy 8 2 roll 6 array astore /cairo_font_matrix exch def
      cairo_store_point /cairo_font where { pop cairo_selectfont } if } bind def
/g { setgray } bind def
/rg { setrgbcolor } bind def
/d1 { setcachedevice } bind def
%%EndProlog
%%BeginSetup
%%EndSetup
%%Page: 1 1
%%BeginPageSetup
%%PageBoundingBox: 0 -1 410 410
%%EndPageSetup
q 0 -1 410 411 rectclip q
1 0.313726 0.490196 rg
56.234 34.334 m 26.172 34.334 l 15.023 34.334 5.988 43.37 5.988 54.518 
c 5.988 95.588 l 5.988 106.737 15.023 115.776 26.172 115.776 c 313.965 115.776
 l 325.109 115.776 334.148 106.737 334.148 95.592 c 334.148 54.518 l 334.148
 43.37 325.109 34.334 313.961 34.334 c 95.469 34.334 l 81.082 13.022 l 78.578
 9.319 73.121 9.319 70.621 13.022 c h
56.234 34.334 m f
0.956863 0.239216 0.447059 rg
49.105 70.174 m 49.105 81.323 58.141 90.362 69.289 90.362 c 334.148 90.362
 l 334.148 95.592 l 334.148 106.737 325.109 115.776 313.965 115.776 c 26.172
 115.776 l 15.023 115.776 5.988 106.737 5.988 95.588 c 5.988 54.518 l 5.988
 43.37 15.023 34.334 26.172 34.334 c 49.105 34.334 l h
49.105 70.174 m f
0.968627 0.698039 0.698039 rg
50.301 57.487 m 40.395 57.487 32.336 65.545 32.336 75.452 c 32.336 85.358
 40.395 93.416 50.301 93.416 c 60.207 93.416 68.266 85.358 68.266 75.452
 c 68.266 65.545 60.207 57.487 50.301 57.487 c h
50.301 57.487 m f
1 0.811765 0.34902 rg
314.133 174.061 m 95.637 174.061 l 84.488 174.061 75.453 183.096 75.453
 194.245 c 75.453 235.319 l 75.453 246.463 84.488 255.502 95.637 255.502
 c 383.43 255.502 l 394.574 255.502 403.613 246.463 403.613 235.319 c 403.613
 194.245 l 403.613 183.096 394.574 174.061 383.426 174.061 c 353.363 174.061
 l 338.977 152.752 l 336.477 149.045 331.02 149.045 328.516 152.752 c h
314.133 174.061 m f
0.937255 0.72549 0.247059 rg
111.781 210.569 m 111.781 221.717 120.82 230.752 131.965 230.752 c 403.613
 230.752 l 403.613 235.319 l 403.613 246.463 394.574 255.502 383.43 255.502
 c 95.637 255.502 l 84.488 255.502 75.453 246.463 75.453 235.319 c 75.453
 194.245 l 75.453 183.096 84.488 174.061 95.637 174.061 c 111.781 174.061
 l h
111.781 210.569 m f
0.937255 0.827451 0.584314 rg
359.297 197.213 m 349.395 197.213 341.332 205.272 341.332 215.178 c 341.332
 225.088 349.395 233.143 359.297 233.143 c 369.203 233.143 377.262 225.088
 377.262 215.178 c 377.262 205.272 369.203 197.213 359.297 197.213 c h
359.297 197.213 m f
1 0.313726 0.490196 rg
56.234 322.569 m 26.172 322.569 l 15.023 322.569 5.988 331.608 5.988 342.752
 c 5.988 383.827 l 5.988 394.975 15.023 404.01 26.172 404.01 c 313.961 404.01
 l 325.109 404.01 334.148 394.975 334.148 383.827 c 334.148 342.756 l 334.148
 331.608 325.109 322.569 313.961 322.569 c 95.469 322.569 l 81.082 301.26
 l 78.578 297.553 73.121 297.553 70.621 301.26 c h
56.234 322.569 m f
0.956863 0.239216 0.447059 rg
31.34 358.475 m 31.34 369.623 40.375 378.663 51.523 378.663 c 334.148 378.663
 l 334.148 383.827 l 334.148 394.975 325.109 404.01 313.961 404.01 c 26.172
 404.01 l 15.023 404.01 5.988 394.975 5.988 383.827 c 5.988 342.752 l 5.988
 331.608 15.023 322.569 26.172 322.569 c 31.34 322.569 l h
31.34 358.475 m f
0.968627 0.698039 0.698039 rg
50.301 345.725 m 40.395 345.725 32.336 353.784 32.336 363.69 c 32.336 373.596
 40.395 381.655 50.301 381.655 c 60.207 381.655 68.266 373.596 68.266 363.69
 c 68.266 353.784 60.207 345.725 50.301 345.725 c h
50.301 345.725 m f
0.937255 0.160784 0.380392 rg
294.625 83.038 m 259.492 83.038 l 256.188 83.038 253.504 85.717 253.504
 89.026 c 253.504 92.334 256.188 95.014 259.492 95.014 c 294.625 95.014 
l 297.934 95.014 300.613 92.334 300.613 89.026 c 300.613 85.721 297.934 
83.038 294.625 83.038 c h
294.625 83.038 m f
294.625 54.295 m 223.562 54.295 l 220.254 54.295 217.574 56.975 217.574
 60.28 c 217.574 63.588 220.254 66.268 223.562 66.268 c 294.625 66.268 l
 297.934 66.268 300.613 63.588 300.613 60.28 c 300.613 56.975 297.934 54.295
 294.625 54.295 c h
294.625 54.295 m f
237.137 83.038 m 101.004 83.038 l 97.695 83.038 95.016 85.717 95.016 89.026
 c 95.016 92.334 97.695 95.014 101.004 95.014 c 237.137 95.014 l 240.445
 95.014 243.125 92.334 243.125 89.026 c 243.125 85.721 240.445 83.038 237.137
 83.038 c h
237.137 83.038 m f
199.609 54.295 m 101.004 54.295 l 97.695 54.295 95.016 56.975 95.016 60.28
 c 95.016 63.588 97.695 66.268 101.004 66.268 c 199.609 66.268 l 202.918
 66.268 205.598 63.588 205.598 60.28 c 205.598 56.975 202.918 54.295 199.609
 54.295 c h
199.609 54.295 m f
0 g
26.172 316.979 m 53.266 316.979 l 70.891 290.873 l 72.004 289.225 73.863
 288.237 75.852 288.237 c 77.84 288.237 79.703 289.225 80.816 290.873 c 
98.441 316.979 l 313.965 316.979 l 328.176 316.979 339.738 328.541 339.738
 342.756 c 339.738 383.827 l 339.738 398.038 328.176 409.6 313.965 409.6
 c 26.172 409.6 l 11.961 409.6 0.398 398.038 0.398 383.827 c 0.398 342.756
 l 0.398 328.541 11.961 316.979 26.172 316.979 c h
12.375 383.827 m 12.375 391.432 18.566 397.623 26.172 397.623 c 313.961
 397.623 l 321.57 397.623 327.758 391.432 327.758 383.827 c 327.758 342.756
 l 327.758 335.147 321.57 328.959 313.961 328.959 c 95.258 328.959 l 93.266
 328.959 91.406 327.967 90.293 326.319 c 75.852 304.928 l 61.41 326.319 
l 60.297 327.967 58.434 328.959 56.445 328.959 c 26.172 328.959 l 18.566
 328.959 12.375 335.147 12.375 342.756 c h
12.375 383.827 m f
313.965 121.362 m 26.172 121.362 l 11.961 121.362 0.398 109.803 0.398 95.588
 c 0.398 54.518 l 0.398 40.307 11.961 28.745 26.172 28.745 c 53.266 28.745
 l 70.891 2.639 l 72.004 0.991 73.863 -0.002 75.852 -0.002 c 77.84 -0.002
 79.703 0.991 80.816 2.639 c 98.441 28.745 l 313.965 28.745 l 328.176 28.745
 339.738 40.307 339.738 54.518 c 339.738 95.588 l 339.738 109.803 328.176
 121.362 313.965 121.362 c h
327.762 54.518 m 327.762 46.909 321.57 40.721 313.965 40.721 c 95.258 40.721
 l 93.266 40.721 91.406 39.733 90.293 38.08 c 75.852 16.69 l 61.41 38.08
 l 60.297 39.733 58.434 40.721 56.445 40.721 c 26.172 40.721 l 18.566 40.721
 12.375 46.909 12.375 54.518 c 12.375 95.588 l 12.375 103.198 18.566 109.385
 26.172 109.385 c 313.961 109.385 l 321.57 109.385 327.758 103.198 327.758
 95.588 c 327.758 54.518 l h
327.762 54.518 m f
383.426 261.092 m 95.637 261.092 l 81.402 261.092 69.863 249.553 69.863
 235.319 c 69.863 194.245 l 69.863 180.01 81.402 168.471 95.637 168.471 
c 228.266 168.471 l 231.57 168.471 234.254 171.151 234.254 174.459 c 234.254
 177.768 231.57 180.448 228.266 180.448 c 95.637 180.448 l 88.02 180.448
 81.84 186.623 81.84 194.245 c 81.84 235.315 l 81.84 242.936 88.02 249.112
 95.637 249.112 c 383.43 249.112 l 391.047 249.112 397.223 242.936 397.223
 235.319 c 397.223 194.245 l 397.223 186.623 391.047 180.448 383.426 180.448
 c 353.152 180.448 l 351.164 180.448 349.305 179.459 348.191 177.807 c 333.746
 156.416 l 319.305 177.811 l 318.191 179.459 316.332 180.448 314.344 180.448
 c 267.23 180.448 l 263.922 180.448 261.242 177.768 261.242 174.459 c 261.242
 171.151 263.922 168.471 267.23 168.471 c 311.16 168.471 l 328.695 142.495
 l 329.469 141.354 330.566 140.44 331.879 140.022 c 334.516 139.178 337.254
 140.205 338.711 142.366 c 356.336 168.471 l 383.426 168.471 l 397.66 168.471
 409.199 180.01 409.199 194.245 c 409.199 235.315 l 409.199 249.553 397.66
 261.092 383.426 261.092 c h
383.426 261.092 m f
50.301 340.135 m 63.289 340.135 73.855 350.702 73.855 363.69 c 73.855 376.678
 63.289 387.245 50.301 387.245 c 37.312 387.245 26.746 376.678 26.746 363.69
 c 26.746 350.702 37.312 340.135 50.301 340.135 c h
50.301 375.268 m 56.684 375.268 61.879 370.073 61.879 363.69 c 61.879 357.307
 56.688 352.112 50.301 352.112 c 43.918 352.112 38.723 357.307 38.723 363.69
 c 38.723 370.073 43.918 375.268 50.301 375.268 c h
50.301 375.268 m f
359.297 238.733 m 346.309 238.733 335.746 228.166 335.746 215.178 c 335.746
 202.194 346.309 191.627 359.297 191.627 c 372.285 191.627 382.852 202.194
 382.852 215.178 c 382.852 228.166 372.285 238.733 359.297 238.733 c h
359.297 203.604 m 352.914 203.604 347.723 208.795 347.723 215.178 c 347.723
 221.565 352.914 226.756 359.297 226.756 c 365.68 226.756 370.875 221.565
 370.875 215.178 c 370.875 208.795 365.68 203.604 359.297 203.604 c h
359.297 203.604 m f
50.301 99.006 m 37.312 99.006 26.746 88.44 26.746 75.452 c 26.746 62.467
 37.312 51.897 50.301 51.897 c 63.289 51.897 73.855 62.463 73.855 75.452
 c 73.855 88.44 63.289 99.006 50.301 99.006 c h
50.301 63.873 m 43.918 63.873 38.723 69.069 38.723 75.452 c 38.723 81.834
 43.918 87.03 50.301 87.03 c 56.688 87.03 61.879 81.838 61.879 75.452 c 
61.879 69.069 56.688 63.873 50.301 63.873 c h
50.301 63.873 m f
90.223 373.67 m 234.742 373.67 l 238.051 373.67 240.73 376.35 240.73 379.659
 c 240.73 382.967 238.051 385.647 234.742 385.647 c 90.223 385.647 l 86.914
 385.647 84.234 382.967 84.234 379.659 c 84.234 376.35 86.914 373.67 90.223
 373.67 c h
90.223 373.67 m f
259.492 373.67 m 294.625 373.67 l 297.934 373.67 300.613 376.35 300.613
 379.659 c 300.613 382.967 297.934 385.647 294.625 385.647 c 259.492 385.647
 l 256.184 385.647 253.504 382.967 253.504 379.659 c 253.504 376.35 256.188
 373.67 259.492 373.67 c h
259.492 373.67 m f
90.223 344.928 m 234.742 344.928 l 238.051 344.928 240.73 347.608 240.73
 350.913 c 240.73 354.221 238.051 356.901 234.742 356.901 c 90.223 356.901
 l 86.914 356.901 84.234 354.221 84.234 350.913 c 84.234 347.608 86.914 
344.928 90.223 344.928 c h
90.223 344.928 m f
259.492 344.928 m 294.625 344.928 l 297.934 344.928 300.613 347.608 300.613
 350.913 c 300.613 354.221 297.934 356.901 294.625 356.901 c 259.492 356.901
 l 256.184 356.901 253.504 354.221 253.504 350.913 c 253.504 347.608 256.188
 344.928 259.492 344.928 c h
259.492 344.928 m f
106.191 223.565 m 250.711 223.565 l 254.02 223.565 256.699 226.245 256.699
 229.553 c 256.699 232.858 254.02 235.538 250.711 235.538 c 106.191 235.538
 l 102.887 235.538 100.203 232.858 100.203 229.553 c 100.203 226.245 102.887
 223.565 106.191 223.565 c h
106.191 223.565 m f
294.625 95.014 m 259.492 95.014 l 256.188 95.014 253.504 92.334 253.504
 89.026 c 253.504 85.721 256.188 83.038 259.492 83.038 c 294.625 83.038 
l 297.934 83.038 300.613 85.721 300.613 89.026 c 300.613 92.334 297.934 
95.014 294.625 95.014 c h
294.625 95.014 m f
154.898 206.795 m 106.191 206.795 l 102.887 206.795 100.203 204.116 100.203
 200.807 c 100.203 197.502 102.887 194.819 106.191 194.819 c 154.898 194.819
 l 158.207 194.819 160.887 197.502 160.887 200.807 c 160.887 204.116 158.207
 206.795 154.898 206.795 c h
154.898 206.795 m f
294.625 66.272 m 223.562 66.272 l 220.254 66.272 217.574 63.588 217.574
 60.284 c 217.574 56.975 220.254 54.295 223.562 54.295 c 294.625 54.295 
l 297.934 54.295 300.613 56.975 300.613 60.284 c 300.613 63.588 297.934 
66.272 294.625 66.272 c h
294.625 66.272 m f
101.004 83.038 m 237.137 83.038 l 240.445 83.038 243.125 85.717 243.125
 89.026 c 243.125 92.334 240.445 95.014 237.137 95.014 c 101.004 95.014 
l 97.695 95.014 95.016 92.334 95.016 89.026 c 95.016 85.721 97.695 83.038
 101.004 83.038 c h
101.004 83.038 m f
199.609 66.272 m 101.004 66.272 l 97.695 66.272 95.016 63.588 95.016 60.284
 c 95.016 56.975 97.695 54.295 101.004 54.295 c 199.609 54.295 l 202.918
 54.295 205.598 56.975 205.598 60.284 c 205.598 63.588 202.918 66.272 199.609
 66.272 c h
199.609 66.272 m f
308.199 235.541 m 281.848 235.541 l 278.543 235.541 275.863 232.858 275.863
 229.553 c 275.863 226.245 278.543 223.565 281.848 223.565 c 308.199 223.565
 l 311.508 223.565 314.188 226.245 314.188 229.553 c 314.188 232.858 311.508
 235.541 308.199 235.541 c h
308.199 235.541 m f
308.199 206.795 m 189.23 206.795 l 185.922 206.795 183.242 204.116 183.242
 200.807 c 183.242 197.502 185.922 194.819 189.23 194.819 c 308.199 194.819
 l 311.508 194.819 314.188 197.502 314.188 200.807 c 314.188 204.116 311.508
 206.795 308.199 206.795 c h
308.199 206.795 m f
Q Q
showpage
%%Trailer
end restore
%%EOF
