%!PS-Adobe-3.0 EPSF-3.0
%%Creator: cairo 1.14.2 (http://cairographics.org)
%%CreationDate: Mon Feb 19 09:15:05 2018
%%Pages: 1
%%DocumentData: Clean7Bit
%%LanguageLevel: 2
%%BoundingBox: 27 -1 383 410
%%EndComments
%%BeginProlog
save
50 dict begin
/q { gsave } bind def
/Q { grestore } bind def
/cm { 6 array astore concat } bind def
/w { setlinewidth } bind def
/J { setlinecap } bind def
/j { setlinejoin } bind def
/M { setmiterlimit } bind def
/d { setdash } bind def
/m { moveto } bind def
/l { lineto } bind def
/c { curveto } bind def
/h { closepath } bind def
/re { exch dup neg 3 1 roll 5 3 roll moveto 0 rlineto
      0 exch rlineto 0 rlineto closepath } bind def
/S { stroke } bind def
/f { fill } bind def
/f* { eofill } bind def
/n { newpath } bind def
/W { clip } bind def
/W* { eoclip } bind def
/BT { } bind def
/ET { } bind def
/pdfmark where { pop globaldict /?pdfmark /exec load put }
    { globaldict begin /?pdfmark /pop load def /pdfmark
    /cleartomark load def end } ifelse
/BDC { mark 3 1 roll /BDC pdfmark } bind def
/EMC { mark /EMC pdfmark } bind def
/cairo_store_point { /cairo_point_y exch def /cairo_point_x exch def } def
/Tj { show currentpoint cairo_store_point } bind def
/TJ {
  {
    dup
    type /stringtype eq
    { show } { -0.001 mul 0 cairo_font_matrix dtransform rmoveto } ifelse
  } forall
  currentpoint cairo_store_point
} bind def
/cairo_selectfont { cairo_font_matrix aload pop pop pop 0 0 6 array astore
    cairo_font exch selectfont cairo_point_x cairo_point_y moveto } bind def
/Tf { pop /cairo_font exch def /cairo_font_matrix where
      { pop cairo_selectfont } if } bind def
/Td { matrix translate cairo_font_matrix matrix concatmatrix dup
      /cairo_font_matrix exch def dup 4 get exch 5 get cairo_store_point
      /cairo_font where { pop cairo_selectfont } if } bind def
/Tm { 2 copy 8 2 roll 6 array astore /cairo_font_matrix exch def
      cairo_store_point /cairo_font where { pop cairo_selectfont } if } bind def
/g { setgray } bind def
/rg { setrgbcolor } bind def
/d1 { setcachedevice } bind def
%%EndProlog
%%BeginSetup
%%EndSetup
%%Page: 1 1
%%BeginPageSetup
%%PageBoundingBox: 27 -1 383 410
%%EndPageSetup
q 27 -1 356 411 rectclip q
0.909804 0.882353 0.839216 rg
54.348 66.604 m 42.633 66.604 33.102 76.135 33.102 87.85 c 33.102 281.342
 l 376.496 281.342 l 376.496 87.85 l 376.496 76.135 366.965 66.604 355.254
 66.604 c h
54.348 66.604 m f
0.886275 0.8 0.686275 rg
283.953 145.565 m 278.766 145.077 274.91 140.518 274.91 135.311 c 274.91
 112.905 l 274.91 111.733 273.898 110.791 272.699 110.916 c 271.66 111.022
 270.91 111.975 270.91 113.022 c 270.91 135.604 l 270.91 141.44 265.887 
146.127 259.938 145.565 c 254.754 145.077 250.898 140.518 250.898 135.311
 c 250.898 112.905 l 250.898 111.733 249.887 110.791 248.688 110.916 c 247.645
 111.022 246.895 111.975 246.895 113.022 c 246.895 135.604 l 246.895 141.44
 241.875 146.127 235.926 145.565 c 230.738 145.077 226.883 140.518 226.883
 135.311 c 226.883 112.905 l 226.883 111.733 225.871 110.791 224.672 110.916
 c 223.633 111.022 222.883 111.975 222.883 113.022 c 222.883 170.463 l 222.883
 176.299 217.859 180.987 211.91 180.424 c 206.727 179.936 202.871 175.377
 202.871 170.17 c 202.871 102.686 l 202.871 101.51 201.859 100.573 200.66
 100.694 c 199.617 100.799 198.867 101.756 198.867 102.799 c 198.867 111.663
 l 198.867 115.44 195.809 118.498 192.031 118.498 c 184.758 118.498 178.855
 112.6 178.855 105.323 c 178.855 82.088 l 178.855 80.702 179.215 79.33 179.895
 78.116 c 186.34 66.604 l 293.488 66.604 l 294.426 70.358 294.922 74.241
 294.922 78.174 c 294.922 135.604 l 294.922 141.44 289.902 146.127 283.953
 145.565 c h
283.953 145.565 m f
0.917647 0.231373 0.219608 rg
355.254 341.163 m 54.348 341.163 l 42.633 341.163 33.102 331.631 33.102
 319.916 c 33.102 280.541 l 376.496 280.541 l 376.496 319.916 l 376.496 
331.631 366.969 341.163 355.254 341.163 c h
355.254 341.163 m f
0.886275 0.8 0.686275 rg
101.613 87.85 m 101.613 281.342 l 33.102 281.342 l 33.102 87.85 l 33.102
 76.135 42.633 66.604 54.348 66.604 c 122.859 66.604 l 111.145 66.604 101.613
 76.135 101.613 87.85 c h
101.613 87.85 m f
0.894118 0.00392157 0.211765 rg
122.859 341.163 m 54.348 341.163 l 42.633 341.163 33.102 331.631 33.102
 319.916 c 33.102 280.541 l 101.613 280.541 l 101.613 319.916 l 101.613 
331.631 111.145 341.163 122.859 341.163 c h
122.859 341.163 m f
1 g
74.328 301.94 m 68.809 301.94 64.32 306.428 64.32 311.944 c 64.32 317.463
 68.809 321.952 74.328 321.952 c 79.844 321.952 84.332 317.463 84.332 311.944
 c 84.332 306.428 79.844 301.94 74.328 301.94 c h
74.328 301.94 m f
334.934 301.94 m 329.418 301.94 324.93 306.428 324.93 311.944 c 324.93 
317.463 329.418 321.952 334.934 321.952 c 340.453 321.952 344.941 317.463
 344.941 311.944 c 344.941 306.428 340.453 301.94 334.934 301.94 c h
334.934 301.94 m f
0.909804 0.882353 0.839216 rg
204.801 298.338 m 175.668 298.338 151.969 322.038 151.969 351.166 c 151.969
 380.295 175.668 403.998 204.801 403.998 c 233.93 403.998 257.629 380.299
 257.629 351.166 c 257.629 322.038 233.93 298.338 204.801 298.338 c h
204.801 298.338 m f
0.886275 0.8 0.686275 rg
197 369.979 m 197 382.83 201.621 394.623 209.277 403.795 c 207.801 403.92
 206.309 403.998 204.801 403.998 c 175.668 403.998 151.969 380.299 151.969
 351.166 c 151.969 322.038 175.668 298.338 204.801 298.338 c 221.078 298.338
 235.652 305.741 245.352 317.35 c 218.312 319.635 197 342.358 197 369.979
 c h
197 369.979 m f
0.972549 0.807843 0.160784 rg
204.629 316.893 m 203.391 316.893 202.172 317.041 200.996 317.323 c 194.777
 318.811 190.426 324.432 190.168 330.819 c 189.996 335.077 l 218.793 335.077
 l 218.832 331.596 l 218.918 323.979 213.141 317.362 205.535 316.92 c 205.234
 316.901 204.934 316.893 204.629 316.893 c h
204.629 316.893 m f
1 0.811765 0.34902 rg
178.27 338.553 m 178.27 356.666 l 178.27 370.237 189.27 381.237 202.84 
381.237 c 205.359 381.237 l 218.93 381.237 229.93 370.233 229.93 356.666
 c 229.93 338.553 l 229.93 336.522 228.281 334.873 226.25 334.873 c 181.949
 334.873 l 179.918 334.873 178.27 336.522 178.27 338.553 c h
178.27 338.553 m f
0.968627 0.639216 0.282353 rg
204.102 338.553 m 204.102 356.666 l 204.102 366.018 209.328 374.147 217.016
 378.299 c 213.547 380.17 209.578 381.237 205.359 381.237 c 202.84 381.237
 l 189.27 381.237 178.273 370.237 178.273 356.666 c 178.273 338.553 l 178.273
 336.522 179.918 334.873 181.953 334.873 c 207.781 334.873 l 205.746 334.873
 204.102 336.522 204.102 338.553 c h
204.102 338.553 m f
0.980392 0.827451 0.576471 rg
223.891 8.006 m 219.578 8.006 216.082 11.498 216.082 15.811 c 216.082 46.288
 l 216.082 46.627 215.996 46.963 215.828 47.264 c 195.43 83.69 l 194.754
 84.905 194.395 86.276 194.395 87.663 c 194.395 110.897 l 194.395 118.17
 200.293 124.073 207.57 124.073 c 211.344 124.073 214.406 121.01 214.406
 117.237 c 214.406 108.373 l 214.406 107.327 215.156 106.373 216.195 106.268
 c 217.395 106.143 218.406 107.084 218.406 108.256 c 218.406 175.745 l 218.406
 180.952 222.266 185.51 227.449 185.998 c 233.398 186.557 238.418 181.873
 238.418 176.038 c 238.418 118.596 l 238.418 117.549 239.172 116.596 240.211
 116.491 c 241.406 116.366 242.422 117.307 242.422 118.479 c 242.422 140.885
 l 242.422 146.092 246.277 150.651 251.461 151.139 c 257.41 151.698 262.434
 147.014 262.434 141.178 c 262.434 118.596 l 262.434 117.549 263.184 116.596
 264.223 116.491 c 265.422 116.366 266.434 117.307 266.434 118.479 c 266.434
 140.885 l 266.434 146.092 270.293 150.651 275.477 151.139 c 281.426 151.698
 286.445 147.014 286.445 141.178 c 286.445 118.596 l 286.445 117.549 287.199
 116.596 288.238 116.491 c 289.434 116.366 290.449 117.307 290.449 118.479
 c 290.449 140.885 l 290.449 146.092 294.305 150.651 299.488 151.139 c 305.438
 151.698 310.461 147.014 310.461 141.178 c 310.461 83.748 l 310.461 67.065
 301.625 51.288 287.402 42.573 c 286.812 42.209 286.445 41.557 286.445 40.866
 c 286.445 15.815 l 286.445 11.502 282.949 8.006 278.637 8.006 c h
223.891 8.006 m f
0.929412 0.717647 0.411765 rg
226.09 15.811 m 226.09 46.284 l 226.09 46.627 226 46.963 225.836 47.264
 c 205.438 83.69 l 204.758 84.901 204.398 86.276 204.398 87.659 c 204.398
 110.893 l 204.398 116.057 207.375 120.514 211.699 122.674 c 210.551 123.545
 209.125 124.069 207.57 124.069 c 200.293 124.069 194.395 118.17 194.395
 110.893 c 194.395 87.659 l 194.395 86.276 194.754 84.901 195.43 83.69 c
 215.828 47.264 l 215.996 46.963 216.082 46.627 216.082 46.284 c 216.082
 15.811 l 216.082 11.498 219.578 8.002 223.891 8.002 c 233.895 8.002 l 229.586
 8.006 226.09 11.498 226.09 15.811 c h
226.09 15.811 m f
222.125 108.19 m 225.598 108.19 228.414 111.006 228.414 114.479 c 228.414
 175.741 l 228.414 179.479 230.406 182.873 233.441 184.678 c 231.75 185.666
 229.742 186.178 227.605 186.01 c 222.355 185.596 218.406 181.01 218.406
 175.741 c 218.406 108.19 l h
222.125 108.19 m f
245.492 117.147 m 248.965 117.147 251.777 119.959 251.777 123.432 c 251.777
 141.596 l 251.777 145.194 253.629 148.467 256.477 150.319 c 254.875 151.03
 253.059 151.342 251.152 151.104 c 246.102 150.471 242.422 145.975 242.422
 140.885 c 242.422 118.475 l 242.422 117.963 242.219 117.498 241.898 117.147
 c h
245.492 117.147 m f
280.645 150.256 m 279.031 151.006 277.188 151.338 275.25 151.112 c 270.16
 150.522 266.434 146.006 266.434 140.885 c 266.434 118.475 l 266.434 118.03
 266.285 117.616 266.035 117.28 c 266.035 117.147 l 269.754 117.147 l 273.227
 117.147 276.043 119.959 276.043 123.432 c 276.043 141.596 l 276.039 145.151
 277.848 148.397 280.645 150.256 c h
280.645 150.256 m f
299.945 141.596 m 299.945 145.17 301.77 148.428 304.59 150.284 c 302.984
 151.014 301.152 151.338 299.227 151.108 c 294.156 150.502 290.449 145.991
 290.449 140.885 c 290.449 118.475 l 290.449 117.971 290.254 117.514 289.941
 117.159 c 289.941 117.143 l 293.656 117.143 l 297.129 117.143 299.945 119.959
 299.945 123.432 c h
299.945 141.596 m f
0 g
355.254 346.764 m 263.051 346.764 l 263.16 348.221 263.234 349.686 263.234
 351.166 c 263.234 383.385 237.02 409.6 204.801 409.6 c 172.578 409.6 146.367
 383.385 146.367 351.166 c 146.367 349.686 146.441 348.221 146.551 346.764
 c 54.348 346.764 l 39.543 346.764 27.5 334.721 27.5 319.916 c 27.5 87.85
 l 27.5 73.045 39.543 61.002 54.348 61.002 c 198.961 61.002 l 208.078 44.717
 l 208.078 6.002 l 208.078 2.69 210.766 0.002 214.082 0.002 c 288.445 0.002
 l 291.762 0.002 294.449 2.69 294.449 6.002 c 294.449 37.627 l 302.898 43.557
 309.488 51.713 313.609 61.002 c 355.254 61.002 l 370.055 61.002 382.102
 73.045 382.102 87.85 c 382.102 319.916 l 382.102 334.721 370.059 346.764
 355.254 346.764 c h
204.801 397.592 m 230.398 397.592 251.227 376.764 251.227 351.166 c 251.227
 325.569 230.398 304.741 204.801 304.741 c 179.199 304.741 158.375 325.569
 158.375 351.166 c 158.375 376.768 179.199 397.592 204.801 397.592 c h
306.457 83.745 m 306.457 68.444 298.355 53.975 285.309 45.979 c 283.531
 44.889 282.445 42.952 282.445 40.862 c 282.445 12.006 l 220.086 12.006 
l 220.086 46.284 l 220.086 47.311 219.824 48.319 219.32 49.217 c 198.922
 85.643 l 198.578 86.256 198.398 86.955 198.398 87.659 c 198.398 110.893
 l 198.398 115.952 202.512 120.065 207.57 120.065 c 210.402 120.065 l 210.402
 108.252 l 210.402 104.936 213.09 102.248 216.406 102.248 c 219.723 102.248
 222.41 104.936 222.41 108.252 c 222.41 176.034 l 222.41 179.346 225.102
 182.038 228.414 182.038 c 231.723 182.038 234.418 179.346 234.418 176.034
 c 234.418 118.475 l 234.418 115.159 237.105 112.471 240.422 112.471 c 243.734
 112.471 246.422 115.159 246.422 118.475 c 246.422 141.174 l 246.422 144.487
 249.117 147.178 252.426 147.178 c 255.738 147.178 258.43 144.487 258.43
 141.174 c 258.43 118.475 l 258.43 115.159 261.117 112.471 264.434 112.471
 c 267.75 112.471 270.438 115.159 270.438 118.475 c 270.438 141.174 l 270.438
 144.487 273.129 147.178 276.438 147.178 c 279.75 147.178 282.441 144.487
 282.441 141.174 c 282.441 118.475 l 282.441 115.159 285.129 112.471 288.445
 112.471 c 291.762 112.471 294.449 115.159 294.449 118.475 c 294.449 141.174
 l 294.449 144.487 297.141 147.178 300.453 147.178 c 303.762 147.178 306.457
 144.487 306.457 141.174 c h
210.402 171.44 m 208.723 170.42 206.785 169.866 204.801 169.866 c 198.84
 169.866 193.992 174.709 193.992 180.67 c 193.992 186.631 198.84 191.475
 204.801 191.475 c 208.5 191.475 211.852 189.635 213.836 186.596 c 211.68
 183.627 210.402 179.979 210.402 176.038 c h
370.094 286.948 m 302.215 286.948 l 298.898 286.948 296.211 284.26 296.211
 280.944 c 296.211 277.627 298.898 274.94 302.215 274.94 c 370.094 274.94
 l 370.094 87.85 l 370.094 79.655 363.449 73.01 355.254 73.01 c 317.406 
73.01 l 318.102 76.522 318.465 80.112 318.465 83.745 c 318.465 106.967 l
 319.602 105.944 321.035 105.428 322.469 105.428 c 324.004 105.428 325.539
 106.014 326.711 107.186 c 333.074 113.545 l 339.434 107.186 l 340.605 106.014
 342.145 105.428 343.68 105.428 c 345.172 105.428 346.66 105.979 347.82 
107.08 c 350.27 109.416 350.137 113.463 347.746 115.858 c 341.566 122.038
 l 347.75 128.221 l 350.074 130.545 350.309 134.362 348.055 136.752 c 345.723
 139.229 341.824 139.272 339.434 136.885 c 333.074 130.526 l 326.711 136.885
 l 324.445 139.151 320.824 139.221 318.465 137.104 c 318.465 140.795 l 318.465
 150.463 311 158.698 301.344 159.163 c 296.391 159.401 291.84 157.627 288.445
 154.588 c 285.258 157.444 281.047 159.186 276.441 159.186 c 271.832 159.186
 267.621 157.444 264.434 154.588 c 261.246 157.444 257.035 159.186 252.426
 159.186 c 250.324 159.186 248.301 158.823 246.422 158.155 c 246.422 175.635
 l 246.422 184.67 239.918 192.592 230.973 193.862 c 228.438 194.221 225.992
 194.034 223.723 193.42 c 219.539 199.659 212.594 203.44 204.922 203.479
 c 192.965 203.541 182.805 194.104 182.035 182.174 c 181.18 168.916 191.723
 157.858 204.801 157.858 c 206.703 157.858 208.582 158.108 210.402 158.569
 c 210.402 132.073 l 207.57 132.073 l 195.871 132.073 186.391 122.592 186.391
 110.893 c 186.391 87.659 l 186.391 84.897 187.098 82.186 188.445 79.776
 c 192.234 73.006 l 54.348 73.006 l 46.152 73.006 39.504 79.655 39.504 87.85
 c 39.504 274.94 l 263.152 274.94 l 266.465 274.94 269.152 277.627 269.152
 280.944 c 269.152 284.26 266.465 286.948 263.152 286.948 c 39.508 286.948
 l 39.508 319.916 l 39.508 328.112 46.152 334.756 54.348 334.756 c 148.727
 334.756 l 155.84 310.502 178.277 292.733 204.801 292.733 c 231.324 292.733
 253.762 310.502 260.871 334.756 c 355.254 334.756 l 363.449 334.756 370.094
 328.112 370.094 319.916 c h
318.465 115.92 m 318.465 128.155 l 324.582 122.038 l h
318.465 115.92 m f
183.523 329.272 m 185.156 319.092 194 311.291 204.629 311.291 c 215.262
 311.291 224.105 319.092 225.738 329.272 c 236.418 329.272 l 239.734 329.272
 242.422 331.959 242.422 335.272 c 242.422 338.588 239.734 341.276 236.418
 341.276 c 235.535 341.276 l 235.535 356.666 l 235.535 373.303 222 386.838
 205.363 386.838 c 202.844 386.838 l 186.203 386.838 172.668 373.303 172.668
 356.666 c 172.668 341.276 l 171.785 341.276 l 168.469 341.276 165.781 338.588
 165.781 335.272 c 165.781 331.959 168.469 329.272 171.785 329.272 c h
204.629 323.295 m 200.891 323.295 197.656 325.498 196.152 328.674 c 213.109
 328.674 l 211.605 325.498 208.371 323.295 204.629 323.295 c h
184.676 356.666 m 184.676 366.682 192.824 374.83 202.84 374.83 c 205.359
 374.83 l 215.379 374.83 223.527 366.682 223.527 356.666 c 223.527 341.276
 l 184.672 341.276 l h
184.676 356.666 m f
74.328 296.334 m 82.934 296.334 89.934 303.338 89.934 311.944 c 89.934 
320.553 82.934 327.553 74.328 327.553 c 65.719 327.553 58.719 320.553 58.719
 311.944 c 58.719 303.338 65.719 296.334 74.328 296.334 c h
74.328 315.545 m 76.312 315.545 77.93 313.932 77.93 311.944 c 77.93 309.959
 76.312 308.342 74.328 308.342 c 72.34 308.342 70.723 309.959 70.723 311.944
 c 70.723 313.932 72.34 315.545 74.328 315.545 c h
74.328 315.545 m f
334.934 296.334 m 343.543 296.334 350.543 303.338 350.543 311.944 c 350.543
 320.553 343.543 327.553 334.934 327.553 c 326.328 327.553 319.328 320.553
 319.328 311.944 c 319.328 303.338 326.328 296.334 334.934 296.334 c h
334.934 315.545 m 336.922 315.545 338.539 313.932 338.539 311.944 c 338.539
 309.959 336.922 308.342 334.934 308.342 c 332.949 308.342 331.332 309.959
 331.332 311.944 c 331.332 313.932 332.949 315.545 334.934 315.545 c h
334.934 315.545 m f
91.777 253.756 m 89.434 256.1 85.633 256.1 83.289 253.756 c 76.93 247.393
 l 70.566 253.756 l 68.223 256.1 64.422 256.1 62.078 253.756 c 59.73 251.409
 59.73 247.608 62.078 245.264 c 68.438 238.905 l 62.078 232.541 l 59.73 
230.198 59.73 226.397 62.078 224.053 c 63.25 222.881 64.785 222.295 66.324
 222.295 c 67.859 222.295 69.395 222.881 70.566 224.053 c 76.93 230.413 
l 83.289 224.053 l 84.461 222.881 86 222.295 87.535 222.295 c 89.07 222.295
 90.609 222.881 91.781 224.053 c 94.125 226.397 94.125 230.198 91.781 232.541
 c 85.422 238.905 l 91.781 245.264 l 94.125 247.608 94.125 251.409 91.777
 253.756 c h
91.777 253.756 m f
155.816 253.756 m 153.469 256.1 149.668 256.1 147.324 253.756 c 140.965
 247.393 l 134.602 253.756 l 132.258 256.1 128.457 256.1 126.113 253.756
 c 123.77 251.409 123.77 247.608 126.113 245.264 c 132.473 238.905 l 126.113
 232.541 l 123.77 230.198 123.77 226.397 126.113 224.053 c 127.285 222.881
 128.824 222.295 130.359 222.295 c 131.895 222.295 133.43 222.881 134.605
 224.053 c 140.965 230.413 l 147.324 224.053 l 148.5 222.881 150.035 222.295
 151.57 222.295 c 153.105 222.295 154.645 222.881 155.816 224.053 c 158.16
 226.397 158.16 230.198 155.816 232.541 c 149.457 238.905 l 155.816 245.264
 l 158.16 247.608 158.16 251.409 155.816 253.756 c h
155.816 253.756 m f
219.852 253.756 m 217.508 256.1 213.707 256.1 211.363 253.756 c 205 247.393
 l 198.641 253.756 l 196.293 256.1 192.496 256.1 190.148 253.756 c 187.805
 251.409 187.805 247.608 190.148 245.264 c 196.512 238.905 l 190.148 232.541
 l 187.805 230.198 187.805 226.397 190.148 224.053 c 191.324 222.881 192.859
 222.295 194.395 222.295 c 195.93 222.295 197.469 222.881 198.641 224.053
 c 205 230.413 l 211.363 224.053 l 212.535 222.881 214.07 222.295 215.609
 222.295 c 217.145 222.295 218.68 222.881 219.855 224.053 c 222.199 226.397
 222.199 230.198 219.855 232.541 c 213.492 238.905 l 219.855 245.264 l 222.195
 247.608 222.195 251.409 219.852 253.756 c h
219.852 253.756 m f
347.926 253.756 m 345.578 256.1 341.777 256.1 339.434 253.756 c 333.074
 247.393 l 326.711 253.756 l 324.367 256.1 320.566 256.1 318.223 253.756
 c 315.875 251.409 315.875 247.608 318.223 245.264 c 324.582 238.905 l 318.223
 232.541 l 315.875 230.198 315.875 226.397 318.223 224.053 c 319.395 222.881
 320.93 222.295 322.469 222.295 c 324.004 222.295 325.539 222.881 326.711
 224.053 c 333.074 230.413 l 339.434 224.053 l 340.605 222.881 342.145 222.295
 343.68 222.295 c 345.215 222.295 346.754 222.881 347.926 224.053 c 350.27
 226.397 350.27 230.198 347.926 232.541 c 341.566 238.905 l 347.926 245.264
 l 350.27 247.608 350.27 251.409 347.926 253.756 c h
347.926 253.756 m f
268.836 261.916 m 256.258 261.916 246.023 251.682 246.023 239.104 c 246.023
 226.526 256.258 216.291 268.836 216.291 c 281.414 216.291 291.648 226.526
 291.648 239.104 c 291.648 251.682 281.414 261.916 268.836 261.916 c h
268.836 228.299 m 262.879 228.299 258.031 233.143 258.031 239.104 c 258.031
 245.061 262.875 249.909 268.836 249.909 c 274.797 249.909 279.641 245.065
 279.641 239.104 c 279.641 233.143 274.797 228.299 268.836 228.299 c h
268.836 228.299 m f
91.777 195.323 m 89.434 197.666 85.633 197.666 83.289 195.323 c 76.93 188.959
 l 70.566 195.323 l 68.223 197.666 64.422 197.666 62.078 195.323 c 59.73
 192.975 59.73 189.174 62.078 186.83 c 68.438 180.471 l 62.078 174.108 l
 59.73 171.764 59.73 167.963 62.078 165.62 c 63.25 164.448 64.785 163.862
 66.324 163.862 c 67.859 163.862 69.395 164.448 70.566 165.62 c 76.93 171.979
 l 83.289 165.62 l 84.461 164.448 86 163.862 87.535 163.862 c 89.07 163.862
 90.609 164.448 91.781 165.62 c 94.125 167.963 94.125 171.764 91.781 174.108
 c 85.422 180.471 l 91.781 186.83 l 94.125 189.174 94.125 192.975 91.777
 195.323 c h
91.777 195.323 m f
155.816 195.323 m 153.469 197.666 149.668 197.666 147.324 195.323 c 140.965
 188.959 l 134.602 195.323 l 132.258 197.666 128.457 197.666 126.113 195.323
 c 123.77 192.975 123.77 189.174 126.113 186.83 c 132.473 180.471 l 126.113
 174.108 l 123.77 171.764 123.77 167.963 126.113 165.62 c 127.285 164.448
 128.824 163.862 130.359 163.862 c 131.895 163.862 133.43 164.448 134.605
 165.62 c 140.965 171.979 l 147.324 165.62 l 148.5 164.448 150.035 163.862
 151.57 163.862 c 153.105 163.862 154.645 164.448 155.816 165.62 c 158.16
 167.963 158.16 171.764 155.816 174.108 c 149.457 180.471 l 155.816 186.83
 l 158.16 189.174 158.16 192.975 155.816 195.323 c h
155.816 195.323 m f
347.926 195.323 m 345.578 197.666 341.777 197.666 339.434 195.323 c 333.074
 188.959 l 326.711 195.323 l 324.367 197.666 320.566 197.666 318.223 195.323
 c 315.875 192.975 315.875 189.174 318.223 186.83 c 324.582 180.471 l 318.223
 174.108 l 315.875 171.764 315.875 167.963 318.223 165.62 c 319.395 164.448
 320.93 163.862 322.469 163.862 c 324.004 163.862 325.539 164.448 326.711
 165.62 c 333.074 171.979 l 339.434 165.62 l 340.605 164.448 342.145 163.862
 343.68 163.862 c 345.215 163.862 346.754 164.448 347.926 165.62 c 350.27
 167.963 350.27 171.764 347.926 174.108 c 341.566 180.471 l 347.926 186.83
 l 350.27 189.174 350.27 192.975 347.926 195.323 c h
347.926 195.323 m f
283.887 195.323 m 281.543 197.666 277.742 197.666 275.398 195.323 c 269.035
 188.959 l 262.676 195.323 l 260.332 197.666 256.531 197.666 254.188 195.323
 c 251.84 192.975 251.84 189.174 254.188 186.83 c 260.547 180.471 l 254.188
 174.108 l 251.84 171.764 251.84 167.963 254.188 165.62 c 255.359 164.448
 256.895 163.862 258.43 163.862 c 259.969 163.862 261.504 164.448 262.676
 165.62 c 269.039 171.979 l 275.398 165.62 l 276.57 164.448 278.109 163.862
 279.645 163.862 c 281.18 163.862 282.719 164.448 283.891 165.62 c 286.234
 167.963 286.234 171.764 283.891 174.108 c 277.527 180.471 l 283.891 186.83
 l 286.23 189.174 286.23 192.975 283.887 195.323 c h
283.887 195.323 m f
91.777 136.889 m 89.434 139.233 85.633 139.233 83.289 136.889 c 76.93 130.53
 l 70.566 136.889 l 68.223 139.233 64.422 139.233 62.078 136.889 c 59.73
 134.541 59.73 130.745 62.078 128.397 c 68.438 122.038 l 62.078 115.678 
l 59.73 113.33 59.73 109.53 62.078 107.186 c 63.25 106.014 64.785 105.428
 66.324 105.428 c 67.859 105.428 69.395 106.014 70.566 107.186 c 76.93 113.545
 l 83.289 107.186 l 84.461 106.014 86 105.428 87.535 105.428 c 89.07 105.428
 90.609 106.014 91.781 107.186 c 94.125 109.534 94.125 113.33 91.781 115.678
 c 85.422 122.038 l 91.781 128.397 l 94.125 130.745 94.125 134.541 91.777
 136.889 c h
91.777 136.889 m f
155.816 136.889 m 153.469 139.233 149.668 139.233 147.324 136.889 c 140.965
 130.53 l 134.602 136.889 l 132.258 139.233 128.457 139.233 126.113 136.889
 c 123.77 134.541 123.77 130.745 126.113 128.397 c 132.473 122.038 l 126.113
 115.678 l 123.77 113.33 123.77 109.53 126.113 107.186 c 127.285 106.014
 128.824 105.428 130.359 105.428 c 131.895 105.428 133.43 106.014 134.605
 107.186 c 140.965 113.545 l 147.324 107.186 l 148.5 106.014 150.035 105.428
 151.57 105.428 c 153.105 105.428 154.645 106.014 155.816 107.186 c 158.16
 109.534 158.16 113.33 155.816 115.678 c 149.457 122.038 l 155.816 128.397
 l 158.16 130.745 158.16 134.541 155.816 136.889 c h
155.816 136.889 m f
Q Q
showpage
%%Trailer
end restore
%%EOF
