%!PS-Adobe-3.0 EPSF-3.0
%%Creator: cairo 1.14.2 (http://cairographics.org)
%%CreationDate: Mon Feb 19 09:15:05 2018
%%Pages: 1
%%DocumentData: Clean7Bit
%%LanguageLevel: 2
%%BoundingBox: 0 64 410 345
%%EndComments
%%BeginProlog
save
50 dict begin
/q { gsave } bind def
/Q { grestore } bind def
/cm { 6 array astore concat } bind def
/w { setlinewidth } bind def
/J { setlinecap } bind def
/j { setlinejoin } bind def
/M { setmiterlimit } bind def
/d { setdash } bind def
/m { moveto } bind def
/l { lineto } bind def
/c { curveto } bind def
/h { closepath } bind def
/re { exch dup neg 3 1 roll 5 3 roll moveto 0 rlineto
      0 exch rlineto 0 rlineto closepath } bind def
/S { stroke } bind def
/f { fill } bind def
/f* { eofill } bind def
/n { newpath } bind def
/W { clip } bind def
/W* { eoclip } bind def
/BT { } bind def
/ET { } bind def
/pdfmark where { pop globaldict /?pdfmark /exec load put }
    { globaldict begin /?pdfmark /pop load def /pdfmark
    /cleartomark load def end } ifelse
/BDC { mark 3 1 roll /BDC pdfmark } bind def
/EMC { mark /EMC pdfmark } bind def
/cairo_store_point { /cairo_point_y exch def /cairo_point_x exch def } def
/Tj { show currentpoint cairo_store_point } bind def
/TJ {
  {
    dup
    type /stringtype eq
    { show } { -0.001 mul 0 cairo_font_matrix dtransform rmoveto } ifelse
  } forall
  currentpoint cairo_store_point
} bind def
/cairo_selectfont { cairo_font_matrix aload pop pop pop 0 0 6 array astore
    cairo_font exch selectfont cairo_point_x cairo_point_y moveto } bind def
/Tf { pop /cairo_font exch def /cairo_font_matrix where
      { pop cairo_selectfont } if } bind def
/Td { matrix translate cairo_font_matrix matrix concatmatrix dup
      /cairo_font_matrix exch def dup 4 get exch 5 get cairo_store_point
      /cairo_font where { pop cairo_selectfont } if } bind def
/Tm { 2 copy 8 2 roll 6 array astore /cairo_font_matrix exch def
      cairo_store_point /cairo_font where { pop cairo_selectfont } if } bind def
/g { setgray } bind def
/rg { setrgbcolor } bind def
/d1 { setcachedevice } bind def
%%EndProlog
%%BeginSetup
%%EndSetup
%%Page: 1 1
%%BeginPageSetup
%%PageBoundingBox: 0 64 410 345
%%EndPageSetup
q 0 64 410 281 rectclip q
1 0.811765 0.34902 rg
64.391 273.442 m 27.613 273.442 l 16.344 273.442 6.82 282.665 7.012 293.934
 c 7.195 304.887 16.16 313.739 27.156 313.739 c 87.309 313.739 l 98.582 
313.739 108.105 304.516 107.914 293.243 c 107.73 282.294 98.766 273.442 
87.77 273.442 c 75.051 273.442 l 71.324 267.348 l 70.59 266.149 68.848 266.149
 68.117 267.348 c h
64.391 273.442 m f
335.969 273.442 m 323.707 273.442 l 312.438 273.442 302.914 282.665 303.105
 293.934 c 303.289 304.887 312.258 313.739 323.25 313.739 c 383.406 313.739
 l 394.676 313.739 404.199 304.516 404.008 293.243 c 403.824 282.294 394.859
 273.442 383.863 273.442 c 346.629 273.442 l 342.902 267.348 l 342.172 266.149
 340.43 266.149 339.699 267.348 c h
335.969 273.442 m f
1 0.709804 0.360784 rg
26.707 279.169 m 26.891 290.122 35.859 298.973 46.852 298.973 c 107.008
 298.973 l 107.055 298.973 107.102 298.969 107.148 298.969 c 104.688 307.477
 96.598 313.739 87.309 313.739 c 27.156 313.739 l 16.16 313.739 7.195 304.887
 7.012 293.934 c 6.82 282.712 16.262 273.52 27.473 273.446 c 26.945 275.262
 26.676 277.184 26.707 279.169 c h
26.707 279.169 m f
322.801 279.169 m 322.988 290.122 331.953 298.973 342.949 298.973 c 403.102
 298.973 l 403.148 298.973 403.195 298.969 403.242 298.969 c 400.785 307.477
 392.691 313.739 383.406 313.739 c 323.25 313.739 l 312.258 313.739 303.289
 304.887 303.105 293.934 c 302.914 282.712 312.359 273.52 323.57 273.446
 c 323.043 275.262 322.77 277.184 322.801 279.169 c h
322.801 279.169 m f
0.764706 0.854902 0.25098 rg
361.391 151.587 m 327.605 215.559 l 323.262 223.778 l 321.906 226.341 319.25
 227.942 316.355 227.942 c 93.07 227.942 l 90.172 227.942 87.512 226.341
 86.16 223.778 c 81.871 215.645 l 48.754 152.95 l 11.375 82.18 l 8.629 76.977
 12.398 70.719 18.285 70.719 c 391.141 70.719 l 397.023 70.719 400.793 76.977
 398.047 82.18 c h
361.391 151.587 m f
0.678431 0.737255 0.0823529 rg
329.957 116.137 m 314.418 116.954 276.98 120.313 264.906 133.837 c 249.762
 150.794 251.242 176.911 268.203 192.055 c 285.164 207.2 311.277 205.719
 326.422 188.759 c 338.496 175.235 337.605 137.657 336.664 122.13 c 336.453
 118.63 333.457 115.958 329.957 116.137 c h
329.957 116.137 m f
39.219 129.856 m 39.535 129.708 l 54.121 122.829 72.219 118.376 81.711 
116.333 c 85.137 115.594 88.52 117.759 89.285 121.18 c 92.684 136.36 99.535
 173.321 89.766 188.591 c 85.922 194.598 80.766 199.27 74.914 202.481 c 
48.754 152.95 l 37.105 130.899 l 37.52 130.688 37.934 130.477 38.359 130.27
 c 38.668 130.122 l 38.953 130.02 l h
39.219 129.856 m f
68.02 188.536 m 89.008 153.884 175.027 131.434 200.895 125.376 c 203.266
 124.825 205.715 125.208 207.785 126.466 c 209.855 127.719 211.332 129.708
 211.941 132.067 c 216.223 148.719 226.082 190.876 226.824 227.942 c 93.07
 227.942 l 90.172 227.942 87.512 226.341 86.16 223.778 c 81.871 215.645 
l 67.773 188.954 l 67.855 188.817 67.934 188.673 68.02 188.536 c h
68.02 188.536 m f
1 0.384314 0.654902 rg
77.309 117.817 m 70.414 124.653 57.57 138.161 48.992 151.813 c 48.805 152.11
 l 48.668 152.391 l 48.488 152.63 l 48.309 152.923 l 43.102 161.446 40.57
 168.454 40.57 174.341 c 40.57 197.075 59.07 215.575 81.805 215.575 c 104.543
 215.575 123.039 197.075 123.039 174.341 c 123.039 156.208 97.348 128.77
 86.301 117.817 c 83.812 115.344 79.797 115.344 77.309 117.817 c h
77.309 117.817 m f
0.956863 0.270588 0.45098 rg
81.805 149.555 m 67.406 149.555 55.691 161.27 55.691 175.669 c 55.691 190.067
 67.406 201.782 81.805 201.782 c 96.203 201.782 107.918 190.067 107.918 
175.669 c 107.918 161.27 96.203 149.555 81.805 149.555 c h
81.805 149.555 m f
87.367 151.813 m 87.18 152.11 l 87.043 152.391 l 86.863 152.63 l 86.68 
152.923 l 81.477 161.446 78.945 168.454 78.945 174.341 c 78.945 190.153 
87.898 203.903 100.992 210.821 c 95.258 213.848 88.73 215.575 81.805 215.575
 c 59.07 215.575 40.57 197.075 40.57 174.341 c 40.57 168.454 43.102 161.446
 48.309 152.923 c 48.488 152.63 l 48.668 152.391 l 48.805 152.11 l 48.992
 151.813 l 57.57 138.161 70.414 124.653 77.309 117.817 c 79.797 115.344 
83.812 115.344 86.301 117.817 c 90.043 121.524 95.461 127.13 100.996 133.618
 c 96.211 139.223 91.336 145.501 87.367 151.813 c h
87.367 151.813 m f
1 g
81.805 159.309 m 72.781 159.309 65.445 166.645 65.445 175.669 c 65.445 
184.692 72.781 192.028 81.805 192.028 c 90.828 192.028 98.164 184.692 98.164
 175.669 c 98.168 166.645 90.828 159.309 81.805 159.309 c h
81.805 159.309 m f
1 0.384314 0.654902 rg
324.719 117.817 m 313.672 128.77 287.98 156.212 287.98 174.341 c 287.98
 197.075 306.48 215.575 329.215 215.575 c 351.953 215.575 370.449 197.075
 370.449 174.341 c 370.449 156.208 344.758 128.77 333.711 117.817 c 331.223
 115.344 327.207 115.344 324.719 117.817 c h
324.719 117.817 m f
0.956863 0.270588 0.45098 rg
329.215 149.555 m 314.816 149.555 303.102 161.27 303.102 175.669 c 303.102
 190.067 314.816 201.782 329.215 201.782 c 343.613 201.782 355.328 190.067
 355.328 175.669 c 355.328 161.27 343.613 149.555 329.215 149.555 c h
329.215 149.555 m f
326.355 174.341 m 326.355 190.153 335.305 203.903 348.402 210.821 c 342.668
 213.848 336.141 215.575 329.215 215.575 c 306.48 215.575 287.98 197.075
 287.98 174.341 c 287.98 156.212 313.672 128.77 324.719 117.817 c 327.207
 115.344 331.223 115.344 333.711 117.817 c 337.453 121.524 342.871 127.126
 348.402 133.614 c 337.598 146.286 326.355 162.348 326.355 174.341 c h
326.355 174.341 m f
1 g
329.215 159.309 m 320.195 159.309 312.855 166.645 312.855 175.669 c 312.855
 184.692 320.195 192.028 329.215 192.028 c 338.238 192.028 345.574 184.692
 345.574 175.669 c 345.578 166.645 338.238 159.309 329.215 159.309 c h
329.215 159.309 m f
0.886275 0.8 0.686275 rg
81.805 192.028 m 75.301 192.028 69.691 188.208 67.055 182.7 c 69.191 183.723
 71.57 184.313 74.09 184.313 c 83.109 184.313 90.449 176.973 90.449 167.954
 c 90.449 165.43 89.859 163.055 88.836 160.919 c 94.344 163.555 98.164 169.169
 98.164 175.669 c 98.168 184.692 90.828 192.028 81.805 192.028 c h
81.805 192.028 m f
329.215 192.028 m 322.711 192.028 317.102 188.208 314.465 182.7 c 316.602
 183.723 318.98 184.313 321.5 184.313 c 330.52 184.313 337.859 176.973 337.859
 167.954 c 337.859 165.43 337.27 163.055 336.246 160.919 c 341.754 163.555
 345.574 169.169 345.574 175.669 c 345.578 184.692 338.238 192.028 329.215
 192.028 c h
329.215 192.028 m f
0.917647 0.231373 0.219608 rg
204.711 125.989 m 202.289 125.989 199.996 126.927 198.258 128.63 c 179.27
 147.208 117.32 210.977 117.32 251.489 c 117.32 299.677 156.523 338.88 204.711
 338.88 c 252.902 338.88 292.105 299.677 292.105 251.489 c 292.105 210.977
 230.156 147.208 211.168 128.63 c 209.426 126.927 207.133 125.989 204.711
 125.989 c h
204.711 125.989 m f
0.894118 0.00392157 0.211765 rg
205.512 182.708 m 168.465 182.708 138.324 212.844 138.324 249.891 c 138.324
 286.938 168.465 317.079 205.512 317.079 c 242.559 317.079 272.695 286.938
 272.695 249.891 c 272.695 212.844 242.559 182.708 205.512 182.708 c h
205.512 182.708 m f
195.664 251.489 m 195.664 285.598 215.312 315.204 243.883 329.594 c 232.094
 335.528 218.789 338.88 204.711 338.88 c 156.523 338.88 117.32 299.677 117.32
 251.489 c 117.32 210.977 179.266 147.208 198.258 128.626 c 199.996 126.927
 202.289 125.989 204.711 125.989 c 207.133 125.989 209.426 126.927 211.168
 128.63 c 218.074 135.387 230.664 148.122 243.887 163.54 c 220.75 190.52
 195.664 225.712 195.664 251.489 c h
195.664 251.489 m f
1 g
205.512 200.809 m 178.445 200.809 156.426 222.829 156.426 249.891 c 156.426
 276.958 178.445 298.973 205.512 298.973 c 232.574 298.973 254.594 276.958
 254.594 249.891 c 254.594 222.829 232.574 200.809 205.512 200.809 c h
205.512 200.809 m f
0.886275 0.8 0.686275 rg
205.512 298.973 m 190.469 298.973 176.996 292.169 167.984 281.481 c 175.332
 285.868 183.91 288.399 193.074 288.399 c 220.137 288.399 242.156 266.38
 242.156 239.317 c 242.156 227.294 237.805 216.27 230.602 207.727 c 244.957
 216.302 254.594 231.989 254.594 249.891 c 254.594 276.958 232.574 298.973
 205.512 298.973 c h
205.512 298.973 m f
0 g
260.18 249.891 m 260.18 280.036 235.656 304.563 205.512 304.563 c 175.367
 304.563 150.84 280.036 150.84 249.891 c 150.84 219.747 175.367 195.223 
205.512 195.223 c 235.656 195.223 260.18 219.747 260.18 249.891 c h
162.812 249.891 m 162.812 273.434 181.965 292.591 205.512 292.591 c 229.055
 292.591 248.207 273.434 248.207 249.891 c 248.207 226.348 229.055 207.192
 205.512 207.192 c 181.965 207.192 162.812 226.348 162.812 249.891 c h
162.812 249.891 m f
408.73 73.915 m 368.039 150.962 l 372.828 159.083 376.035 167.188 376.035
 174.341 c 376.035 199.563 355.984 220.18 330.988 221.118 c 326.113 230.341
 l 325.078 232.305 323.039 233.532 320.82 233.532 c 294.684 233.532 l 296.605
 239.786 297.691 245.817 297.691 251.489 c 297.691 302.759 255.98 344.466
 204.711 344.466 c 153.445 344.466 111.734 302.759 111.734 251.489 c 111.734
 245.821 112.816 239.786 114.738 233.532 c 88.602 233.532 l 86.387 233.532
 84.348 232.305 83.309 230.341 c 78.391 221.024 l 54.164 219.266 34.984 
199.009 34.984 174.341 c 34.984 167.61 37.824 160.04 42.148 152.403 c 0.691
 73.915 l -0.289 72.059 -0.223 69.825 0.859 68.028 c 1.941 66.231 3.887 
65.134 5.988 65.134 c 403.438 65.134 l 405.539 65.134 407.48 66.231 408.566
 68.028 c 409.648 69.825 409.711 72.059 408.73 73.915 c h
329.215 209.188 m 348.43 209.188 364.062 193.555 364.062 174.341 c 364.062
 161.466 346.301 139.294 329.215 122.348 c 312.129 139.294 294.367 161.466
 294.367 174.341 c 294.367 193.555 310 209.188 329.215 209.188 c h
81.805 209.188 m 101.02 209.188 116.652 193.555 116.652 174.341 c 116.652
 161.466 98.891 139.294 81.805 122.348 c 71.598 132.469 61.156 144.454 54.398
 155.212 c 54.219 155.575 54.008 155.923 53.758 156.251 c 49.574 163.098
 46.957 169.403 46.957 174.341 c 46.957 193.555 62.59 209.188 81.805 209.188
 c h
15.914 77.102 m 49.629 140.93 l 57.645 129.962 67.402 119.684 74.719 112.524
 c 76.672 110.614 79.238 109.657 81.805 109.657 c 84.371 109.657 86.938 
110.614 88.891 112.524 c 103.73 127.044 128.625 154.384 128.625 174.341 
c 128.625 196.844 112.664 215.688 91.469 220.153 c 92.211 221.559 l 119.289
 221.559 l 125.426 207.833 134.715 193.52 144.957 179.981 c 147.16 177.071
 151.422 176.762 154 179.344 c 154.047 179.391 l 156.164 181.509 156.391
 184.864 154.586 187.255 c 136.559 211.134 123.707 234.536 123.707 251.489
 c 123.707 296.157 160.047 332.497 204.715 332.497 c 249.383 332.497 285.723
 296.157 285.723 251.489 c 285.723 221.278 244.902 170.575 206.707 133.196
 c 205.59 132.102 203.84 132.102 202.723 133.196 c 194.895 140.852 186.961
 149.071 179.285 157.559 c 176.984 160.106 173.02 160.212 170.59 157.782
 c 168.324 155.516 168.242 151.868 170.398 149.497 c 179.52 139.442 188.008
 130.844 194.348 124.637 c 197.207 121.841 200.961 120.442 204.715 120.442
 c 208.469 120.442 212.223 121.841 215.078 124.637 c 234.402 143.548 273.656
 184.677 290.137 221.559 c 317.215 221.559 l 318.129 219.821 l 297.648 214.829
 282.395 196.337 282.395 174.337 c 282.395 154.384 307.289 127.044 322.129
 112.524 c 324.082 110.61 326.648 109.657 329.215 109.657 c 331.781 109.657
 334.348 110.61 336.301 112.524 c 343.336 119.407 352.629 129.177 360.461
 139.669 c 393.508 77.102 l h
15.914 77.102 m f
307.27 175.669 m 307.27 163.567 317.113 153.719 329.215 153.719 c 341.316
 153.719 351.164 163.567 351.164 175.669 c 351.164 187.77 341.316 197.618
 329.215 197.618 c 317.113 197.618 307.27 187.77 307.27 175.669 c h
339.191 175.669 m 339.191 170.169 334.715 165.692 329.215 165.692 c 323.715
 165.692 319.238 170.169 319.238 175.669 c 319.238 181.169 323.715 185.645
 329.215 185.645 c 334.715 185.645 339.191 181.169 339.191 175.669 c h
339.191 175.669 m f
81.805 153.719 m 93.906 153.719 103.754 163.567 103.754 175.669 c 103.754
 187.77 93.906 197.618 81.805 197.618 c 69.703 197.618 59.855 187.77 59.855
 175.669 c 59.855 163.567 69.703 153.719 81.805 153.719 c h
81.805 185.645 m 87.305 185.645 91.781 181.169 91.781 175.669 c 91.781 
170.169 87.305 165.692 81.805 165.692 c 76.305 165.692 71.828 170.169 71.828
 175.669 c 71.828 181.169 76.305 185.645 81.805 185.645 c h
81.805 185.645 m f
323.25 267.856 m 331.152 267.856 l 335.059 245.278 l 335.551 242.434 338
 240.348 340.887 240.317 c 340.91 240.313 340.934 240.313 340.957 240.313
 c 343.812 240.313 346.273 242.333 346.828 245.137 c 351.324 267.856 l 383.863
 267.856 l 398.055 267.856 409.598 279.399 409.598 293.591 c 409.598 307.782
 398.055 319.325 383.863 319.325 c 323.25 319.325 l 309.059 319.325 297.516
 307.778 297.516 293.591 c 297.516 279.399 309.062 267.856 323.25 267.856
 c h
323.25 307.356 m 383.863 307.356 l 391.453 307.356 397.629 301.18 397.629
 293.591 c 397.629 286.001 391.453 279.825 383.863 279.825 c 346.406 279.825
 l 344.273 279.825 342.363 278.7 341.301 276.962 c 340.238 278.7 338.328
 279.825 336.191 279.825 c 323.25 279.825 l 315.66 279.825 309.488 286.001
 309.488 293.591 c 309.488 301.18 315.66 307.356 323.25 307.356 c h
323.25 307.356 m f
27.156 267.856 m 59.695 267.856 l 64.191 245.137 l 64.746 242.333 67.207
 240.313 70.062 240.313 c 70.086 240.313 70.109 240.313 70.133 240.317 c
 73.02 240.348 75.469 242.438 75.961 245.278 c 79.867 267.856 l 87.77 267.856
 l 101.961 267.856 113.504 279.399 113.504 293.591 c 113.504 307.782 101.957
 319.325 87.77 319.325 c 27.156 319.325 l 12.965 319.325 1.422 307.778 1.422
 293.591 c 1.422 279.399 12.965 267.856 27.156 267.856 c h
27.156 307.356 m 87.77 307.356 l 95.359 307.356 101.531 301.18 101.531 
293.591 c 101.531 286.001 95.359 279.825 87.77 279.825 c 74.828 279.825 
l 72.691 279.825 70.781 278.696 69.723 276.962 c 68.66 278.7 66.746 279.825
 64.613 279.825 c 27.156 279.825 l 19.566 279.825 13.391 286.001 13.391 
293.591 c 13.391 301.18 19.566 307.356 27.156 307.356 c h
27.156 307.356 m f
Q Q
showpage
%%Trailer
end restore
%%EOF
