%!PS-Adobe-3.0 EPSF-3.0
%%Creator: cairo 1.14.2 (http://cairographics.org)
%%CreationDate: Mon Feb 19 09:15:05 2018
%%Pages: 1
%%DocumentData: Clean7Bit
%%LanguageLevel: 2
%%BoundingBox: 0 3 410 406
%%EndComments
%%BeginProlog
save
50 dict begin
/q { gsave } bind def
/Q { grestore } bind def
/cm { 6 array astore concat } bind def
/w { setlinewidth } bind def
/J { setlinecap } bind def
/j { setlinejoin } bind def
/M { setmiterlimit } bind def
/d { setdash } bind def
/m { moveto } bind def
/l { lineto } bind def
/c { curveto } bind def
/h { closepath } bind def
/re { exch dup neg 3 1 roll 5 3 roll moveto 0 rlineto
      0 exch rlineto 0 rlineto closepath } bind def
/S { stroke } bind def
/f { fill } bind def
/f* { eofill } bind def
/n { newpath } bind def
/W { clip } bind def
/W* { eoclip } bind def
/BT { } bind def
/ET { } bind def
/pdfmark where { pop globaldict /?pdfmark /exec load put }
    { globaldict begin /?pdfmark /pop load def /pdfmark
    /cleartomark load def end } ifelse
/BDC { mark 3 1 roll /BDC pdfmark } bind def
/EMC { mark /EMC pdfmark } bind def
/cairo_store_point { /cairo_point_y exch def /cairo_point_x exch def } def
/Tj { show currentpoint cairo_store_point } bind def
/TJ {
  {
    dup
    type /stringtype eq
    { show } { -0.001 mul 0 cairo_font_matrix dtransform rmoveto } ifelse
  } forall
  currentpoint cairo_store_point
} bind def
/cairo_selectfont { cairo_font_matrix aload pop pop pop 0 0 6 array astore
    cairo_font exch selectfont cairo_point_x cairo_point_y moveto } bind def
/Tf { pop /cairo_font exch def /cairo_font_matrix where
      { pop cairo_selectfont } if } bind def
/Td { matrix translate cairo_font_matrix matrix concatmatrix dup
      /cairo_font_matrix exch def dup 4 get exch 5 get cairo_store_point
      /cairo_font where { pop cairo_selectfont } if } bind def
/Tm { 2 copy 8 2 roll 6 array astore /cairo_font_matrix exch def
      cairo_store_point /cairo_font where { pop cairo_selectfont } if } bind def
/g { setgray } bind def
/rg { setrgbcolor } bind def
/d1 { setcachedevice } bind def
%%EndProlog
%%BeginSetup
%%EndSetup
%%Page: 1 1
%%BeginPageSetup
%%PageBoundingBox: 0 3 410 406
%%EndPageSetup
q 0 3 410 403 rectclip q
1 0.811765 0.34902 rg
347.602 50.46 m 302.266 50.46 l 288.645 50.46 277.602 39.417 277.602 25.796
 c 277.602 17.632 l 277.602 13.796 280.711 10.687 284.547 10.687 c 365.32
 10.687 l 369.156 10.687 372.266 13.796 372.266 17.632 c 372.266 25.796 
l 372.266 39.417 361.223 50.46 347.602 50.46 c h
347.602 50.46 m f
347.602 50.46 m 302.266 50.46 l 288.645 50.46 277.602 39.417 277.602 25.796
 c 277.602 17.632 l 277.602 13.796 280.711 10.687 284.547 10.687 c 365.32
 10.687 l 369.156 10.687 372.266 13.796 372.266 17.632 c 372.266 25.796 
l 372.266 39.417 361.223 50.46 347.602 50.46 c h
347.602 50.46 m f
1 0.709804 0.360784 rg
337.266 50.46 m 302.27 50.46 l 288.645 50.46 277.602 39.417 277.602 25.796
 c 277.602 17.632 l 277.602 13.796 280.711 10.687 284.547 10.687 c 316.098
 10.687 l 312.262 10.687 309.152 13.796 309.152 17.632 c 309.152 25.796 
l 309.152 25.909 309.152 26.027 309.152 26.14 c 309.191 28.738 312.031 30.327
 314.281 29.034 c 317.602 27.124 321.473 26.077 325.598 26.202 c 337.262
 26.558 346.395 36.421 346.395 48.089 c 346.395 50.46 l h
337.266 50.46 m f
0.764706 0.854902 0.25098 rg
107.332 50.46 m 62 50.46 l 48.379 50.46 37.336 39.417 37.336 25.796 c 37.336
 14.167 l 37.336 12.245 38.895 10.687 40.816 10.687 c 128.516 10.687 l 130.438
 10.687 131.996 12.245 131.996 14.167 c 131.996 25.796 l 132 39.417 120.957
 50.46 107.332 50.46 c h
107.332 50.46 m f
0.678431 0.737255 0.0823529 rg
96.996 50.46 m 62 50.46 l 48.379 50.46 37.336 39.417 37.336 25.796 c 37.336
 14.167 l 37.336 12.245 38.895 10.687 40.816 10.687 c 72.465 10.687 l 70.539
 10.687 68.98 12.245 68.98 14.167 c 68.98 25.882 l 68.992 29.261 72.641 
31.468 75.652 29.929 c 78.688 28.378 82.172 27.585 85.859 27.8 c 96.445 
28.421 104.57 37.495 104.57 48.101 c 104.57 50.46 l h
96.996 50.46 m f
0.247059 0.152941 0.145098 rg
337.992 229.042 m 283.922 229.042 l 283.922 146.64 l 393.016 146.64 l 393.016
 174.023 l 393.016 204.359 368.332 229.042 337.992 229.042 c h
337.992 229.042 m f
0.858824 0.682353 0.431373 rg
374.52 115.515 m 374.52 147.441 l 388.035 147.441 l 396.836 147.441 403.996
 140.28 403.996 131.48 c 403.996 122.675 396.836 115.515 388.035 115.515
 c h
374.52 115.515 m f
0.980392 0.827451 0.576471 rg
324.934 43.425 m 317.344 43.425 311.172 49.601 311.172 57.187 c 311.172
 82.136 l 318.414 81.179 l 320.645 80.886 322.84 80.738 324.934 80.738 c
 327.027 80.738 329.223 80.886 331.457 81.179 c 338.695 82.136 l 338.695
 57.187 l 338.695 49.597 332.523 43.425 324.934 43.425 c h
324.934 43.425 m f
0.929412 0.717647 0.411765 rg
324.703 57.187 m 324.703 80.741 l 322.68 80.753 320.562 80.898 318.414 
81.179 c 311.172 82.136 l 311.172 57.187 l 311.172 49.601 317.344 43.425
 324.934 43.425 c 327.395 43.425 329.699 44.081 331.699 45.218 c 327.531
 47.585 324.703 52.058 324.703 57.187 c h
324.703 57.187 m f
0.980392 0.827451 0.576471 rg
370.238 176.734 m 366.414 175.113 l 360.723 172.698 354.355 171.425 347.996
 171.425 c 334.238 171.425 321.574 177.109 314.129 186.628 c 311.566 189.902
 l 307.535 188.898 l 306.438 188.624 305.312 188.484 304.18 188.476 c 304.09
 188.476 l 294.812 188.167 l 274.461 188.167 l 274.461 120.089 l 274.469
 119.53 l 274.547 119.038 l 274.59 91.023 297.617 68.292 325.742 68.738 
c 353.379 69.175 375.316 92.241 375.316 119.878 c 375.316 173.366 l 375.316
 175.984 372.648 177.753 370.238 176.734 c h
370.238 176.734 m f
0.929412 0.717647 0.411765 rg
370.238 176.734 m 366.414 175.113 l 360.723 172.698 354.355 171.425 347.996
 171.425 c 334.238 171.425 321.574 177.109 314.129 186.628 c 311.566 189.902
 l 307.535 188.898 l 306.438 188.624 305.312 188.484 304.18 188.476 c 304.09
 188.476 l 294.812 188.167 l 274.461 188.167 l 274.461 120.089 l 274.469
 119.527 l 274.547 119.038 l 274.59 91.023 297.617 68.292 325.742 68.738
 c 331.918 68.835 337.805 70.07 343.23 72.226 c 324.551 79.585 311.289 97.784
 311.258 119.038 c 311.176 119.527 l 311.172 120.089 l 311.172 164.46 l 
311.266 165.78 l 311.371 167.245 313.223 167.808 314.129 166.652 c 321.574
 157.132 334.238 151.448 347.996 151.448 c 354.355 151.448 360.723 152.726
 366.414 155.136 c 370.238 156.757 l 372.648 157.777 375.316 156.007 375.316
 153.39 c 375.316 173.366 l 375.316 175.984 372.648 177.753 370.238 176.734
 c h
370.238 176.734 m f
1 0.811765 0.34902 rg
330.926 278.382 m 318.441 336.3 l 220.879 336.3 l 209.832 318.726 l 207.82
 315.527 203.09 315.73 201.359 319.093 c 192.512 336.3 l 103.441 336.3 l
 87.543 283.605 l 85.719 278.159 l 84.141 273.456 77.367 273.835 76.324 
278.683 c 63.906 336.3 l 45.816 336.3 l 28.551 336.3 14.023 349.894 13.617
 367.155 c 13.195 384.937 27.535 399.534 45.227 399.534 c 364.805 399.534
 l 382.07 399.534 396.602 385.941 397.008 368.679 c 397.43 350.898 383.086
 336.3 365.398 336.3 c 357.98 336.3 l 342.082 283.605 l 340.363 277.984 
l 338.891 273.175 331.984 273.468 330.926 278.382 c h
330.926 278.382 m f
1 0.709804 0.360784 rg
30.023 343.366 m 29.605 361.148 43.945 375.745 61.633 375.745 c 381.215
 375.745 l 386.824 375.745 392.137 374.304 396.777 371.777 c 394.824 387.538
 381.023 399.534 364.805 399.534 c 45.227 399.534 l 27.539 399.534 13.195
 384.933 13.617 367.155 c 13.891 355.499 20.609 345.523 30.254 340.269 c
 30.129 341.288 30.051 342.32 30.023 343.366 c h
30.023 343.366 m f
0.192157 0.823529 0.968627 rg
229.465 67.124 m 179.895 67.124 l 164.039 67.124 151.184 54.269 151.184
 38.413 c 151.184 17.027 l 151.184 13.191 154.293 10.081 158.129 10.081 
c 251.211 10.066 l 255.047 10.066 258.156 13.175 258.16 17.011 c 258.172
 38.413 l 258.176 54.245 245.297 67.124 229.465 67.124 c h
229.465 67.124 m f
0.0745098 0.67451 0.909804 rg
192.605 10.081 m 188.77 10.081 185.66 13.191 185.66 17.027 c 185.66 38.527
 l 185.68 42.87 190.449 45.64 194.23 43.499 c 197.578 41.601 201.492 40.585
 205.648 40.769 c 217.098 41.28 225.965 51.034 225.965 62.491 c 225.965 
67.12 l 179.895 67.12 l 164.039 67.12 151.188 54.269 151.188 38.413 c 151.188
 17.027 l 151.188 13.191 154.297 10.077 158.133 10.077 c 251.211 10.066 
l 251.242 10.066 251.273 10.07 251.305 10.07 c h
192.605 10.081 m f
0.956863 0.619608 0.172549 rg
120.789 231.507 m 115.371 233.577 109.828 234.628 104.316 234.628 c 94.289
 234.628 87.848 231.105 87.809 231.081 c 86.453 230.464 85.168 229.726 83.992
 228.878 c 81.938 227.398 79.457 226.613 76.824 226.613 c 74.266 226.613
 71.781 227.359 69.641 228.765 c 63.25 232.968 55.594 235.191 47.492 235.191
 c 27.512 235.191 11.258 221.374 11.258 204.386 c 11.258 203.792 11.281 
203.167 11.336 202.476 c 11.281 201.71 11.258 201.038 11.258 200.409 c 11.258
 196.363 12.102 192.402 13.77 188.628 c 13.57 187.808 13.391 186.991 13.234
 186.206 c 12.418 182.128 12.008 177.937 12.008 173.745 c 12.008 142.749
 l 126.703 142.749 l 126.703 231.113 l h
120.789 231.507 m f
120.789 231.507 m 115.371 233.577 109.828 234.628 104.316 234.628 c 94.289
 234.628 87.848 231.105 87.809 231.081 c 86.453 230.464 85.168 229.726 83.992
 228.878 c 81.938 227.398 79.457 226.613 76.824 226.613 c 74.266 226.613
 71.781 227.359 69.641 228.765 c 63.25 232.968 55.594 235.191 47.492 235.191
 c 27.512 235.191 11.258 221.374 11.258 204.386 c 11.258 203.792 11.281 
203.167 11.336 202.476 c 11.281 201.71 11.258 201.038 11.258 200.409 c 11.258
 196.363 12.102 192.402 13.77 188.628 c 13.57 187.808 13.391 186.991 13.234
 186.206 c 12.418 182.128 12.008 177.937 12.008 173.745 c 12.008 142.749
 l 126.703 142.749 l 126.703 231.113 l h
120.789 231.507 m f
0.909804 0.533333 0.0823529 rg
61.527 186.206 m 61.684 186.995 61.863 187.808 62.062 188.628 c 60.395 
192.402 59.551 196.366 59.551 200.409 c 59.551 201.038 59.574 201.714 59.633
 202.476 c 59.574 203.167 59.551 203.792 59.551 204.39 c 59.551 213.62 64.359
 221.913 71.953 227.562 c 71.148 227.886 70.375 228.284 69.641 228.769 c
 63.25 232.972 55.594 235.195 47.492 235.195 c 27.512 235.195 11.258 221.374
 11.258 204.39 c 11.258 203.792 11.281 203.167 11.336 202.476 c 11.281 201.714
 11.258 201.038 11.258 200.409 c 11.258 196.366 12.102 192.402 13.77 188.628
 c 13.57 187.808 13.391 186.995 13.234 186.206 c 12.418 182.128 12.004 177.937
 12.004 173.745 c 12.004 142.749 l 60.297 142.749 l 60.297 173.745 l 60.301
 177.937 60.711 182.128 61.527 186.206 c h
61.527 186.206 m f
0.858824 0.682353 0.431373 rg
21.566 115.515 m 12.766 115.515 5.602 122.675 5.602 131.476 c 5.602 140.28
 12.766 147.441 21.566 147.441 c 35.082 147.441 l 35.082 115.515 l h
21.566 115.515 m f
0.207843 g
272.781 258.042 m 270.812 260.288 l 270.738 269.816 263.582 279.105 251.152
 285.792 c 239.008 292.331 222.727 295.933 205.312 295.933 c 187.898 295.933
 171.617 292.331 159.469 285.792 c 147.043 279.105 139.887 269.816 139.809
 260.288 c 137.859 258.066 l 130.148 250.355 125.902 240.12 125.902 229.245
 c 125.902 194.632 l 284.723 194.632 l 284.723 229.245 l 284.723 240.12 
280.477 250.355 272.781 258.042 c h
272.781 258.042 m f
0.188235 0.164706 0.129412 rg
200.035 258.062 m 201.984 260.288 l 202.059 269.812 209.215 279.105 221.645
 285.792 c 226.062 288.171 231.031 290.155 236.398 291.722 c 227.008 294.468
 216.395 295.933 205.312 295.933 c 187.898 295.933 171.617 292.331 159.469
 285.792 c 147.043 279.101 139.887 269.816 139.809 260.288 c 137.859 258.062
 l 130.148 250.355 125.902 240.12 125.902 229.245 c 125.902 194.632 l 188.078
 194.632 l 188.078 229.245 l 188.078 240.12 192.324 250.355 200.035 258.062
 c h
200.035 258.062 m f
0.980392 0.827451 0.576471 rg
84.668 39.425 m 77.078 39.425 70.902 45.597 70.902 53.187 c 70.902 77.335
 l 78.145 76.378 l 80.379 76.081 82.57 75.933 84.668 75.933 c 86.762 75.933
 88.957 76.081 91.188 76.378 c 98.43 77.335 l 98.43 53.187 l 98.43 45.597
 92.254 39.425 84.668 39.425 c h
84.668 39.425 m f
0.929412 0.717647 0.411765 rg
83.688 53.187 m 83.688 75.952 l 81.891 75.991 80.031 76.128 78.145 76.378
 c 70.902 77.335 l 70.902 53.187 l 70.902 45.597 77.074 39.425 84.664 39.425
 c 86.973 39.425 89.145 39.999 91.055 41.007 c 86.68 43.316 83.688 47.905
 83.688 53.187 c h
83.688 53.187 m f
0.980392 0.827451 0.576471 rg
115.902 188.304 m 105.418 188.476 l 104.285 188.484 103.156 188.624 102.062
 188.898 c 98.031 189.902 l 95.473 186.628 l 88.023 177.109 75.363 171.425
 61.602 171.425 c 55.242 171.425 48.875 172.698 43.184 175.113 c 37.52 177.515
 l 35.984 178.163 34.281 177.038 34.281 175.37 c 34.281 119.878 l 34.281
 92.23 56.238 69.159 83.883 68.738 c 112.023 68.308 135.051 91.073 135.051
 119.113 c 135.051 187.843 l h
115.902 188.304 m f
0.929412 0.717647 0.411765 rg
115.902 188.304 m 105.418 188.476 l 104.285 188.484 103.156 188.624 102.062
 188.898 c 98.031 189.902 l 95.473 186.628 l 89.379 178.839 79.797 173.624
 68.98 171.984 c 68.965 171.98 l 68.316 171.882 67.664 171.8 67.008 171.726
 c 66.707 171.695 66.406 171.667 66.109 171.64 c 65.625 171.597 65.137 171.558
 64.645 171.527 c 64.387 171.511 64.125 171.495 63.863 171.484 c 63.113 
171.448 62.359 171.425 61.602 171.425 c 55.242 171.425 48.875 172.698 43.184
 175.113 c 37.52 177.515 l 35.98 178.163 34.281 177.038 34.281 175.37 c 
34.281 119.894 l 34.281 92.589 55.695 69.655 82.988 68.757 c 89.711 68.538
 96.148 69.655 102.07 71.843 c 82.688 79.062 68.98 98.038 68.98 119.878 
c 68.98 135.792 l 68.98 144.632 74.059 152.663 82.02 156.511 c 87.363 159.097
 91.988 162.706 95.469 167.159 c 97.027 169.152 99.609 170.038 102.059 169.429
 c 103.152 169.155 104.281 169.015 105.414 169.011 c 115.898 168.839 l 135.047
 168.374 l 135.047 187.843 l h
115.902 188.304 m f
0.576471 0.407843 0.164706 rg
129.148 163.659 m 120.391 163.659 113.262 170.788 113.262 179.546 c 113.262
 188.308 120.387 195.433 129.148 195.433 c 143.137 195.433 l 143.137 163.663
 l h
129.148 163.659 m f
0.627451 0.458824 0.188235 rg
204.68 59.202 m 196.793 59.202 190.371 65.62 190.371 73.507 c 190.371 105.308
 l 197.57 104.409 l 200.27 104.073 202.805 103.909 205.309 103.909 c 207.473
 103.909 209.691 104.027 211.906 104.261 c 218.984 105.011 l 218.984 73.507
 l 218.984 65.62 212.566 59.202 204.68 59.202 c h
204.68 59.202 m f
0.509804 0.321569 0.0666667 rg
204.68 73.507 m 204.68 103.917 l 202.375 103.941 200.043 104.101 197.57
 104.409 c 190.371 105.304 l 190.371 73.507 l 190.371 65.62 196.789 59.202
 204.68 59.202 c 207.285 59.202 209.727 59.913 211.832 61.136 c 207.562 
63.616 204.68 68.226 204.68 73.507 c h
204.68 73.507 m f
0.576471 0.407843 0.164706 rg
267.488 163.659 m 267.488 195.433 l 281.477 195.433 l 290.234 195.433 297.363
 188.308 297.363 179.546 c 297.363 170.788 290.238 163.659 281.477 163.659
 c h
267.488 163.659 m f
0.627451 0.458824 0.188235 rg
204.691 93.503 m 170.02 93.839 142.336 122.609 142.336 157.277 c 142.336
 229.245 l 142.336 231.534 142.656 233.808 143.289 235.999 c 144.523 240.28
 149.641 242.023 153.234 239.386 c 165.555 230.331 184.535 225.14 205.312
 225.14 c 225.746 225.14 245.215 230.468 257.395 239.39 c 260.988 242.023
 266.102 240.277 267.332 235.999 c 267.965 233.804 268.285 231.53 268.285
 229.245 c 268.285 156.476 l 268.289 121.546 239.699 93.163 204.691 93.503
 c h
204.691 93.503 m f
0.509804 0.321569 0.0666667 rg
267.332 235.999 m 266.242 240.366 262.152 242.109 258.246 239.878 c 257.395
 239.394 l 245.215 230.468 225.746 225.14 205.312 225.14 c 184.535 225.14
 165.555 230.331 153.234 239.386 c 149.645 242.027 144.523 240.28 143.289
 235.999 c 142.656 233.808 142.336 231.538 142.336 229.245 c 142.336 157.28
 l 142.336 123.613 168.465 95.292 202.09 93.585 c 210 93.183 217.602 94.273
 224.672 96.566 c 201.148 106.437 184.703 129.972 184.703 157.027 c 184.703
 181.491 l 184.703 192.726 193.863 201.714 205.098 201.695 c 205.312 201.695
 l 226.273 201.695 246.25 207.159 258.742 216.312 c 261.965 218.675 266.387
 217.597 268.285 214.351 c 268.285 229.249 l 268.285 230.866 267.965 233.472
 267.574 235.038 c h
267.332 235.999 m f
0 g
398.617 150.257 m 398.617 174.023 l 398.617 207.503 371.477 234.644 337.992
 234.644 c 290 234.644 l 288.812 244.909 284.266 254.425 276.867 261.882
 c 276.305 262.523 l 274.25 284.585 243.805 301.534 205.312 301.534 c 166.816
 301.534 136.375 284.585 134.316 262.523 c 133.754 261.882 l 127.023 255.093
 122.648 246.597 121.023 237.382 c 101.836 243.995 87.512 237.241 85.32 
236.105 c 83.691 235.351 82.145 234.452 80.723 233.429 c 78.445 231.788 
75.23 231.796 72.723 233.448 c 65.414 238.257 56.691 240.796 47.496 240.796
 c 24.422 240.796 5.656 224.464 5.656 204.39 c 5.656 203.777 5.676 203.148
 5.723 202.441 c 5.676 201.714 5.656 201.046 5.656 200.413 c 5.656 196.214
 6.414 192.101 7.914 188.148 c 7.855 187.866 7.797 187.585 7.738 187.304
 c 6.855 182.866 6.406 178.304 6.406 173.745 c 6.406 146.796 l 2.363 142.796
 -0.109 137.214 0.008 131.062 c 0.23 119.241 10.191 109.913 22.016 109.913
 c 29.453 109.913 l 32.773 89.909 46.73 73.452 65.305 66.585 c 65.305 56.066
 l 62 56.066 l 45.285 56.066 31.73 42.511 31.73 25.796 c 31.73 16.542 l 
31.73 10.214 36.863 5.081 43.195 5.081 c 126.141 5.081 l 132.469 5.081 137.602
 10.214 137.602 16.542 c 137.602 25.796 l 137.602 42.511 124.051 56.066 
107.332 56.066 c 104.031 56.066 l 104.031 66.585 l 125.297 74.448 140.523
 94.874 140.652 118.808 c 140.668 121.921 138.465 124.714 135.371 125.077
 c 131.734 125.499 128.645 122.667 128.645 119.116 c 128.645 94.636 108.543
 74.765 83.98 75.14 c 59.848 75.507 40.684 95.648 40.684 119.78 c 40.684
 169.214 l 47.129 166.484 54.285 165.023 61.602 165.023 c 77.465 165.023
 91.906 171.679 100.516 182.683 c 102.098 182.288 103.73 182.081 105.383
 182.073 c 107.801 181.995 l 107.711 181.191 107.66 180.374 107.66 179.546
 c 107.66 167.698 117.297 158.058 129.148 158.058 c 136.734 158.058 l 136.734
 156.476 l 136.734 125.816 156.961 99.792 184.773 91.042 c 184.773 74.308
 l 184.773 73.773 184.801 73.245 184.84 72.726 c 179.898 72.726 l 160.945
 72.726 145.586 57.363 145.586 38.413 c 145.586 16.484 l 145.586 9.847 150.965
 4.464 157.605 4.464 c 196.539 4.464 l 199.855 4.464 202.543 7.152 202.543
 10.468 c 202.543 10.476 l 202.543 13.788 199.855 16.48 196.543 16.48 c 
157.59 16.484 l 157.59 38.413 l 157.59 50.734 167.578 60.718 179.895 60.718
 c 190.148 60.718 l 193.785 56.831 198.953 54.398 204.68 54.398 c 210.41
 54.398 215.574 56.835 219.211 60.718 c 229.465 60.718 l 241.766 60.718 
251.77 50.714 251.77 38.413 c 251.758 16.472 l 235.605 16.472 l 232.289 
16.476 229.602 13.784 229.602 10.468 c 229.602 7.155 232.289 4.464 235.605
 4.464 c 251.758 4.464 l 258.398 4.464 263.777 9.847 263.777 16.484 c 263.777
 38.413 l 263.777 57.363 248.414 72.726 229.465 72.726 c 224.523 72.726 
l 224.562 73.249 224.59 73.773 224.59 74.308 c 224.59 90.675 l 253.047 99.027
 273.891 125.355 273.891 156.476 c 273.891 158.058 l 281.477 158.058 l 293.328
 158.058 302.969 167.698 302.969 179.55 c 302.969 180.39 302.914 181.214
 302.82 182.03 c 304.219 182.077 l 305.871 182.085 307.504 182.292 309.09
 182.687 c 317.695 171.683 332.137 165.023 348 165.023 c 355.316 165.023
 362.473 166.488 368.918 169.218 c 368.918 119.827 l 368.918 95.292 349.141
 74.956 324.609 75.136 c 300.555 75.316 281.035 94.898 280.957 118.972 c
 280.945 121.757 279.152 124.288 276.445 124.941 c 272.484 125.898 268.949
 122.921 268.949 119.116 c 268.949 95.05 284.215 74.484 305.57 66.585 c 
305.57 56.066 l 302.27 56.066 l 285.555 56.066 272 42.515 272 25.796 c 272
 16.546 l 272 10.214 277.133 5.085 283.465 5.085 c 366.41 5.085 l 372.738
 5.085 377.871 10.214 377.871 16.546 c 377.871 25.796 l 377.871 42.515 364.32
 56.066 347.602 56.066 c 344.301 56.066 l 344.301 66.585 l 362.875 73.456
 376.828 89.909 380.152 109.913 c 387.594 109.913 l 399.5 109.913 409.488
 119.37 409.602 131.273 c 409.676 139.405 405.223 146.519 398.617 150.257
 c h
77.309 63.628 m 79.719 63.308 82.172 63.128 84.668 63.128 c 87.164 63.128
 89.613 63.308 92.027 63.628 c 92.027 55.589 l 92.027 51.53 88.723 48.23
 84.668 48.23 c 80.609 48.23 77.309 51.53 77.309 55.589 c h
84.668 36.222 m 91.027 36.222 96.684 39.308 100.215 44.058 c 107.332 44.058
 l 117.402 44.058 125.594 35.866 125.594 25.796 c 125.594 17.089 l 43.738
 17.089 l 43.738 25.796 l 43.738 35.866 51.93 44.058 62 44.058 c 69.117 
44.058 l 72.648 39.304 78.305 36.222 84.668 36.222 c h
317.574 63.628 m 319.984 63.308 322.438 63.128 324.934 63.128 c 327.43 
63.128 329.883 63.308 332.293 63.628 c 332.293 55.589 l 332.293 51.53 328.992
 48.23 324.934 48.23 c 320.875 48.23 317.574 51.53 317.574 55.589 c h
347.602 44.058 m 357.672 44.058 365.863 35.866 365.863 25.796 c 365.863
 17.089 l 284.004 17.089 l 284.004 25.796 l 284.004 35.866 292.199 44.058
 302.266 44.058 c 309.387 44.058 l 312.918 39.308 318.57 36.222 324.934 
36.222 c 331.297 36.222 336.949 39.308 340.48 44.058 c h
28.68 121.921 m 21.566 121.921 l 16.293 121.921 12.004 126.206 12.004 131.48
 c 12.004 136.749 16.293 141.038 21.566 141.038 c 28.68 141.038 l h
113.109 193.831 m 105.695 194.077 l 105.629 194.077 105.559 194.081 105.492
 194.081 c 103.992 194.081 102.535 194.468 101.281 195.198 c 98.43 196.859
 94.766 195.902 93.086 193.058 c 87.348 183.32 74.992 177.03 61.602 177.03
 c 52.941 177.03 44.637 179.609 38.219 184.288 c 35.535 186.241 31.781 185.652
 29.828 182.972 c 28.879 181.671 28.535 180.12 28.734 178.64 c 28.703 178.386
 28.68 178.128 28.68 177.863 c 28.68 153.042 l 21.566 153.042 l 20.492 153.042
 19.441 152.964 18.41 152.812 c 18.41 173.745 l 18.41 177.519 18.781 181.288
 19.512 184.952 c 19.664 185.698 19.832 186.468 20.023 187.249 c 20.34 188.542
 20.215 189.905 19.672 191.12 c 18.336 194.105 17.66 197.23 17.66 200.413
 c 17.66 200.886 17.68 201.409 17.727 202.019 c 17.746 202.312 17.746 202.601
 17.727 202.894 c 17.68 203.484 17.66 203.96 17.66 204.39 c 17.66 217.847
 31.043 228.792 47.496 228.792 c 54.34 228.792 60.781 226.933 66.121 223.421
 c 72.762 219.05 81.449 219.155 87.738 223.687 c 88.57 224.28 89.484 224.812
 90.461 225.253 c 90.609 225.323 90.758 225.398 90.898 225.476 c 91.012 
225.538 102.641 231.613 118.551 225.511 c 119.125 225.288 119.715 225.163
 120.301 225.124 c 120.301 199.124 l 117.547 197.87 115.102 196.062 113.109
 193.831 c h
136.734 170.066 m 129.148 170.066 l 123.918 170.066 119.664 174.32 119.664
 179.546 c 119.664 184.777 123.918 189.03 129.148 189.03 c 136.734 189.03
 l h
212.582 74.308 m 212.582 69.948 209.039 66.405 204.68 66.405 c 200.324 
66.405 196.777 69.948 196.777 74.308 c 196.777 88.448 l 199.578 88.101 202.422
 87.898 205.312 87.898 c 207.77 87.898 210.191 88.034 212.582 88.288 c h
261.883 156.476 m 261.883 125.28 236.504 99.905 205.312 99.905 c 174.117
 99.905 148.738 125.28 148.738 156.476 c 148.738 229.245 l 148.738 230.945
 148.977 232.62 149.438 234.226 c 162.734 224.456 183.117 218.734 205.309
 218.734 c 227.34 218.734 247.875 224.476 261.18 234.226 c 261.641 232.616
 261.879 230.937 261.879 229.245 c h
270.004 244.007 m 268.949 245.866 266.98 247.027 264.84 247.046 c 260.25
 247.089 l 260.191 247.089 l 258.77 247.089 257.391 246.585 256.305 245.659
 c 245.477 236.46 225.938 230.741 205.312 230.741 c 183.836 230.741 163.906
 236.808 153.293 246.573 c 152.199 247.577 150.77 248.144 149.285 248.159
 c 146.586 248.183 l 144.535 248.214 142.598 247.163 141.48 245.429 c 138.375
 240.601 136.734 235.007 136.734 229.245 c 136.734 201.034 l 132.309 201.034
 l 132.309 229.245 l 132.309 238.409 135.887 247.034 142.391 253.534 c 142.48
 253.628 142.57 253.722 142.656 253.823 c 144.723 256.175 l 145.684 257.273
 146.211 258.679 146.211 260.136 c 146.211 274.331 169.961 289.53 205.312
 289.53 c 240.664 289.53 264.41 274.331 264.41 260.136 c 264.41 258.679 
264.941 257.273 265.902 256.175 c 267.969 253.82 l 268.055 253.722 268.145
 253.628 268.234 253.534 c 274.734 247.034 278.316 238.409 278.316 229.245
 c 278.316 201.034 l 273.891 201.034 l 273.891 229.245 l 273.891 234.421
 272.547 239.527 270.004 244.007 c h
281.477 170.066 m 273.891 170.066 l 273.891 189.03 l 281.477 189.03 l 286.703
 189.03 290.957 184.777 290.957 179.546 c 290.957 174.316 286.703 170.066
 281.477 170.066 c h
379.77 182.972 m 377.816 185.652 374.062 186.241 371.383 184.288 c 364.961
 179.605 356.656 177.027 347.996 177.027 c 334.609 177.027 322.25 183.32
 316.512 193.058 c 314.836 195.902 311.172 196.859 308.32 195.195 c 307.066
 194.468 305.609 194.077 304.105 194.077 c 304.039 194.077 303.973 194.077
 303.906 194.077 c 297.484 193.863 l 295.5 196.077 293.062 197.878 290.324
 199.12 c 290.324 222.636 l 337.992 222.636 l 364.801 222.636 386.609 200.827
 386.609 174.019 c 386.609 153.042 l 380.922 153.042 l 380.922 177.863 l
 380.922 178.124 380.898 178.382 380.863 178.64 c 381.062 180.116 380.719
 181.671 379.77 182.972 c h
388.035 121.921 m 380.922 121.921 l 380.922 141.038 l 388.035 141.038 l
 393.305 141.038 397.594 136.749 397.594 131.48 c 397.594 126.21 393.305
 121.921 388.035 121.921 c h
388.035 121.921 m f
45.227 330.698 m 59.383 330.698 l 70.391 279.62 l 71.477 274.577 75.668
 271.046 80.824 270.839 c 85.973 270.62 90.441 273.808 91.93 278.745 c 107.605
 330.695 l 189.094 330.695 l 195.859 317.542 l 197.711 313.941 201.234 311.687
 205.277 311.511 c 209.336 311.327 213.027 313.28 215.184 316.71 c 223.977
 330.695 l 313.922 330.695 l 324.93 279.616 l 326.016 274.573 330.207 271.046
 335.363 270.839 c 335.523 270.831 335.68 270.831 335.84 270.831 c 340.789
 270.831 345.027 273.964 346.469 278.745 c 362.145 330.695 l 365.398 330.695
 l 385.922 330.695 402.617 347.394 402.617 367.917 c 402.617 388.441 385.922
 405.136 365.398 405.136 c 45.227 405.136 l 24.703 405.136 8.004 388.441
 8.004 367.917 c 8.004 347.394 24.703 330.698 45.227 330.698 c h
45.227 393.132 m 365.398 393.132 l 379.301 393.132 390.613 381.82 390.613
 367.917 c 390.613 354.015 379.301 342.702 365.398 342.702 c 357.684 342.702
 l 355.035 342.702 352.703 340.968 351.938 338.433 c 335.953 285.456 l 324.633
 337.964 l 324.039 340.73 321.594 342.702 318.766 342.702 c 220.656 342.702
 l 218.594 342.702 216.672 341.644 215.574 339.894 c 205.832 324.398 l 198.094
 339.445 l 197.066 341.445 195.004 342.702 192.754 342.702 c 103.145 342.702
 l 100.496 342.702 98.164 340.968 97.398 338.433 c 81.414 285.456 l 70.098
 337.964 l 69.5 340.73 67.059 342.702 64.227 342.702 c 45.227 342.702 l 
31.324 342.702 20.012 354.015 20.012 367.917 c 20.012 381.82 31.32 393.132
 45.227 393.132 c h
45.227 393.132 m f
Q Q
showpage
%%Trailer
end restore
%%EOF
