%!PS-Adobe-3.0 EPSF-3.0
%%Creator: cairo 1.14.2 (http://cairographics.org)
%%CreationDate: Mon Feb 19 09:15:05 2018
%%Pages: 1
%%DocumentData: Clean7Bit
%%LanguageLevel: 2
%%BoundingBox: 0 93 410 317
%%EndComments
%%BeginProlog
save
50 dict begin
/q { gsave } bind def
/Q { grestore } bind def
/cm { 6 array astore concat } bind def
/w { setlinewidth } bind def
/J { setlinecap } bind def
/j { setlinejoin } bind def
/M { setmiterlimit } bind def
/d { setdash } bind def
/m { moveto } bind def
/l { lineto } bind def
/c { curveto } bind def
/h { closepath } bind def
/re { exch dup neg 3 1 roll 5 3 roll moveto 0 rlineto
      0 exch rlineto 0 rlineto closepath } bind def
/S { stroke } bind def
/f { fill } bind def
/f* { eofill } bind def
/n { newpath } bind def
/W { clip } bind def
/W* { eoclip } bind def
/BT { } bind def
/ET { } bind def
/pdfmark where { pop globaldict /?pdfmark /exec load put }
    { globaldict begin /?pdfmark /pop load def /pdfmark
    /cleartomark load def end } ifelse
/BDC { mark 3 1 roll /BDC pdfmark } bind def
/EMC { mark /EMC pdfmark } bind def
/cairo_store_point { /cairo_point_y exch def /cairo_point_x exch def } def
/Tj { show currentpoint cairo_store_point } bind def
/TJ {
  {
    dup
    type /stringtype eq
    { show } { -0.001 mul 0 cairo_font_matrix dtransform rmoveto } ifelse
  } forall
  currentpoint cairo_store_point
} bind def
/cairo_selectfont { cairo_font_matrix aload pop pop pop 0 0 6 array astore
    cairo_font exch selectfont cairo_point_x cairo_point_y moveto } bind def
/Tf { pop /cairo_font exch def /cairo_font_matrix where
      { pop cairo_selectfont } if } bind def
/Td { matrix translate cairo_font_matrix matrix concatmatrix dup
      /cairo_font_matrix exch def dup 4 get exch 5 get cairo_store_point
      /cairo_font where { pop cairo_selectfont } if } bind def
/Tm { 2 copy 8 2 roll 6 array astore /cairo_font_matrix exch def
      cairo_store_point /cairo_font where { pop cairo_selectfont } if } bind def
/g { setgray } bind def
/rg { setrgbcolor } bind def
/d1 { setcachedevice } bind def
%%EndProlog
%%BeginSetup
%%EndSetup
%%Page: 1 1
%%BeginPageSetup
%%PageBoundingBox: 0 93 410 317
%%EndPageSetup
q 0 93 410 224 rectclip q
0.192157 0.823529 0.968627 rg
291.891 296.631 m 117.707 296.631 l 107.547 152.998 l 108.926 145.784 l
 111.16 134.057 121.414 125.573 133.352 125.573 c 226.535 125.573 l 236.848
 104.944 l 238.148 102.35 241.84 102.319 243.184 104.893 c 253.977 125.573
 l 276.25 125.573 l 288.188 125.573 298.441 134.057 300.676 145.784 c 302.055
 152.998 l h
291.891 296.631 m f
0.0745098 0.67451 0.909804 rg
295.695 134.955 m 298.148 138.026 299.898 141.705 300.676 145.78 c 302.055
 152.998 l 291.895 296.627 l 268.094 296.627 l 256.68 282.225 250.363 264.362
 250.363 245.588 c 250.363 237.729 l 241.148 225.557 l 235.539 218.147 234.41
 208.268 238.203 199.78 c 240.695 194.213 245.047 189.823 250.363 187.248
 c 250.363 180.67 l 250.359 155.588 270.664 135.166 295.695 134.955 c h
295.695 134.955 m f
0.980392 0.827451 0.576471 rg
331.219 103.807 m 388 103.807 l 392.02 103.807 395.277 107.065 395.277 
111.08 c 395.277 172.87 l 400.988 180.967 404.004 190.491 404.004 200.413
 c 404.004 254.745 l 404.004 285.487 379.086 310.401 348.348 310.401 c 332.762
 310.401 l 318.5 310.401 304.953 305.834 293.59 297.19 c 292.094 296.01 
l 276.746 283.612 267.945 265.233 267.945 245.588 c 267.945 231.819 l 255.168
 214.944 l 253.355 212.549 253.043 209.463 254.355 206.741 c 255.594 204.174
 258.188 202.534 261.027 202.299 c 267.945 201.729 l 267.945 180.67 l 267.945
 165.127 280.547 152.53 296.086 152.53 c 323.941 152.53 l 323.941 111.084
 l 323.941 107.065 327.199 103.807 331.219 103.807 c h
331.219 103.807 m f
0.929412 0.717647 0.411765 rg
292.102 167.612 m 292.102 232.53 l 292.102 252.174 300.906 270.553 316.25
 282.955 c 317.746 284.131 l 329.113 292.776 342.656 297.346 356.918 297.346
 c 372.504 297.346 l 377.176 297.346 381.715 296.764 386.051 295.678 c 376.137
 304.819 362.895 310.405 348.348 310.405 c 332.762 310.405 l 318.5 310.405
 304.957 305.834 293.59 297.19 c 292.094 296.014 l 276.746 283.612 267.945
 265.233 267.945 245.588 c 267.945 231.823 l 255.168 214.944 l 253.355 212.553
 253.047 209.467 254.359 206.745 c 255.594 204.178 258.191 202.534 261.031
 202.303 c 267.945 201.733 l 267.945 180.674 l 267.945 165.131 280.547 152.53
 296.09 152.53 c 296.492 152.53 l 293.719 156.889 292.102 162.061 292.102
 167.612 c h
292.102 167.612 m f
0.0745098 0.67451 0.909804 rg
107.547 152.998 m 108.926 145.78 l 109.703 141.709 111.453 138.026 113.906
 134.955 c 138.938 135.166 159.238 155.588 159.238 180.67 c 159.238 187.252
 l 164.555 189.827 168.906 194.213 171.398 199.788 c 175.191 208.272 174.062
 218.147 168.453 225.561 c 159.238 237.729 l 159.238 245.588 l 159.238 264.85
 152.594 282.584 141.48 296.631 c 117.707 296.631 l h
107.547 152.998 m f
0.980392 0.827451 0.576471 rg
21.598 103.807 m 78.383 103.807 l 82.402 103.807 85.66 107.065 85.66 111.08
 c 85.66 152.53 l 113.512 152.53 l 129.055 152.53 141.652 165.127 141.652
 180.67 c 141.652 201.729 l 148.57 202.299 l 151.41 202.534 154.004 204.174
 155.242 206.741 c 156.555 209.463 156.242 212.549 154.43 214.944 c 141.652
 231.819 l 141.652 245.584 l 141.652 281.381 112.637 310.401 76.836 310.401
 c 61.254 310.401 l 30.512 310.401 5.598 285.483 5.598 254.745 c 5.598 200.413
 l 5.598 190.491 8.613 180.971 14.324 172.87 c 14.324 111.08 l 14.32 107.065
 17.578 103.807 21.598 103.807 c h
21.598 103.807 m f
0.929412 0.717647 0.411765 rg
41.047 159.811 m 35.34 167.913 32.324 177.432 32.324 187.354 c 32.324 241.69
 l 32.324 272.428 57.242 297.346 87.98 297.346 c 103.566 297.346 l 108.492
 297.346 113.285 296.776 117.898 295.737 c 106.719 304.901 92.422 310.405
 76.836 310.405 c 61.254 310.405 l 30.512 310.405 5.598 285.487 5.598 254.748
 c 5.598 200.413 l 5.598 190.491 8.613 180.971 14.324 172.87 c 14.324 111.084
 l 14.324 107.065 17.582 103.807 21.598 103.807 c 41.051 103.807 l 41.051
 159.811 l h
41.047 159.811 m f
0 g
348.348 315.998 m 332.762 315.998 l 317.129 315.998 302.676 310.873 290.98
 302.225 c 118.621 302.225 l 106.922 310.877 92.469 315.998 76.836 315.998
 c 61.254 315.998 l 27.422 315.998 0 288.577 0 254.745 c 0 200.413 l 0 189.936
 3.012 179.862 8.727 171.147 c 8.727 104.205 l 8.727 100.897 11.41 98.209
 14.723 98.209 c 85.262 98.209 l 88.57 98.209 91.254 100.897 91.254 104.205
 c 91.254 146.932 l 103.094 146.932 l 104.844 131.784 117.742 119.979 133.352
 119.979 c 155.895 119.979 l 159.207 119.979 161.891 122.663 161.891 125.971
 c 161.891 129.284 159.207 131.967 155.895 131.967 c 133.352 131.967 l 124.348
 131.967 116.836 138.44 115.207 146.975 c 133.027 147.862 147.25 162.635
 147.25 180.67 c 147.25 196.577 l 148.938 196.713 l 153.004 197.049 156.816
 199.057 159.16 202.401 c 162.598 207.303 162.383 213.709 158.891 218.323
 c 147.25 233.698 l 147.25 245.588 l 147.25 262.518 141.238 278.077 131.242
 290.233 c 278.355 290.233 l 268.359 278.073 262.348 262.518 262.348 245.588
 c 262.348 233.698 l 250.898 218.573 l 248.434 215.319 247.387 211.139 248.312
 207.166 c 249.668 201.33 254.59 197.213 260.355 196.741 c 262.348 196.577
 l 262.348 180.67 l 262.348 162.635 276.574 147.862 294.391 146.975 c 292.766
 138.44 285.25 131.967 276.246 131.967 c 253.73 131.967 l 251.496 131.967
 249.449 130.725 248.418 128.745 c 240.086 112.772 l 232.145 128.655 l 231.129
 130.686 229.051 131.967 226.781 131.967 c 194.906 131.967 l 191.594 131.967
 188.91 129.284 188.91 125.975 c 188.91 122.663 191.594 119.979 194.906 
119.979 c 223.078 119.979 l 234.609 96.913 l 235.625 94.881 237.699 93.6
 239.969 93.6 c 239.973 93.6 l 242.203 93.6 244.254 94.842 245.285 96.823
 c 257.367 119.979 l 276.246 119.979 l 291.859 119.979 304.758 131.784 306.504
 146.936 c 318.344 146.936 l 318.344 104.205 l 318.344 100.897 321.027 98.213
 324.34 98.213 c 394.879 98.213 l 398.191 98.213 400.875 100.897 400.875
 104.205 c 400.875 171.151 l 406.59 179.866 409.602 189.94 409.602 200.413
 c 409.602 254.748 l 409.602 288.577 382.176 315.998 348.348 315.998 c h
135.258 245.588 m 135.258 231.686 l 135.258 230.381 135.688 229.112 136.477
 228.069 c 149.332 211.084 l 149.773 210.502 149.672 209.94 149.504 209.573
 c 149.34 209.202 148.992 208.752 148.262 208.69 c 140.762 208.073 l 137.652
 207.819 135.258 205.221 135.258 202.1 c 135.258 180.67 l 135.258 168.678
 125.504 158.924 113.512 158.924 c 91.254 158.924 l 91.254 163.838 l 91.254
 167.147 88.57 169.83 85.258 169.83 c 81.949 169.83 79.266 167.147 79.266
 163.838 c 79.266 110.202 l 20.715 110.202 l 20.715 172.995 l 20.715 174.237
 20.332 175.448 19.613 176.463 c 14.625 183.502 11.988 191.784 11.988 200.413
 c 11.988 254.748 l 11.988 281.909 34.09 304.01 61.254 304.01 c 76.836 304.01
 l 109.051 304.01 135.258 277.799 135.258 245.588 c h
397.609 200.413 m 397.609 191.78 394.977 183.498 389.988 176.463 c 389.27
 175.448 388.883 174.237 388.883 172.998 c 388.883 110.202 l 330.336 110.202
 l 330.336 163.838 l 330.336 167.151 327.652 169.834 324.34 169.834 c 321.031
 169.834 318.344 167.151 318.344 163.838 c 318.344 158.924 l 296.09 158.924
 l 284.098 158.924 274.34 168.682 274.34 180.67 c 274.34 202.1 l 274.34 
205.221 271.945 207.819 268.836 208.077 c 261.336 208.69 l 260.609 208.752
 260.258 209.202 260.094 209.573 c 259.93 209.94 259.824 210.502 260.266
 211.084 c 273.125 228.069 l 273.914 229.112 274.34 230.381 274.34 231.69
 c 274.34 245.588 l 274.34 263.932 282.848 280.319 296.113 291.038 c 296.613
 291.327 297.066 291.686 297.465 292.1 c 307.277 299.565 319.508 304.01 
332.762 304.01 c 348.348 304.01 l 375.512 304.01 397.609 281.909 397.609
 254.745 c h
397.609 200.413 m f
200.805 256.663 m 204.113 256.663 206.797 259.346 206.797 262.659 c 206.797
 265.971 204.113 268.655 200.805 268.655 c 164.035 268.655 l 160.723 268.655
 158.039 265.971 158.039 262.659 c 158.039 259.346 160.723 256.663 164.035
 256.663 c h
200.805 256.663 m f
223.184 224.69 m 186.414 224.69 l 183.105 224.69 180.422 222.006 180.422
 218.694 c 180.422 215.381 183.105 212.702 186.414 212.702 c 223.184 212.702
 l 226.496 212.702 229.18 215.381 229.18 218.694 c 229.18 222.006 226.496
 224.69 223.184 224.69 c h
223.184 224.69 m f
210.793 180.729 m 158.438 180.729 l 155.129 180.729 152.441 178.045 152.441
 174.733 c 152.441 171.42 155.129 168.737 158.438 168.737 c 210.793 168.737
 l 214.105 168.737 216.789 171.42 216.789 174.733 c 216.789 178.045 214.105
 180.729 210.793 180.729 c h
210.793 180.729 m f
244.367 180.729 m 233.574 180.729 l 230.266 180.729 227.578 178.045 227.578
 174.733 c 227.578 171.42 230.266 168.737 233.574 168.737 c 244.367 168.737
 l 247.676 168.737 250.363 171.42 250.363 174.733 c 250.363 178.045 247.676
 180.729 244.367 180.729 c h
244.367 180.729 m f
224.383 256.663 m 242.367 256.663 l 245.68 256.663 248.363 259.346 248.363
 262.659 c 248.363 265.971 245.68 268.655 242.367 268.655 c 224.383 268.655
 l 221.07 268.655 218.387 265.971 218.387 262.659 c 218.387 259.346 221.07
 256.663 224.383 256.663 c h
224.383 256.663 m f
Q Q
showpage
%%Trailer
end restore
%%EOF
