%!PS-Adobe-3.0 EPSF-3.0
%%Creator: cairo 1.14.2 (http://cairographics.org)
%%CreationDate: Mon Feb 19 09:15:05 2018
%%Pages: 1
%%DocumentData: Clean7Bit
%%LanguageLevel: 2
%%BoundingBox: 0 -1 410 410
%%EndComments
%%BeginProlog
save
50 dict begin
/q { gsave } bind def
/Q { grestore } bind def
/cm { 6 array astore concat } bind def
/w { setlinewidth } bind def
/J { setlinecap } bind def
/j { setlinejoin } bind def
/M { setmiterlimit } bind def
/d { setdash } bind def
/m { moveto } bind def
/l { lineto } bind def
/c { curveto } bind def
/h { closepath } bind def
/re { exch dup neg 3 1 roll 5 3 roll moveto 0 rlineto
      0 exch rlineto 0 rlineto closepath } bind def
/S { stroke } bind def
/f { fill } bind def
/f* { eofill } bind def
/n { newpath } bind def
/W { clip } bind def
/W* { eoclip } bind def
/BT { } bind def
/ET { } bind def
/pdfmark where { pop globaldict /?pdfmark /exec load put }
    { globaldict begin /?pdfmark /pop load def /pdfmark
    /cleartomark load def end } ifelse
/BDC { mark 3 1 roll /BDC pdfmark } bind def
/EMC { mark /EMC pdfmark } bind def
/cairo_store_point { /cairo_point_y exch def /cairo_point_x exch def } def
/Tj { show currentpoint cairo_store_point } bind def
/TJ {
  {
    dup
    type /stringtype eq
    { show } { -0.001 mul 0 cairo_font_matrix dtransform rmoveto } ifelse
  } forall
  currentpoint cairo_store_point
} bind def
/cairo_selectfont { cairo_font_matrix aload pop pop pop 0 0 6 array astore
    cairo_font exch selectfont cairo_point_x cairo_point_y moveto } bind def
/Tf { pop /cairo_font exch def /cairo_font_matrix where
      { pop cairo_selectfont } if } bind def
/Td { matrix translate cairo_font_matrix matrix concatmatrix dup
      /cairo_font_matrix exch def dup 4 get exch 5 get cairo_store_point
      /cairo_font where { pop cairo_selectfont } if } bind def
/Tm { 2 copy 8 2 roll 6 array astore /cairo_font_matrix exch def
      cairo_store_point /cairo_font where { pop cairo_selectfont } if } bind def
/g { setgray } bind def
/rg { setrgbcolor } bind def
/d1 { setcachedevice } bind def
%%EndProlog
%%BeginSetup
%%EndSetup
%%Page: 1 1
%%BeginPageSetup
%%PageBoundingBox: 0 -1 410 410
%%EndPageSetup
q 0 -1 410 411 rectclip q
0.764706 0.854902 0.25098 rg
95.957 275.093 m 16.883 275.093 l 13.445 275.093 10.66 277.878 10.66 281.312
 c 10.66 298.769 l 10.66 324.042 31.148 344.527 56.422 344.527 c 81.691 
344.527 102.18 324.042 102.18 298.769 c 102.18 281.312 l 102.176 277.878
 99.395 275.093 95.957 275.093 c h
95.957 275.093 m f
1 0.384314 0.654902 rg
142.367 120.155 m 133.5 126.007 127.809 132.718 125.438 140.097 c 110.52
 146.433 100.887 161.257 100.887 177.921 c 100.887 200.468 118.656 218.812
 140.5 218.812 c 190.91 218.812 l 212.754 218.812 230.523 200.468 230.523
 177.921 c 230.523 155.37 212.754 137.027 190.91 137.027 c 151.82 137.027
 l 151.484 133.652 151.621 130.14 152.223 126.581 c 154.035 115.894 l 154.285
 114.421 152.66 113.363 151.414 114.183 c h
142.367 120.155 m f
0.988235 0.329412 0.47451 rg
230.523 177.917 m 230.523 200.468 212.754 218.812 190.91 218.812 c 140.5
 218.812 l 134.812 218.812 129.41 217.558 124.516 215.323 c 126.621 181.468
 155.379 155.027 189.652 155.027 c 223.715 155.027 l 228.012 161.562 230.523
 169.445 230.523 177.917 c h
230.523 177.917 m f
0.192157 0.823529 0.968627 rg
246.301 149.292 m 247.562 154.726 247.93 160.054 247.398 165.144 c 198.453
 165.144 l 170.93 165.144 147.961 186.999 147.539 214.523 c 147.113 242.534
 169.773 265.456 197.691 265.456 c 260.961 265.456 l 288.543 265.456 311.492
 243.484 311.816 215.902 c 312.059 195.202 299.793 176.726 280.684 168.89
 c 276.57 156.433 264.867 147.554 255.754 142.288 c 246.363 136.866 l 245.07
 136.12 243.508 137.277 243.848 138.73 c h
246.301 149.292 m f
0.0745098 0.67451 0.909804 rg
188.535 200.898 m 188.109 228.909 210.77 251.831 238.688 251.831 c 295.734
 251.831 l 286.594 260.288 274.324 265.456 260.961 265.456 c 197.691 265.456
 l 169.773 265.456 147.113 242.534 147.539 214.523 c 147.961 186.999 170.926
 165.144 198.453 165.144 c 204.637 165.144 l 194.941 174.097 188.754 186.745
 188.535 200.898 c h
188.535 200.898 m f
1 0.811765 0.34902 rg
392.344 275.093 m 313.27 275.093 l 309.832 275.093 307.047 277.878 307.047
 281.312 c 307.047 298.769 l 307.047 324.042 327.535 344.527 352.805 344.527
 c 378.078 344.527 398.566 324.042 398.566 298.769 c 398.566 281.312 l 398.562
 277.878 395.777 275.093 392.344 275.093 c h
392.344 275.093 m f
1 0.384314 0.654902 rg
95.957 30.667 m 16.883 30.667 l 13.445 30.667 10.66 33.456 10.66 36.89 
c 10.66 54.347 l 10.66 79.62 31.148 100.105 56.422 100.105 c 81.691 100.105
 102.18 79.62 102.18 54.347 c 102.18 36.89 l 102.176 33.456 99.395 30.667
 95.957 30.667 c h
95.957 30.667 m f
0.192157 0.823529 0.968627 rg
392.344 30.667 m 313.27 30.667 l 309.832 30.667 307.047 33.456 307.047 
36.89 c 307.047 54.347 l 307.047 79.62 327.535 100.105 352.805 100.105 c
 378.078 100.105 398.566 79.62 398.566 54.347 c 398.566 36.89 l 398.562 
33.456 395.777 30.667 392.344 30.667 c h
392.344 30.667 m f
0.678431 0.737255 0.0823529 rg
45.824 281.312 m 45.824 298.769 l 45.824 317.808 57.457 334.128 74 341.023
 c 68.586 343.277 62.648 344.527 56.418 344.527 c 31.148 344.527 10.66 324.042
 10.66 298.769 c 10.66 281.312 l 10.66 277.878 13.445 275.093 16.883 275.093
 c 52.043 275.093 l 48.609 275.093 45.824 277.878 45.824 281.312 c h
45.824 281.312 m f
1 0.709804 0.360784 rg
342.207 281.312 m 342.207 298.769 l 342.207 317.808 353.84 334.128 370.387
 341.023 c 364.973 343.277 359.035 344.527 352.805 344.527 c 327.531 344.527
 307.047 324.042 307.047 298.769 c 307.047 281.312 l 307.047 277.878 309.832
 275.093 313.27 275.093 c 348.43 275.093 l 344.996 275.093 342.207 277.878
 342.207 281.312 c h
342.207 281.312 m f
0.988235 0.329412 0.47451 rg
45.824 36.89 m 45.824 54.347 l 45.824 73.386 57.457 89.706 74 96.601 c 
68.586 98.855 62.648 100.105 56.418 100.105 c 31.148 100.105 10.66 79.62
 10.66 54.347 c 10.66 36.89 l 10.66 33.456 13.445 30.667 16.883 30.667 c
 52.043 30.667 l 48.609 30.667 45.824 33.456 45.824 36.89 c h
45.824 36.89 m f
0.0745098 0.67451 0.909804 rg
342.207 36.89 m 342.207 54.347 l 342.207 73.386 353.84 89.706 370.387 96.601
 c 364.973 98.855 359.035 100.105 352.805 100.105 c 327.531 100.105 307.047
 79.62 307.047 54.347 c 307.047 36.89 l 307.047 33.456 309.832 30.667 313.27
 30.667 c 348.43 30.667 l 344.996 30.667 342.207 33.456 342.207 36.89 c 
h
342.207 36.89 m f
0.980392 0.827451 0.576471 rg
56.023 318.476 m 39.672 318.476 26.371 331.78 26.371 348.132 c 26.371 364.48
 39.672 377.784 56.023 377.784 c 72.375 377.784 85.676 364.48 85.676 348.132
 c 85.676 331.78 72.375 318.476 56.023 318.476 c h
56.023 318.476 m f
352.41 318.476 m 336.059 318.476 322.758 331.78 322.758 348.132 c 322.758
 364.48 336.059 377.784 352.41 377.784 c 368.762 377.784 382.062 364.48 
382.062 348.132 c 382.062 331.78 368.762 318.476 352.41 318.476 c h
352.41 318.476 m f
56.023 74.054 m 39.672 74.054 26.371 87.359 26.371 103.706 c 26.371 120.058
 39.672 133.363 56.023 133.363 c 72.375 133.363 85.676 120.058 85.676 103.706
 c 85.676 87.355 72.375 74.054 56.023 74.054 c h
56.023 74.054 m f
352.41 74.054 m 336.059 74.054 322.758 87.359 322.758 103.706 c 322.758
 120.058 336.059 133.363 352.41 133.363 c 368.762 133.363 382.062 120.058
 382.062 103.706 c 382.062 87.355 368.762 74.054 352.41 74.054 c h
352.41 74.054 m f
0.929412 0.717647 0.411765 rg
54.375 348.128 m 54.375 359.421 60.719 369.253 70.027 374.261 c 65.855 
376.507 61.086 377.784 56.023 377.784 c 39.672 377.784 26.371 364.48 26.371
 348.132 c 26.371 331.78 39.672 318.476 56.023 318.476 c 61.086 318.476 
65.852 319.753 70.027 321.999 c 60.719 327.007 54.375 336.839 54.375 348.128
 c h
54.375 348.128 m f
350.762 348.128 m 350.762 359.421 357.105 369.253 366.414 374.261 c 362.238
 376.507 357.473 377.784 352.41 377.784 c 336.059 377.784 322.758 364.48
 322.758 348.132 c 322.758 331.78 336.059 318.476 352.41 318.476 c 357.473
 318.476 362.238 319.753 366.414 321.999 c 357.105 327.007 350.762 336.839
 350.762 348.128 c h
350.762 348.128 m f
54.375 103.706 m 54.375 114.995 60.719 124.831 70.027 129.839 c 65.855 
132.081 61.086 133.363 56.023 133.363 c 39.672 133.363 26.371 120.058 26.371
 103.706 c 26.371 87.355 39.672 74.054 56.023 74.054 c 61.086 74.054 65.852
 75.331 70.027 77.577 c 60.719 82.585 54.375 92.417 54.375 103.706 c h
54.375 103.706 m f
350.762 103.706 m 350.762 114.995 357.105 124.831 366.414 129.839 c 362.238
 132.081 357.473 133.363 352.41 133.363 c 336.059 133.363 322.758 120.058
 322.758 103.706 c 322.758 87.355 336.059 74.054 352.41 74.054 c 357.473
 74.054 362.238 75.331 366.414 77.577 c 357.105 82.585 350.762 92.417 350.762
 103.706 c h
350.762 103.706 m f
0 g
105.496 369.464 m 106.633 369.464 107.781 369.753 108.836 370.366 c 115.234
 374.077 121.914 377.452 128.695 380.39 c 132.07 381.855 133.621 385.78 
132.156 389.155 c 130.691 392.53 126.77 394.081 123.391 392.62 c 116.141
 389.472 108.992 385.866 102.145 381.89 c 98.961 380.042 97.879 375.968 
99.727 372.784 c 100.965 370.652 103.199 369.464 105.496 369.464 c h
105.496 369.464 m f
237.75 393.288 m 245.039 392.023 252.328 390.316 259.418 388.21 c 260.051
 388.023 260.688 387.933 261.316 387.933 c 264.191 387.933 266.844 389.808
 267.703 392.702 c 268.754 396.23 266.742 399.941 263.211 400.988 c 255.629
 403.238 247.828 405.07 240.027 406.421 c 236.402 407.046 232.949 404.62
 232.324 400.991 c 231.695 397.366 234.125 393.917 237.75 393.288 c h
237.75 393.288 m f
192.961 395.765 m 193.094 395.765 193.227 395.765 193.359 395.777 c 197.141
 395.999 200.984 396.113 204.781 396.113 c 204.801 396.113 l 208.406 396.113
 212.051 396.011 215.633 395.808 c 219.324 395.601 222.453 398.417 222.656
 402.093 c 222.859 405.765 220.047 408.909 216.375 409.116 c 212.547 409.331
 208.652 409.437 204.801 409.437 c 204.777 409.437 l 200.723 409.437 196.617
 409.32 192.574 409.077 c 188.902 408.863 186.098 405.71 186.316 402.034
 c 186.523 398.495 189.461 395.765 192.961 395.765 c h
192.961 395.765 m f
396 257.214 m 392.422 256.363 390.211 252.769 391.062 249.187 c 392.777
 241.999 394.082 234.628 394.949 227.273 c 395.348 223.882 398.227 221.386
 401.559 221.386 c 401.82 221.386 402.082 221.402 402.348 221.433 c 406 
221.863 408.613 225.175 408.184 228.831 c 407.258 236.698 405.859 244.585
 404.027 252.277 c 403.176 255.859 399.582 258.07 396 257.214 c h
396 257.214 m f
384.781 139.148 m 383.523 135.691 385.305 131.866 388.766 130.609 c 389.516
 130.335 390.285 130.206 391.043 130.206 c 393.766 130.206 396.32 131.886
 397.305 134.593 c 400.016 142.034 402.309 149.718 404.129 157.425 c 404.973
 161.007 402.758 164.597 399.176 165.441 c 395.598 166.284 392.004 164.07
 391.156 160.484 c 389.457 153.28 387.312 146.105 384.781 139.148 c h
384.781 139.148 m f
280.352 380.628 m 287.145 377.71 293.844 374.355 300.262 370.655 c 301.309
 370.05 302.453 369.765 303.582 369.765 c 305.887 369.765 308.129 370.96
 309.359 373.101 c 311.199 376.292 310.105 380.366 306.914 382.202 c 300.047
 386.159 292.883 389.749 285.613 392.874 c 282.23 394.331 278.312 392.765
 276.863 389.382 c 275.41 386.003 276.973 382.081 280.352 380.628 c h
280.352 380.628 m f
10.469 165.234 m 6.887 164.382 4.672 160.792 5.52 157.21 c 7.348 149.507
 9.648 141.831 12.363 134.398 c 13.352 131.695 15.906 130.019 18.625 130.019
 c 19.383 130.019 20.156 130.148 20.91 130.425 c 24.367 131.687 26.145 135.511
 24.883 138.968 c 22.348 145.913 20.195 153.085 18.488 160.284 c 17.641 
163.866 14.055 166.081 10.469 165.234 c h
10.469 165.234 m f
147.676 387.753 m 148.312 387.753 148.957 387.843 149.598 388.034 c 156.676
 390.163 163.961 391.894 171.25 393.183 c 174.875 393.823 177.293 397.28
 176.652 400.905 c 176.012 404.53 172.559 406.945 168.93 406.308 c 161.133
 404.929 153.336 403.077 145.762 400.8 c 142.234 399.738 140.238 396.023
 141.297 392.499 c 142.164 389.613 144.812 387.753 147.676 387.753 c h
147.676 387.753 m f
402.938 211.722 m 399.254 211.722 396.273 208.741 396.273 205.062 c 396.273
 204.64 l 396.273 197.214 395.844 189.738 394.996 182.409 c 394.574 178.753
 397.195 175.445 400.852 175.023 c 401.109 174.991 401.367 174.98 401.625
 174.98 c 404.961 174.98 407.844 177.48 408.234 180.878 c 409.141 188.71
 409.602 196.706 409.602 204.636 c 409.602 205.058 l 409.598 208.741 406.617
 211.722 402.938 211.722 c h
402.938 211.722 m f
238.148 16.058 m 230.879 14.784 223.441 13.917 216.035 13.491 c 212.363
 13.277 209.555 10.128 209.77 6.452 c 209.973 2.909 212.91 0.175 216.414
 0.175 c 216.543 0.175 216.676 0.179 216.805 0.187 c 224.723 0.644 232.68
 1.57 240.453 2.933 c 244.078 3.57 246.504 7.027 245.863 10.652 c 245.23
 14.273 241.773 16.698 238.148 16.058 c h
238.148 16.058 m f
193.766 13.48 m 186.359 13.898 178.918 14.757 171.652 16.023 c 168.02 16.659
 164.574 14.23 163.938 10.605 c 163.305 6.98 165.734 3.527 169.359 2.894
 c 177.133 1.538 185.09 0.62 193.008 0.171 c 193.137 0.163 193.266 0.163
 193.395 0.163 c 196.898 0.163 199.84 2.902 200.039 6.448 c 200.246 10.124
 197.438 13.269 193.766 13.48 c h
193.766 13.48 m f
149.988 21.124 m 142.898 23.238 135.859 25.796 129.059 28.73 c 125.68 30.187
 121.758 28.628 120.305 25.249 c 118.844 21.87 120.402 17.948 123.781 16.491
 c 131.059 13.355 138.594 10.616 146.18 8.355 c 146.812 8.167 147.457 8.073
 148.086 8.073 c 150.957 8.073 153.605 9.945 154.469 12.835 c 155.52 16.363
 153.516 20.073 149.988 21.124 c h
149.988 21.124 m f
7.203 220.804 m 7.461 220.773 7.715 220.761 7.969 220.761 c 11.309 220.761
 14.191 223.269 14.578 226.667 c 15.422 234.023 16.707 241.402 18.395 248.593
 c 19.234 252.175 17.016 255.765 13.43 256.605 c 9.848 257.448 6.262 255.226
 5.418 251.64 c 3.613 243.945 2.238 236.054 1.34 228.183 c 0.918 224.527
 3.543 221.222 7.203 220.804 c h
7.203 220.804 m f
280.719 28.804 m 273.926 25.866 266.891 23.304 259.809 21.183 c 256.281
 20.128 254.281 16.413 255.336 12.886 c 256.199 9.999 258.848 8.132 261.719
 8.132 c 262.352 8.132 262.992 8.226 263.633 8.413 c 271.211 10.683 278.738
 13.429 286.008 16.57 c 289.387 18.03 290.941 21.956 289.48 25.331 c 288.02
 28.71 284.098 30.265 280.719 28.804 c h
280.719 28.804 m f
8.777 174.816 m 12.434 175.241 15.051 178.55 14.625 182.206 c 13.77 189.534
 13.336 197.011 13.328 204.437 c 13.324 208.113 10.34 211.093 6.664 211.093
 c 6.656 211.093 l 2.977 211.089 -0.004 208.101 0 204.421 c 0.008 196.491
 0.477 188.495 1.391 180.663 c 1.785 177.269 4.664 174.769 8 174.769 c 8.258
 174.769 8.52 174.784 8.777 174.816 c h
8.777 174.816 m f
17.926 269.777 m 94.914 269.777 l 102.723 269.777 109.078 276.132 109.078
 283.941 c 109.078 299.995 l 109.078 305.327 108.211 310.57 106.504 315.577
 c 105.43 318.718 102.008 320.398 98.871 319.323 c 95.73 318.253 94.051 
314.835 95.125 311.691 c 96.406 307.941 97.055 304.003 97.055 299.995 c 
97.055 283.941 l 97.055 282.761 96.094 281.8 94.914 281.8 c 17.922 281.8
 l 16.742 281.8 15.785 282.761 15.785 283.941 c 15.785 299.995 l 15.785 
310.335 20.227 320.132 27.836 326.96 c 34.277 318.405 44.516 312.866 56.023
 312.866 c 75.469 312.866 91.289 328.687 91.289 348.128 c 91.289 367.573
 75.469 383.394 56.023 383.394 c 36.578 383.394 20.758 367.573 20.758 348.128
 c 20.758 344.593 21.289 341.179 22.262 337.956 c 10.637 328.843 3.762 314.843
 3.762 299.995 c 3.762 283.937 l 3.762 276.132 10.113 269.777 17.926 269.777
 c h
56.023 371.37 m 68.84 371.37 79.266 360.945 79.266 348.128 c 79.266 335.312
 68.84 324.89 56.023 324.89 c 43.211 324.89 32.781 335.312 32.781 348.128
 c 32.781 360.945 43.207 371.37 56.023 371.37 c h
56.023 371.37 m f
300.523 299.995 m 300.523 283.941 l 300.523 276.128 306.875 269.777 314.684
 269.777 c 391.676 269.777 l 399.484 269.777 405.84 276.128 405.84 283.941
 c 405.84 299.995 l 405.84 305.327 404.973 310.57 403.266 315.573 c 402.191
 318.718 398.77 320.394 395.633 319.323 c 392.488 318.249 390.812 314.835
 391.887 311.691 c 393.164 307.941 393.812 304.003 393.812 299.995 c 393.812
 283.937 l 393.812 282.757 392.855 281.8 391.676 281.8 c 314.684 281.8 l
 313.504 281.8 312.547 282.757 312.547 283.937 c 312.547 299.995 l 312.547
 310.335 316.988 320.132 324.598 326.96 c 331.039 318.405 341.277 312.863
 352.785 312.863 c 372.23 312.863 388.047 328.683 388.047 348.128 c 388.047
 367.573 372.23 383.394 352.785 383.394 c 333.34 383.394 317.52 367.573 
317.52 348.128 c 317.52 344.593 318.047 341.179 319.023 337.956 c 307.395
 328.843 300.523 314.843 300.523 299.995 c h
352.781 371.37 m 365.598 371.37 376.023 360.945 376.023 348.128 c 376.023
 335.312 365.598 324.89 352.781 324.89 c 339.969 324.89 329.543 335.312 
329.543 348.128 c 329.543 360.945 339.969 371.37 352.781 371.37 c h
352.781 371.37 m f
395.633 75.429 m 392.488 74.355 390.812 70.941 391.883 67.796 c 393.164
 64.046 393.812 60.109 393.812 56.101 c 393.812 40.042 l 393.812 38.863 
392.855 37.905 391.676 37.905 c 314.684 37.905 l 313.504 37.905 312.543 
38.863 312.543 40.042 c 312.543 56.101 l 312.543 66.441 316.984 76.238 324.598
 83.066 c 331.039 74.511 341.273 68.968 352.781 68.968 c 372.227 68.968 
388.047 84.788 388.047 104.234 c 388.047 123.679 372.227 139.499 352.781
 139.499 c 333.34 139.499 317.52 123.679 317.52 104.234 c 317.52 100.698
 318.047 97.284 319.023 94.062 c 307.395 84.948 300.523 70.948 300.523 56.101
 c 300.523 40.042 l 300.523 32.234 306.875 25.878 314.684 25.878 c 391.676
 25.878 l 399.484 25.878 405.84 32.234 405.84 40.042 c 405.84 56.101 l 405.84
 61.433 404.973 66.675 403.266 71.679 c 402.191 74.823 398.77 76.503 395.633
 75.429 c h
352.781 127.476 m 365.598 127.476 376.023 117.05 376.023 104.234 c 376.023
 91.421 365.598 80.995 352.781 80.995 c 339.969 80.995 329.543 91.421 329.543
 104.234 c 329.543 117.05 339.969 127.476 352.781 127.476 c h
352.781 127.476 m f
98.871 75.429 m 95.73 74.355 94.051 70.941 95.125 67.796 c 96.406 64.046
 97.055 60.109 97.055 56.101 c 97.055 40.042 l 97.055 38.863 96.094 37.905
 94.914 37.905 c 17.926 37.905 l 16.742 37.905 15.785 38.863 15.785 40.042
 c 15.785 56.101 l 15.785 66.441 20.227 76.238 27.84 83.066 c 34.277 74.511
 44.516 68.968 56.023 68.968 c 75.469 68.968 91.289 84.788 91.289 104.234
 c 91.289 123.679 75.469 139.499 56.023 139.499 c 36.578 139.499 20.758 
123.679 20.758 104.234 c 20.758 100.698 21.289 97.284 22.262 94.062 c 10.637
 84.948 3.762 70.948 3.762 56.101 c 3.762 40.042 l 3.762 32.234 10.113 25.878
 17.926 25.878 c 94.914 25.878 l 102.727 25.878 109.078 32.234 109.078 40.042
 c 109.078 56.101 l 109.078 61.433 108.211 66.675 106.504 71.679 c 105.43
 74.823 102.008 76.503 98.871 75.429 c h
56.023 127.476 m 68.84 127.476 79.266 117.05 79.266 104.234 c 79.266 91.421
 68.84 80.995 56.023 80.995 c 43.211 80.995 32.781 91.421 32.781 104.234
 c 32.781 117.05 43.207 127.476 56.023 127.476 c h
56.023 127.476 m f
261.664 271.07 m 197.691 271.07 l 170.047 271.07 147.047 250.847 142.68
 224.421 c 140.5 224.421 l 115.562 224.421 95.277 203.562 95.277 177.917
 c 95.277 159.855 105.281 143.675 120.98 135.968 c 128.699 117.273 152.777
 108.308 153.844 107.921 c 154.516 107.675 155.211 107.554 155.902 107.554
 c 157.547 107.554 159.156 108.23 160.312 109.484 c 161.961 111.257 162.379
 113.847 161.379 116.054 c 158.957 121.382 157.598 126.53 157.309 131.413
 c 190.91 131.413 l 209.5 131.413 225.496 143.011 232.438 159.53 c 242.012
 159.53 l 241.844 152.948 240.055 145.991 236.672 138.773 c 235.645 136.581
 236.035 133.984 237.66 132.187 c 238.82 130.905 240.449 130.21 242.117 
130.21 c 242.789 130.21 243.465 130.323 244.117 130.554 c 245.453 131.027
 275.801 141.968 285.113 164.702 c 304.836 173.823 317.434 193.398 317.434
 215.3 c 317.434 246.05 292.414 271.07 261.664 271.07 c h
278.102 174.761 m 276.473 174.101 275.199 172.78 274.664 171.109 c 271.289
 160.577 261.02 152.734 252.547 147.843 c 254.004 154.109 254.402 160.241
 253.734 166.175 c 253.391 169.234 250.832 171.558 247.758 171.558 c 197.691
 171.558 l 191.934 171.558 186.438 172.679 181.402 174.714 c 179.172 175.613
 176.621 175.124 174.922 173.421 c 174.836 173.335 l 171.812 170.312 172.871
 165.195 176.832 163.589 c 183.277 160.976 190.32 159.534 197.691 159.534
 c 218.973 159.534 l 213.086 149.87 202.711 143.441 190.91 143.441 c 151.457
 143.441 l 148.41 143.441 145.82 141.159 145.484 138.128 c 145.031 134.023
 145.168 129.808 145.898 125.507 c 140.062 129.363 133.832 134.929 131.543
 142.058 c 130.988 143.788 129.762 145.238 128.086 145.941 c 115.457 151.234
 107.301 163.788 107.301 177.917 c 107.301 196.929 122.191 212.398 140.496
 212.398 c 142 212.398 l 142.324 206.113 143.695 200.105 145.941 194.534
 c 147.543 190.558 152.664 189.484 155.695 192.515 c 155.785 192.601 l 157.477
 194.296 157.977 196.835 157.086 199.058 c 154.949 204.363 153.824 210.179
 153.957 216.273 c 154.48 240.152 174.426 259.042 198.309 259.042 c 260.926
 259.042 l 285.066 259.042 305.484 239.296 305.406 215.159 c 305.352 197.323
 294.645 181.476 278.102 174.761 c h
278.102 174.761 m f
Q Q
showpage
%%Trailer
end restore
%%EOF
