%!PS-Adobe-3.0 EPSF-3.0
%%Creator: cairo 1.14.2 (http://cairographics.org)
%%CreationDate: Mon Feb 19 09:15:05 2018
%%Pages: 1
%%DocumentData: Clean7Bit
%%LanguageLevel: 2
%%BoundingBox: 0 12 410 397
%%EndComments
%%BeginProlog
save
50 dict begin
/q { gsave } bind def
/Q { grestore } bind def
/cm { 6 array astore concat } bind def
/w { setlinewidth } bind def
/J { setlinecap } bind def
/j { setlinejoin } bind def
/M { setmiterlimit } bind def
/d { setdash } bind def
/m { moveto } bind def
/l { lineto } bind def
/c { curveto } bind def
/h { closepath } bind def
/re { exch dup neg 3 1 roll 5 3 roll moveto 0 rlineto
      0 exch rlineto 0 rlineto closepath } bind def
/S { stroke } bind def
/f { fill } bind def
/f* { eofill } bind def
/n { newpath } bind def
/W { clip } bind def
/W* { eoclip } bind def
/BT { } bind def
/ET { } bind def
/pdfmark where { pop globaldict /?pdfmark /exec load put }
    { globaldict begin /?pdfmark /pop load def /pdfmark
    /cleartomark load def end } ifelse
/BDC { mark 3 1 roll /BDC pdfmark } bind def
/EMC { mark /EMC pdfmark } bind def
/cairo_store_point { /cairo_point_y exch def /cairo_point_x exch def } def
/Tj { show currentpoint cairo_store_point } bind def
/TJ {
  {
    dup
    type /stringtype eq
    { show } { -0.001 mul 0 cairo_font_matrix dtransform rmoveto } ifelse
  } forall
  currentpoint cairo_store_point
} bind def
/cairo_selectfont { cairo_font_matrix aload pop pop pop 0 0 6 array astore
    cairo_font exch selectfont cairo_point_x cairo_point_y moveto } bind def
/Tf { pop /cairo_font exch def /cairo_font_matrix where
      { pop cairo_selectfont } if } bind def
/Td { matrix translate cairo_font_matrix matrix concatmatrix dup
      /cairo_font_matrix exch def dup 4 get exch 5 get cairo_store_point
      /cairo_font where { pop cairo_selectfont } if } bind def
/Tm { 2 copy 8 2 roll 6 array astore /cairo_font_matrix exch def
      cairo_store_point /cairo_font where { pop cairo_selectfont } if } bind def
/g { setgray } bind def
/rg { setrgbcolor } bind def
/d1 { setcachedevice } bind def
%%EndProlog
%%BeginSetup
%%EndSetup
%%Page: 1 1
%%BeginPageSetup
%%PageBoundingBox: 0 12 410 397
%%EndPageSetup
q 0 12 410 385 rectclip q
0.956863 0.67451 0.270588 rg
345.035 117.139 m 345.035 220.409 l 352.359 220.409 l 380.832 220.409 403.996
 197.245 403.996 168.776 c 403.996 140.303 380.832 117.139 352.359 117.139
 c h
345.035 117.139 m f
57.238 117.139 m 28.77 117.139 5.605 140.303 5.605 168.776 c 5.605 197.245
 28.77 220.409 57.238 220.409 c 64.562 220.409 l 64.562 117.139 l h
57.238 117.139 m f
0.917647 0.231373 0.219608 rg
329.688 104.33 m 321.078 104.33 314.074 111.334 314.074 119.94 c 314.074
 217.608 l 314.074 226.217 321.078 233.221 329.688 233.221 c 338.293 233.221
 345.297 226.217 345.297 217.608 c 345.297 119.94 l 345.297 111.334 338.293
 104.33 329.688 104.33 c h
329.688 104.33 m f
79.914 104.33 m 71.305 104.33 64.305 111.334 64.305 119.94 c 64.305 217.608
 l 64.305 226.217 71.305 233.221 79.914 233.221 c 88.52 233.221 95.523 226.217
 95.523 217.608 c 95.523 119.94 l 95.523 111.334 88.52 104.33 79.914 104.33
 c h
79.914 104.33 m f
0.894118 0.00392157 0.211765 rg
330.125 119.94 m 330.125 217.608 l 330.125 223.28 333.176 228.237 337.711
 230.971 c 335.363 232.389 332.625 233.221 329.688 233.221 c 321.078 233.221
 314.074 226.217 314.074 217.608 c 314.074 119.94 l 314.074 111.334 321.078
 104.33 329.688 104.33 c 332.625 104.33 335.363 105.163 337.711 106.577 
c 333.176 109.311 330.125 114.272 330.125 119.94 c h
330.125 119.94 m f
80.355 119.94 m 80.355 217.608 l 80.355 223.28 83.402 228.237 87.941 230.971
 c 85.59 232.389 82.852 233.221 79.914 233.221 c 71.309 233.221 64.305 226.217
 64.305 217.608 c 64.305 119.94 l 64.305 111.334 71.309 104.33 79.914 104.33
 c 82.852 104.33 85.59 105.163 87.941 106.577 c 83.402 109.311 80.355 114.272
 80.355 119.94 c h
80.355 119.94 m f
0.917647 0.231373 0.219608 rg
307.992 266.842 m 303.02 266.842 298.938 270.612 298.5 275.612 c 296.434
 299.12 285.68 320.924 268.215 337.01 c 250.645 353.194 227.84 362.108 204
 362.108 c 180.16 362.108 157.355 353.194 139.785 337.01 c 122.32 320.924
 111.566 299.12 109.5 275.612 c 109.062 270.612 104.98 266.842 100.008 266.842
 c 84.621 266.842 l 82.18 266.842 80.238 268.885 80.363 271.323 c 80.477
 273.569 l 82.078 305.217 95.652 334.752 118.695 356.729 c 141.82 378.78
 172.117 390.928 204 390.928 c 235.887 390.928 266.18 378.78 289.305 356.729
 c 312.348 334.752 325.922 305.217 327.527 273.569 c 327.742 269.272 l 327.812
 267.948 326.758 266.842 325.434 266.842 c h
307.992 266.842 m f
0.894118 0.00392157 0.211765 rg
278.078 348.26 m 257.996 367.409 231.691 377.955 204.004 377.955 c 176.32
 377.955 150.012 367.409 129.934 348.26 c 109.926 329.178 98.137 303.534
 96.742 276.049 c 96.645 274.096 l 96.539 271.983 98.223 270.209 100.344
 270.209 c 107.258 270.209 l 108.5 271.678 109.316 273.538 109.5 275.612
 c 111.562 299.12 122.32 320.924 139.785 337.01 c 157.352 353.198 180.16
 362.108 203.996 362.108 c 227.836 362.108 250.641 353.198 268.211 337.01
 c 285.676 320.924 296.434 299.12 298.496 275.612 c 298.68 273.538 299.496
 271.678 300.738 270.209 c 309.445 270.209 l 310.598 270.209 311.512 271.17
 311.453 272.319 c 311.266 276.053 l 309.875 303.534 298.086 329.174 278.078
 348.26 c h
278.078 348.26 m f
0.407843 g
203.199 18.67 m 194.148 18.67 186.789 26.034 186.789 35.084 c 186.789 44.131
 194.148 51.495 203.199 51.495 c 227.215 51.495 l 236.266 51.495 243.625
 44.131 243.625 35.084 c 243.625 26.034 236.266 18.67 227.215 18.67 c h
203.199 18.67 m f
0 g
351.539 226.014 m 349.16 226.014 l 346.359 232.483 340.43 237.284 333.289
 238.51 c 333.289 265.991 l 333.289 337.459 275.832 396.334 204.363 396.534
 c 132.906 396.729 74.711 338.655 74.711 267.241 c 74.711 238.174 l 68.289
 236.549 63.031 231.991 60.441 226.014 c 57.969 226.014 l 26.457 226.014
 0.309 200.85 0.004 169.342 c -0.305 137.522 25.488 111.534 57.238 111.534
 c 60.441 111.534 l 63.711 103.983 71.25 98.694 79.996 98.725 c 91.758 98.772
 101.129 108.639 101.129 120.401 c 101.129 217.608 l 101.129 226.928 95.09
 234.854 86.719 237.698 c 86.719 261.237 l 100.008 261.237 l 107.906 261.237
 114.387 267.205 115.086 275.123 c 119.09 320.756 158.148 356.502 204 356.502
 c 220.867 356.502 236.812 351.663 250.434 343.276 c 252.898 341.756 256.086
 342.256 257.961 344.463 c 258.035 344.553 258.113 344.643 258.191 344.733
 c 260.609 347.436 259.887 351.733 256.797 353.631 c 241.008 363.315 222.805
 368.51 204 368.51 c 178.547 368.51 154.203 358.998 135.445 341.721 c 116.805
 324.549 105.324 301.272 103.121 276.17 c 102.973 274.506 101.637 273.245
 100.008 273.245 c 86.871 273.245 l 90.008 335.135 141.344 384.522 204 384.522
 c 266.656 384.522 317.992 335.135 321.129 273.245 c 307.988 273.245 l 306.363
 273.245 305.023 274.502 304.879 276.17 c 303.301 294.112 296.984 311.12
 286.699 325.635 c 284.621 328.569 280.449 328.823 277.836 326.346 c 277.801
 326.311 277.762 326.276 277.723 326.241 c 275.539 324.213 275.168 320.924
 276.891 318.495 c 285.75 306.01 291.504 291.182 292.914 275.123 c 293.609
 267.205 300.09 261.241 307.988 261.241 c 321.281 261.241 l 321.281 237.084
 l 313.754 233.823 308.473 226.323 308.473 217.608 c 308.473 120.401 l 308.473
 108.639 317.844 98.772 329.605 98.725 c 338.352 98.694 345.887 103.983 
349.16 111.534 c 352.359 111.534 l 355.727 111.534 359.02 111.842 362.223
 112.405 c 362.223 68.229 l 362.223 53.241 350.07 41.088 335.082 41.088 
c 248.391 41.088 l 245.77 50.315 237.273 57.1 227.215 57.1 c 203.668 57.1
 l 191.691 57.1 181.551 47.725 181.195 35.752 c 180.824 23.307 190.84 13.069
 203.199 13.069 c 227.219 13.069 l 237.273 13.069 245.773 19.85 248.395 
29.08 c 335.082 29.08 l 356.707 29.08 374.234 46.608 374.234 68.233 c 374.234
 115.889 l 395.168 124.58 409.879 145.346 409.598 169.452 c 409.23 200.932
 383.023 226.014 351.539 226.014 c h
58.156 123.545 m 57.238 123.545 l 32.297 123.545 12.008 143.834 12.008 
168.776 c 12.008 193.717 32.297 214.006 57.238 214.006 c 58.156 214.006 
l h
89.121 217.608 m 89.121 119.94 l 89.121 114.866 84.988 110.737 79.914 110.737
 c 74.836 110.737 70.707 114.866 70.707 119.94 c 70.707 217.608 l 70.707
 222.686 74.836 226.815 79.914 226.815 c 84.988 226.815 89.121 222.686 89.121
 217.608 c h
338.891 119.94 m 338.891 114.866 334.762 110.737 329.688 110.737 c 324.609
 110.737 320.48 114.866 320.48 119.94 c 320.48 217.608 l 320.48 222.686 
324.609 226.815 329.688 226.815 c 334.762 226.815 338.891 222.686 338.891
 217.608 c h
227.215 25.077 m 203.199 25.077 l 197.68 25.077 193.191 29.565 193.191 
35.084 c 193.191 40.6 197.68 45.092 203.199 45.092 c 227.215 45.092 l 232.734
 45.092 237.223 40.6 237.223 35.084 c 237.223 29.565 232.734 25.077 227.215
 25.077 c h
352.359 123.545 m 351.441 123.545 l 351.441 214.006 l 352.359 214.006 l
 377.301 214.006 397.59 193.713 397.59 168.776 c 397.59 143.834 377.301 
123.545 352.359 123.545 c h
352.359 123.545 m f
Q Q
showpage
%%Trailer
end restore
%%EOF
