%!PS-Adobe-3.0 EPSF-3.0
%%Creator: cairo 1.14.2 (http://cairographics.org)
%%CreationDate: Mon Feb 19 09:15:05 2018
%%Pages: 1
%%DocumentData: Clean7Bit
%%LanguageLevel: 2
%%BoundingBox: 0 18 410 392
%%EndComments
%%BeginProlog
save
50 dict begin
/q { gsave } bind def
/Q { grestore } bind def
/cm { 6 array astore concat } bind def
/w { setlinewidth } bind def
/J { setlinecap } bind def
/j { setlinejoin } bind def
/M { setmiterlimit } bind def
/d { setdash } bind def
/m { moveto } bind def
/l { lineto } bind def
/c { curveto } bind def
/h { closepath } bind def
/re { exch dup neg 3 1 roll 5 3 roll moveto 0 rlineto
      0 exch rlineto 0 rlineto closepath } bind def
/S { stroke } bind def
/f { fill } bind def
/f* { eofill } bind def
/n { newpath } bind def
/W { clip } bind def
/W* { eoclip } bind def
/BT { } bind def
/ET { } bind def
/pdfmark where { pop globaldict /?pdfmark /exec load put }
    { globaldict begin /?pdfmark /pop load def /pdfmark
    /cleartomark load def end } ifelse
/BDC { mark 3 1 roll /BDC pdfmark } bind def
/EMC { mark /EMC pdfmark } bind def
/cairo_store_point { /cairo_point_y exch def /cairo_point_x exch def } def
/Tj { show currentpoint cairo_store_point } bind def
/TJ {
  {
    dup
    type /stringtype eq
    { show } { -0.001 mul 0 cairo_font_matrix dtransform rmoveto } ifelse
  } forall
  currentpoint cairo_store_point
} bind def
/cairo_selectfont { cairo_font_matrix aload pop pop pop 0 0 6 array astore
    cairo_font exch selectfont cairo_point_x cairo_point_y moveto } bind def
/Tf { pop /cairo_font exch def /cairo_font_matrix where
      { pop cairo_selectfont } if } bind def
/Td { matrix translate cairo_font_matrix matrix concatmatrix dup
      /cairo_font_matrix exch def dup 4 get exch 5 get cairo_store_point
      /cairo_font where { pop cairo_selectfont } if } bind def
/Tm { 2 copy 8 2 roll 6 array astore /cairo_font_matrix exch def
      cairo_store_point /cairo_font where { pop cairo_selectfont } if } bind def
/g { setgray } bind def
/rg { setrgbcolor } bind def
/d1 { setcachedevice } bind def
%%EndProlog
%%BeginSetup
%%EndSetup
%%Page: 1 1
%%BeginPageSetup
%%PageBoundingBox: 0 18 410 392
%%EndPageSetup
q 0 18 410 374 rectclip q
1 0.811765 0.34902 rg
46.23 54.986 m 41.258 54.986 l 31.516 54.986 23.617 62.884 23.617 72.627
 c 23.617 108.966 l 23.617 118.709 31.516 126.603 41.258 126.603 c 111.66
 126.603 l 121.402 126.603 129.301 118.709 129.301 108.966 c 129.301 72.627
 l 129.301 62.884 121.402 54.986 111.66 54.986 c 60.254 54.986 l 59.723 
45.353 l 59.594 43.041 56.688 42.099 55.227 43.9 c h
46.23 54.986 m f
0.968627 0.639216 0.282353 rg
39.98 87.556 m 39.98 97.298 47.879 105.193 57.621 105.193 c 128.023 105.193
 l 128.453 105.193 128.879 105.173 129.301 105.142 c 129.301 108.966 l 129.301
 118.709 121.402 126.603 111.66 126.603 c 41.258 126.603 l 31.516 126.603
 23.617 118.709 23.617 108.966 c 23.617 72.627 l 23.617 63.314 30.836 55.693
 39.98 55.037 c h
39.98 87.556 m f
0.917647 0.231373 0.219608 rg
348.672 49.677 m 270.324 49.677 l 255.625 49.677 243.711 61.591 243.711
 76.291 c 243.711 131.548 l 243.711 146.248 255.629 158.162 270.324 158.162
 c 377.383 158.162 l 392.082 158.162 403.996 146.248 403.996 131.548 c 403.996
 76.291 l 403.996 61.591 392.078 49.677 377.383 49.677 c 369.723 49.677 
l 353.172 29.275 l 351.668 27.423 348.672 28.486 348.672 30.869 c h
348.672 49.677 m f
0.894118 0.00392157 0.211765 rg
282.57 61.545 m 282.57 116.806 l 282.57 131.502 294.484 143.42 309.184 
143.42 c 401.203 143.42 l 396.84 152.158 387.812 158.166 377.383 158.166
 c 270.324 158.166 l 255.625 158.166 243.711 146.248 243.711 131.552 c 243.711
 76.291 l 243.711 61.591 255.629 49.677 270.324 49.677 c 285.363 49.677 
l 283.578 53.252 282.57 57.279 282.57 61.545 c h
282.57 61.545 m f
348.672 34.931 m 348.672 30.869 l 348.672 28.486 351.668 27.423 353.168
 29.275 c 357.758 34.931 l 348.668 34.931 l h
348.672 34.931 m f
1 0.384314 0.654902 rg
128.902 257.841 m 36.797 257.841 l 19.57 257.841 5.605 271.806 5.605 289.033
 c 5.605 353.947 l 5.605 371.173 19.57 385.138 36.797 385.138 c 162.559 
385.138 l 179.785 385.138 193.75 371.173 193.75 353.947 c 193.75 289.037
 l 193.75 271.806 179.785 257.841 162.559 257.841 c 153.527 257.841 l 133.398
 233.037 l 131.898 231.185 128.902 232.248 128.902 234.63 c h
128.902 257.841 m f
0.988235 0.329412 0.47451 rg
32.641 266.837 m 32.641 331.752 l 32.641 348.978 46.605 362.943 63.832 
362.943 c 189.594 362.943 l 190.562 362.943 191.52 362.892 192.469 362.806
 c 188.648 375.716 176.707 385.142 162.559 385.142 c 36.797 385.142 l 19.57
 385.142 5.605 371.173 5.605 353.947 c 5.605 289.033 l 5.605 272.775 18.043
 259.431 33.926 257.978 c 33.094 260.787 32.641 263.759 32.641 266.837 c
 h
32.641 266.837 m f
128.902 235.646 m 128.902 234.63 l 128.902 232.248 131.898 231.185 133.398
 233.037 c 135.516 235.646 l h
128.902 235.646 m f
0 g
377.383 163.767 m 270.324 163.767 l 252.559 163.767 238.105 149.314 238.105
 131.548 c 238.105 76.291 l 238.105 58.525 252.559 44.072 270.324 44.072
 c 343.066 44.072 l 343.066 24.861 l 343.066 22.318 344.668 20.048 347.062
 19.201 c 347.723 18.966 348.398 18.853 349.07 18.853 c 350.844 18.853 352.57
 19.642 353.734 21.076 c 372.391 44.072 l 377.383 44.072 l 395.145 44.072
 409.598 58.525 409.598 76.291 c 409.598 131.548 l 409.602 149.314 395.148
 163.767 377.383 163.767 c h
397.59 76.291 m 397.59 65.146 388.523 56.08 377.383 56.08 c 369.531 56.08
 l 367.719 56.08 366.008 55.263 364.867 53.861 c 355.074 41.791 l 355.074
 50.076 l 355.074 53.392 352.387 56.08 349.07 56.08 c 270.324 56.08 l 259.18
 56.08 250.113 65.146 250.113 76.291 c 250.113 131.552 l 250.113 142.693
 259.18 151.759 270.324 151.759 c 377.383 151.759 l 388.523 151.759 397.59
 142.693 397.59 131.552 c h
397.59 76.291 m f
111.66 132.209 m 41.258 132.209 l 28.441 132.209 18.012 121.783 18.012 
108.966 c 18.012 72.627 l 18.012 59.81 28.441 49.384 41.258 49.384 c 43.559
 49.384 l 55.211 35.021 l 56.375 33.587 58.102 32.798 59.875 32.798 c 60.547
 32.798 61.227 32.912 61.883 33.146 c 64.277 33.998 65.879 36.263 65.879
 38.806 c 65.879 49.384 l 111.66 49.384 l 124.477 49.384 134.906 59.81 134.906
 72.627 c 134.906 108.966 l 134.906 121.783 124.48 132.209 111.66 132.209
 c h
122.895 72.627 m 122.895 66.431 117.855 61.392 111.66 61.392 c 59.875 61.392
 l 56.672 61.392 54.055 58.884 53.879 55.724 c 51.082 59.17 l 49.941 60.576
 48.23 61.392 46.422 61.392 c 41.258 61.392 l 35.062 61.392 30.023 66.431
 30.023 72.627 c 30.023 108.966 l 30.023 115.158 35.062 120.197 41.258 120.197
 c 111.66 120.197 l 117.855 120.197 122.895 115.158 122.895 108.966 c h
122.895 72.627 m f
162.559 390.744 m 36.797 390.744 l 16.477 390.744 0 374.271 0 353.947 c
 0 289.037 l 0 268.712 16.477 252.236 36.797 252.236 c 56.43 252.236 l 59.742
 252.236 62.434 254.927 62.434 258.24 c 62.434 261.556 59.742 264.248 56.43
 264.248 c 36.797 264.248 l 23.105 264.248 12.008 275.345 12.008 289.033
 c 12.008 353.947 l 12.008 367.638 23.109 378.736 36.797 378.736 c 162.559
 378.736 l 176.25 378.736 187.348 367.638 187.348 353.947 c 187.348 289.037
 l 187.348 275.345 176.246 264.248 162.559 264.248 c 153.336 264.248 l 151.527
 264.248 149.812 263.431 148.672 262.025 c 135.305 245.552 l 135.305 258.24
 l 135.305 261.556 132.617 264.248 129.301 264.248 c 95.5 264.248 l 92.184
 264.248 89.496 261.556 89.496 258.24 c 89.496 254.927 92.184 252.236 95.5
 252.236 c 123.297 252.236 l 123.297 228.826 l 123.297 226.58 124.438 224.431
 126.406 223.357 c 127.328 222.853 128.32 222.615 129.301 222.615 c 131.074
 222.615 132.801 223.404 133.965 224.834 c 156.195 252.236 l 162.559 252.236
 l 182.879 252.236 199.355 268.712 199.355 289.037 c 199.355 353.947 l 199.355
 374.271 182.879 390.744 162.559 390.744 c h
162.559 390.744 m f
355.633 218.349 m 352.32 218.252 349.711 215.486 349.809 212.17 c 349.852
 210.716 349.871 209.248 349.871 207.802 c 349.871 200.619 349.34 193.404
 348.293 186.357 c 347.805 183.08 350.07 180.025 353.348 179.537 c 353.648
 179.49 353.945 179.47 354.238 179.47 c 357.164 179.47 359.727 181.611 360.172
 184.591 c 361.305 192.22 361.883 200.029 361.883 207.802 c 361.883 209.365
 361.859 210.955 361.812 212.525 c 361.715 215.779 359.047 218.353 355.812
 218.353 c 355.754 218.353 355.695 218.353 355.633 218.349 c h
355.633 218.349 m f
292.52 323.084 m 298.223 318.763 303.652 313.982 308.656 308.865 c 309.832
 307.666 311.391 307.06 312.949 307.06 c 314.465 307.06 315.98 307.63 317.148
 308.775 c 319.52 311.095 319.559 314.896 317.238 317.267 c 311.82 322.802
 305.941 327.978 299.77 332.654 c 297.125 334.658 293.359 334.138 291.359
 331.494 c 289.355 328.853 289.875 325.084 292.52 323.084 c h
292.52 323.084 m f
254.867 343.615 m 261.578 341.166 268.172 338.185 274.461 334.755 c 275.375
 334.259 276.359 334.021 277.332 334.021 c 279.457 334.021 281.516 335.154
 282.605 337.154 c 284.195 340.064 283.125 343.709 280.211 345.298 c 273.398
 349.013 266.254 352.244 258.98 354.896 c 255.863 356.033 252.418 354.427
 251.281 351.31 c 250.145 348.197 251.75 344.752 254.867 343.615 c h
254.867 343.615 m f
342.211 254.361 m 344.512 247.595 346.32 240.595 347.586 233.556 c 348.109
 230.65 350.641 228.611 353.488 228.611 c 353.84 228.611 354.199 228.642
 354.559 228.709 c 357.824 229.295 359.992 232.416 359.406 235.681 c 358.035
 243.31 356.074 250.896 353.582 258.228 c 352.512 261.369 349.105 263.048
 345.965 261.978 c 342.824 260.912 341.145 257.502 342.211 254.361 c h
342.211 254.361 m f
333.789 274.13 m 334.855 272.068 336.953 270.884 339.125 270.884 c 340.055
 270.884 340.996 271.103 341.879 271.56 c 344.824 273.084 345.977 276.709
 344.453 279.654 c 340.895 286.525 336.789 293.189 332.246 299.47 c 330.301
 302.158 326.543 302.759 323.859 300.814 c 321.172 298.869 320.57 295.115
 322.516 292.427 c 326.711 286.63 330.504 280.474 333.789 274.13 c h
333.789 274.13 m f
56.398 159.619 m 58.777 152.252 61.738 144.994 65.199 138.052 c 66.25 135.947
 68.375 134.728 70.578 134.728 c 71.48 134.728 72.395 134.931 73.254 135.361
 c 76.223 136.837 77.43 140.447 75.949 143.412 c 72.758 149.818 70.023 156.513
 67.824 163.31 c 66.805 166.466 63.418 168.193 60.266 167.177 c 57.109 166.158
 55.375 162.771 56.398 159.619 c h
56.398 159.619 m f
217.215 63.767 m 210.121 63.193 202.809 63.138 195.707 63.607 c 192.402
 63.826 189.539 61.322 189.32 58.013 c 189.102 54.705 191.605 51.845 194.914
 51.627 c 198.363 51.396 201.879 51.279 205.359 51.279 c 209.637 51.283 
213.953 51.455 218.188 51.798 c 221.492 52.068 223.953 54.962 223.688 58.271
 c 223.418 61.576 220.504 64.029 217.215 63.767 c h
217.215 63.767 m f
60.863 205.615 m 60.812 208.931 58.078 211.584 54.77 211.529 c 51.453 211.478
 48.805 208.752 48.855 205.435 c 48.969 197.666 49.664 189.869 50.914 182.252
 c 51.398 179.306 53.941 177.22 56.832 177.22 c 57.156 177.22 57.484 177.244
 57.812 177.298 c 61.086 177.837 63.301 180.923 62.766 184.197 c 61.609 
191.228 60.969 198.435 60.863 205.615 c h
60.863 205.615 m f
241.238 354.142 m 241.898 357.392 239.793 360.56 236.543 361.216 c 228.973
 362.748 221.203 363.724 213.445 364.119 c 210.121 364.295 207.312 361.74
 207.145 358.427 c 206.973 355.115 209.523 352.295 212.836 352.127 c 219.996
 351.759 227.172 350.857 234.164 349.443 c 234.566 349.365 234.965 349.326
 235.359 349.326 c 238.16 349.326 240.664 351.295 241.238 354.142 c h
241.238 354.142 m f
174.422 66.607 m 167.43 68.13 160.496 70.201 153.812 72.752 c 150.715 73.935
 147.246 72.384 146.062 69.287 c 144.879 66.189 146.43 62.716 149.527 61.533
 c 156.77 58.767 164.285 56.525 171.863 54.873 c 172.293 54.779 172.727 
54.732 173.148 54.732 c 175.91 54.732 178.395 56.654 179.008 59.459 c 179.719
 62.701 177.664 65.9 174.422 66.607 c h
174.422 66.607 m f
Q Q
showpage
%%Trailer
end restore
%%EOF
