%!PS-Adobe-3.0 EPSF-3.0
%%Creator: cairo 1.14.2 (http://cairographics.org)
%%CreationDate: Mon Feb 19 09:15:05 2018
%%Pages: 1
%%DocumentData: Clean7Bit
%%LanguageLevel: 2
%%BoundingBox: 0 36 410 373
%%EndComments
%%BeginProlog
save
50 dict begin
/q { gsave } bind def
/Q { grestore } bind def
/cm { 6 array astore concat } bind def
/w { setlinewidth } bind def
/J { setlinecap } bind def
/j { setlinejoin } bind def
/M { setmiterlimit } bind def
/d { setdash } bind def
/m { moveto } bind def
/l { lineto } bind def
/c { curveto } bind def
/h { closepath } bind def
/re { exch dup neg 3 1 roll 5 3 roll moveto 0 rlineto
      0 exch rlineto 0 rlineto closepath } bind def
/S { stroke } bind def
/f { fill } bind def
/f* { eofill } bind def
/n { newpath } bind def
/W { clip } bind def
/W* { eoclip } bind def
/BT { } bind def
/ET { } bind def
/pdfmark where { pop globaldict /?pdfmark /exec load put }
    { globaldict begin /?pdfmark /pop load def /pdfmark
    /cleartomark load def end } ifelse
/BDC { mark 3 1 roll /BDC pdfmark } bind def
/EMC { mark /EMC pdfmark } bind def
/cairo_store_point { /cairo_point_y exch def /cairo_point_x exch def } def
/Tj { show currentpoint cairo_store_point } bind def
/TJ {
  {
    dup
    type /stringtype eq
    { show } { -0.001 mul 0 cairo_font_matrix dtransform rmoveto } ifelse
  } forall
  currentpoint cairo_store_point
} bind def
/cairo_selectfont { cairo_font_matrix aload pop pop pop 0 0 6 array astore
    cairo_font exch selectfont cairo_point_x cairo_point_y moveto } bind def
/Tf { pop /cairo_font exch def /cairo_font_matrix where
      { pop cairo_selectfont } if } bind def
/Td { matrix translate cairo_font_matrix matrix concatmatrix dup
      /cairo_font_matrix exch def dup 4 get exch 5 get cairo_store_point
      /cairo_font where { pop cairo_selectfont } if } bind def
/Tm { 2 copy 8 2 roll 6 array astore /cairo_font_matrix exch def
      cairo_store_point /cairo_font where { pop cairo_selectfont } if } bind def
/g { setgray } bind def
/rg { setrgbcolor } bind def
/d1 { setcachedevice } bind def
%%EndProlog
%%BeginSetup
%%EndSetup
%%Page: 1 1
%%BeginPageSetup
%%PageBoundingBox: 0 36 410 373
%%EndPageSetup
q 0 36 410 337 rectclip q
0.407843 g
60.098 47.056 m 103.332 153.201 l 305.469 153.201 l 348.703 47.056 l 349.609
 44.834 347.973 42.4 345.57 42.4 c 63.227 42.4 l 60.828 42.4 59.191 44.834
 60.098 47.056 c h
60.098 47.056 m f
0.329412 0.317647 0.317647 rg
166.398 64.517 m 176.566 93.818 l 176.98 95.005 178.098 95.798 179.355 
95.798 c 229.445 95.798 l 230.703 95.798 231.82 95.005 232.234 93.818 c 
242.402 64.517 l 243.066 62.599 241.645 60.599 239.617 60.599 c 169.184 
60.599 l 167.156 60.599 165.73 62.599 166.398 64.517 c h
166.398 64.517 m f
0.286275 0.258824 0.258824 rg
242.402 64.517 m 232.234 93.818 l 231.82 95.005 230.703 95.798 229.445 
95.798 c 179.355 95.798 l 178.098 95.798 176.98 95.005 176.566 93.818 c 
174.871 88.935 l 221.82 88.935 l 223.074 88.935 224.195 88.142 224.605 86.955
 c 233.754 60.599 l 239.617 60.599 l 241.645 60.599 243.066 62.599 242.402
 64.517 c h
242.402 64.517 m f
0.329412 0.317647 0.317647 rg
86.203 111.146 m 103.332 153.201 l 305.469 153.201 l 322.598 111.146 l 
h
86.203 111.146 m f
0.764706 0.854902 0.25098 rg
103.199 152.4 m 103.199 252.689 l 103.199 258.263 107.734 262.798 113.312
 262.798 c 295.488 262.798 l 301.062 262.798 305.602 258.263 305.602 252.689
 c 305.602 152.4 l h
103.199 152.4 m f
0.192157 0.823529 0.968627 rg
205.199 171.798 m 191.305 171.798 180 183.103 180 196.998 c 180 210.896
 191.305 222.201 205.199 222.201 c 219.094 222.201 230.398 210.896 230.398
 196.998 c 230.398 183.103 219.094 171.798 205.199 171.798 c h
205.199 171.798 m f
0.0745098 0.67451 0.909804 rg
200.77 200.673 m 200.77 209.236 205.07 216.814 211.617 221.369 c 209.566
 221.908 207.418 222.201 205.199 222.201 c 191.305 222.201 180 210.896 180
 196.998 c 180 183.103 191.305 171.798 205.199 171.798 c 210.531 171.798
 215.477 173.466 219.555 176.302 c 208.758 179.15 200.77 188.994 200.77 
200.673 c h
200.77 200.673 m f
0.407843 g
103.199 240.545 m 103.199 252.689 l 103.199 258.263 107.734 262.798 113.312
 262.798 c 295.488 262.798 l 301.062 262.798 305.602 258.263 305.602 252.689
 c 305.602 240.545 l h
103.199 240.545 m f
0.337255 0.313726 0.313726 rg
98.266 47.056 m 141.5 153.201 l 103.332 153.201 l 60.098 47.056 l 59.191
 44.834 60.828 42.4 63.227 42.4 c 101.398 42.4 l 98.996 42.4 97.359 44.834
 98.266 47.056 c h
98.266 47.056 m f
0.309804 0.27451 0.27451 rg
103.332 153.201 m 86.203 111.146 l 124.371 111.146 l 141.5 153.201 l h
103.332 153.201 m f
0.678431 0.737255 0.0823529 rg
151.48 262.798 m 113.312 262.798 l 107.734 262.798 103.199 258.263 103.199
 252.689 c 103.199 152.4 l 141.367 152.4 l 141.367 252.689 l 141.367 258.263
 145.906 262.798 151.48 262.798 c h
151.48 262.798 m f
0.337255 0.313726 0.313726 rg
151.48 262.798 m 113.312 262.798 l 107.734 262.798 103.199 258.263 103.199
 252.689 c 103.199 240.545 l 141.367 240.545 l 141.367 252.689 l 141.367
 258.263 145.906 262.798 151.48 262.798 c h
151.48 262.798 m f
1 0.811765 0.34902 rg
48.398 281.4 m 24.801 281.4 5.602 300.599 5.602 324.201 c 5.602 347.798
 24.801 367.002 48.398 367.002 c 72 367.002 91.199 347.798 91.199 324.201
 c 91.199 300.599 72 281.4 48.398 281.4 c h
48.398 281.4 m f
0.917647 0.231373 0.219608 rg
68.621 321.705 m 65.027 325.357 l 31.773 325.357 l 28.176 321.701 l 22.973
 316.408 19.992 309.142 19.992 301.763 c 19.992 292.224 l 27.555 285.498
 37.504 281.4 48.398 281.4 c 59.297 281.4 69.246 285.498 76.809 292.224 
c 76.809 301.763 l 76.809 309.146 73.824 316.416 68.621 321.705 c h
68.621 321.705 m f
48.398 318.201 m 34.945 318.201 24 329.146 24 342.599 c 24 356.056 34.945
 367.002 48.398 367.002 c 61.855 367.002 72.801 356.056 72.801 342.599 c
 72.801 329.146 61.855 318.201 48.398 318.201 c h
48.398 318.201 m f
0.894118 0.00392157 0.211765 rg
45.734 287.209 m 41.441 289.712 38.82 294.334 38.82 299.306 c 38.82 301.763
 l 38.82 309.142 41.805 316.408 47.008 321.701 c 50.602 325.357 l 31.773
 325.357 l 28.176 321.701 l 22.973 316.408 19.992 309.142 19.992 301.763
 c 19.992 292.224 l 27.555 285.498 37.504 281.4 48.398 281.4 c 51.637 281.4
 54.785 281.767 57.812 282.455 c 53.508 283.427 49.445 285.045 45.734 287.209
 c h
45.734 287.209 m f
42.828 342.599 m 42.828 352.72 49.023 361.416 57.816 365.107 c 54.918 366.326
 51.734 367.002 48.402 367.002 c 34.945 367.002 24 356.056 24 342.599 c 
24 329.146 34.945 318.201 48.402 318.201 c 51.734 318.201 54.918 318.873
 57.816 320.091 c 49.023 323.783 42.828 332.482 42.828 342.599 c h
42.828 342.599 m f
0.192157 0.823529 0.968627 rg
361.199 281.4 m 337.602 281.4 318.398 300.599 318.398 324.201 c 318.398
 347.798 337.602 367.002 361.199 367.002 c 384.801 367.002 404 347.798 404
 324.201 c 404 300.599 384.801 281.4 361.199 281.4 c h
361.199 281.4 m f
1 0.811765 0.34902 rg
381.859 322.107 m 378.188 325.837 l 344.215 325.837 l 340.543 322.103 l
 335.227 316.697 332.176 309.271 332.176 301.736 c 332.176 292.779 l 339.812
 285.724 350.008 281.4 361.199 281.4 c 372.391 281.4 382.586 285.724 390.223
 292.779 c 390.223 301.736 l 390.223 309.279 387.172 316.701 381.859 322.107
 c h
381.859 322.107 m f
361.199 318.201 m 347.746 318.201 336.801 329.146 336.801 342.599 c 336.801
 356.056 347.746 367.002 361.199 367.002 c 374.656 367.002 385.602 356.056
 385.602 342.599 c 385.602 329.146 374.656 318.201 361.199 318.201 c h
361.199 318.201 m f
1 0.709804 0.360784 rg
361.996 286.138 m 356.168 289.146 352.523 295.177 352.523 301.736 c 352.523
 309.275 355.574 316.697 360.887 322.103 c 364.559 325.837 l 344.215 325.837
 l 340.543 322.103 l 335.227 316.697 332.18 309.271 332.18 301.736 c 332.18
 292.779 l 339.812 285.724 350.008 281.4 361.199 281.4 c 364.703 281.4 368.109
 281.826 371.371 282.623 c 368.082 283.431 364.941 284.615 361.996 286.138
 c h
361.996 286.138 m f
357.145 342.599 m 357.145 352.423 362.984 360.904 371.371 364.771 c 368.273
 366.197 364.828 367.002 361.199 367.002 c 347.746 367.002 336.801 356.056
 336.801 342.599 c 336.801 329.146 347.746 318.201 361.199 318.201 c 364.828
 318.201 368.273 319.002 371.371 320.431 c 362.984 324.295 357.145 332.775
 357.145 342.599 c h
357.145 342.599 m f
0.192157 0.823529 0.968627 rg
355.102 190.201 m 349.629 190.201 l 339.109 190.201 330.227 198.806 330.402
 209.322 c 330.574 219.541 338.941 227.798 349.199 227.798 c 374.371 227.798
 l 384.891 227.798 393.773 219.193 393.598 208.677 c 393.426 198.459 385.059
 190.201 374.801 190.201 c 368.73 190.201 l 363.273 178.201 l 362.5 176.498
 360.051 176.591 359.41 178.349 c h
355.102 190.201 m f
0.764706 0.854902 0.25098 rg
41.5 129.4 m 36.027 129.4 l 25.508 129.4 16.625 138.005 16.801 148.521 
c 16.977 158.74 25.34 166.998 35.602 166.998 c 60.773 166.998 l 71.289 166.998
 80.176 158.392 79.996 147.877 c 79.824 137.658 71.457 129.4 61.199 129.4
 c 55.129 129.4 l 49.676 117.4 l 48.898 115.697 46.449 115.791 45.809 117.548
 c h
41.5 129.4 m f
0.0745098 0.67451 0.909804 rg
344.754 194.298 m 344.93 204.517 353.293 212.775 363.555 212.775 c 388.727
 212.775 l 390.297 212.775 391.832 212.58 393.305 212.22 c 391.703 221.056
 383.68 227.798 374.375 227.798 c 349.199 227.798 l 338.941 227.798 330.574
 219.541 330.402 209.322 c 330.25 200.377 336.656 192.818 345.047 190.755
 c 344.84 191.908 344.734 193.091 344.754 194.298 c h
344.754 194.298 m f
0.678431 0.737255 0.0823529 rg
31.156 133.498 m 31.328 143.716 39.695 151.978 49.953 151.978 c 75.125 
151.978 l 76.699 151.978 78.23 151.779 79.707 151.42 c 78.105 160.259 70.078
 166.998 60.773 166.998 c 35.602 166.998 l 25.34 166.998 16.977 158.74 16.801
 148.521 c 16.652 139.576 23.059 132.017 31.445 129.959 c 31.238 131.107
 31.133 132.291 31.156 133.498 c h
31.156 133.498 m f
1 0.384314 0.654902 rg
183.309 303.002 m 177.254 303.002 l 167.289 303.002 158.789 310.732 158.414
 320.689 c 158.02 331.158 166.418 339.798 176.801 339.798 c 265.949 339.798
 l 275.91 339.798 284.41 332.068 284.785 322.111 c 285.184 311.642 276.781
 303.002 266.398 303.002 c 198.738 303.002 l 192.93 292.752 l 192.004 291.111
 189.633 291.142 188.746 292.802 c h
183.309 303.002 m f
0.988235 0.329412 0.47451 rg
173.906 308.4 m 173.508 318.869 181.91 327.509 192.293 327.509 c 281.441
 327.509 l 282.234 327.509 283.016 327.455 283.789 327.361 c 281.223 334.658
 274.074 339.802 265.945 339.802 c 176.801 339.802 l 166.418 339.802 158.02
 331.158 158.414 320.689 c 158.762 311.525 165.988 304.252 174.902 303.15
 c 174.324 304.802 173.977 306.56 173.906 308.4 c h
173.906 308.4 m f
0 g
176.801 297.4 m 179.945 297.4 l 185.508 286.978 l 186.535 285.045 188.535
 283.83 190.723 283.802 c 190.801 283.802 l 192.961 283.802 194.953 284.962
 196.02 286.841 c 202.004 297.4 l 266.398 297.4 l 279.633 297.4 290.398 
308.166 290.398 321.4 c 290.398 334.634 279.633 345.4 266.398 345.4 c 176.801
 345.4 l 163.566 345.4 152.801 334.634 152.801 321.4 c 152.801 308.166 163.566
 297.4 176.801 297.4 c h
176.801 333.4 m 266.398 333.4 l 273.016 333.4 278.398 328.017 278.398 321.4
 c 278.398 314.783 273.016 309.4 266.398 309.4 c 198.508 309.4 l 196.344
 309.4 194.352 308.236 193.285 306.357 c 190.961 302.252 l 188.84 306.224
 l 187.797 308.177 185.762 309.4 183.547 309.4 c 176.801 309.4 l 170.184
 309.4 164.801 314.783 164.801 321.4 c 164.801 328.017 170.184 333.4 176.801
 333.4 c h
176.801 333.4 m f
361.199 372.599 m 334.512 372.599 312.801 350.888 312.801 324.201 c 312.801
 312.607 316.902 301.955 323.727 293.611 c 298.43 268.314 l 297.477 268.498
 296.496 268.599 295.488 268.599 c 113.312 268.599 l 112.789 268.599 112.273
 268.572 111.762 268.521 c 86.227 294.06 l 92.836 302.334 96.801 312.81 
96.801 324.201 c 96.801 350.888 75.09 372.599 48.398 372.599 c 21.711 372.599
 0 350.888 0 324.201 c 0 297.513 21.711 275.798 48.398 275.798 c 59.383 
275.798 69.516 279.482 77.645 285.67 c 100.871 262.447 l 98.828 259.795 
97.602 256.486 97.602 252.888 c 97.602 154.173 l 97.594 154.158 l 54.625
 48.67 l 53.559 46.052 53.863 43.087 55.441 40.744 c 57.016 38.4 59.645 
36.998 62.469 36.998 c 346.332 36.998 l 349.156 36.998 351.785 38.4 353.359
 40.744 c 354.938 43.087 355.242 46.052 354.176 48.666 c 311.199 154.173
 l 311.191 154.193 311.207 154.158 311.199 154.173 c 311.199 252.888 l 311.199
 256.076 310.238 259.037 308.602 261.517 c 332.406 285.322 l 340.461 279.341
 350.422 275.798 361.199 275.798 c 387.887 275.798 409.598 297.509 409.598
 324.201 c 409.598 350.888 387.887 372.599 361.199 372.599 c h
48.398 360.599 m 58.324 360.599 66.398 352.525 66.398 342.599 c 66.398 
332.673 58.324 324.599 48.398 324.599 c 38.473 324.599 30.398 332.673 30.398
 342.599 c 30.398 352.525 38.473 360.599 48.398 360.599 c h
15.805 308.025 m 13.375 312.9 12 318.392 12 324.201 c 12 331.896 14.406
 339.037 18.5 344.923 c 18.438 344.154 18.398 343.38 18.398 342.599 c 18.398
 335.888 20.617 329.685 24.355 324.681 c 19.977 320.064 17.004 314.263 15.805
 308.025 c h
69.602 294.638 m 63.625 290.341 56.305 287.798 48.398 287.798 c 40.496 
287.798 33.176 290.341 27.199 294.638 c 27.199 301.798 l 27.199 307.388 
29.445 312.744 33.316 316.685 c 37.754 314.091 42.902 312.599 48.398 312.599
 c 53.898 312.599 59.047 314.091 63.484 316.685 c 67.359 312.744 69.602 
307.396 69.602 301.798 c h
80.996 308.029 m 79.797 314.267 76.824 320.064 72.445 324.677 c 76.184 
329.681 78.398 335.888 78.398 342.599 c 78.398 343.38 78.359 344.154 78.301
 344.923 c 82.395 339.037 84.801 331.896 84.801 324.201 c 84.801 318.392
 83.426 312.904 80.996 308.029 c h
109.602 252.888 m 109.602 254.935 111.266 256.599 113.312 256.599 c 295.488
 256.599 l 297.535 256.599 299.199 254.935 299.199 252.888 c 299.199 247.146
 l 109.602 247.146 l h
341.086 48.998 m 67.715 48.998 l 90.832 105.748 l 317.969 105.748 l h
313.082 117.748 m 95.719 117.748 l 107.633 146.998 l 223.223 146.998 l 
226.535 146.998 229.223 149.685 229.223 152.998 c 229.223 156.314 226.535
 158.998 223.223 158.998 c 109.602 158.998 l 109.602 235.146 l 299.199 235.146
 l 299.199 158.998 l 262.262 158.998 l 258.949 158.998 256.262 156.314 256.262
 152.998 c 256.262 149.685 258.949 146.998 262.262 146.998 c 301.164 146.998
 l h
361.199 360.599 m 371.125 360.599 379.199 352.525 379.199 342.599 c 379.199
 332.673 371.125 324.599 361.199 324.599 c 351.273 324.599 343.199 332.673
 343.199 342.599 c 343.199 352.525 351.273 360.599 361.199 360.599 c h
328.605 308.025 m 326.176 312.9 324.801 318.392 324.801 324.201 c 324.801
 331.896 327.207 339.037 331.297 344.923 c 331.238 344.154 331.199 343.38
 331.199 342.599 c 331.199 335.888 333.414 329.685 337.152 324.681 c 332.777
 320.064 329.805 314.263 328.605 308.025 c h
382.398 294.638 m 376.426 290.341 369.105 287.798 361.199 287.798 c 353.293
 287.798 345.977 290.341 340 294.638 c 340 301.798 l 340 307.388 342.246
 312.744 346.117 316.685 c 350.551 314.091 355.703 312.599 361.199 312.599
 c 366.695 312.599 371.848 314.091 376.281 316.685 c 380.156 312.744 382.398
 307.396 382.398 301.798 c h
393.797 308.029 m 392.598 314.267 389.625 320.064 385.246 324.677 c 388.984
 329.681 391.199 335.888 391.199 342.599 c 391.199 343.38 391.16 344.154
 391.102 344.923 c 395.191 339.037 397.602 331.896 397.602 324.201 c 397.602
 318.392 396.227 312.904 393.797 308.029 c h
393.797 308.029 m f
248.867 62.966 m 236.93 97.369 l 236.09 99.783 233.816 101.4 231.262 101.4
 c 177.539 101.4 l 174.984 101.4 172.711 99.783 171.871 97.369 c 159.934
 62.966 l 159.297 61.134 159.586 59.103 160.711 57.521 c 161.836 55.939 
163.66 55.002 165.602 55.002 c 243.199 55.002 l 245.141 55.002 246.965 55.939
 248.09 57.521 c 249.215 59.103 249.504 61.134 248.867 62.966 c h
174.035 66.998 m 181.809 89.4 l 226.992 89.4 l 234.766 66.998 l h
174.035 66.998 m f
205.199 166.201 m 222.184 166.201 236 180.017 236 196.998 c 236 213.982
 222.184 227.798 205.199 227.798 c 188.219 227.798 174.398 213.982 174.398
 196.998 c 174.398 180.013 188.219 166.201 205.199 166.201 c h
205.199 215.798 m 215.566 215.798 224 207.365 224 197.002 c 224 186.634
 215.566 178.201 205.199 178.201 c 194.832 178.201 186.398 186.634 186.398
 197.002 c 186.398 207.365 194.832 215.798 205.199 215.798 c h
205.199 215.798 m f
374.801 233.4 m 349.199 233.4 l 335.746 233.4 324.801 222.455 324.801 209.002
 c 324.801 195.545 335.746 184.599 349.199 184.599 c 351.18 184.599 l 355.562
 172.548 l 356.395 170.259 358.531 168.701 360.965 168.603 c 361.043 168.603
 361.125 168.599 361.199 168.599 c 363.547 168.599 365.688 169.97 366.66
 172.119 c 372.336 184.599 l 374.801 184.599 l 388.254 184.599 399.199 195.545
 399.199 209.002 c 399.199 222.455 388.254 233.4 374.801 233.4 c h
374.801 196.599 m 368.473 196.599 l 366.121 196.599 363.984 195.224 363.012
 193.084 c 361.816 190.459 l 361.02 192.65 l 360.16 195.021 357.906 196.599
 355.383 196.599 c 349.199 196.599 l 342.363 196.599 336.801 202.162 336.801
 208.998 c 336.801 215.837 342.363 221.4 349.199 221.4 c 374.801 221.4 l
 381.637 221.4 387.199 215.837 387.199 208.998 c 387.199 202.162 381.637
 196.599 374.801 196.599 c h
374.801 196.599 m f
61.199 123.798 m 74.656 123.798 85.602 134.744 85.602 148.201 c 85.602 
161.654 74.656 172.599 61.199 172.599 c 35.602 172.599 l 22.145 172.599 
11.199 161.654 11.199 148.201 c 11.199 134.744 22.145 123.798 35.602 123.798
 c 37.578 123.798 l 41.961 111.748 l 42.793 109.459 44.93 107.9 47.367 107.802
 c 47.445 107.802 47.523 107.798 47.602 107.798 c 49.945 107.798 52.086 
109.17 53.062 111.318 c 58.734 123.798 l h
49.41 132.283 m 48.219 129.658 l 47.422 131.849 l 46.559 134.22 44.305 
135.798 41.781 135.798 c 35.602 135.798 l 28.762 135.798 23.199 141.361 
23.199 148.201 c 23.199 155.037 28.762 160.599 35.602 160.599 c 61.199 160.599
 l 68.039 160.599 73.602 155.037 73.602 148.201 c 73.602 141.361 68.039 
135.798 61.199 135.798 c 54.871 135.798 l 52.52 135.798 50.383 134.423 49.41
 132.283 c h
49.41 132.283 m f
Q Q
showpage
%%Trailer
end restore
%%EOF
