%!PS-Adobe-3.0 EPSF-3.0
%%Creator: cairo 1.14.2 (http://cairographics.org)
%%CreationDate: Mon Feb 19 09:15:05 2018
%%Pages: 1
%%DocumentData: Clean7Bit
%%LanguageLevel: 2
%%BoundingBox: 0 32 410 377
%%EndComments
%%BeginProlog
save
50 dict begin
/q { gsave } bind def
/Q { grestore } bind def
/cm { 6 array astore concat } bind def
/w { setlinewidth } bind def
/J { setlinecap } bind def
/j { setlinejoin } bind def
/M { setmiterlimit } bind def
/d { setdash } bind def
/m { moveto } bind def
/l { lineto } bind def
/c { curveto } bind def
/h { closepath } bind def
/re { exch dup neg 3 1 roll 5 3 roll moveto 0 rlineto
      0 exch rlineto 0 rlineto closepath } bind def
/S { stroke } bind def
/f { fill } bind def
/f* { eofill } bind def
/n { newpath } bind def
/W { clip } bind def
/W* { eoclip } bind def
/BT { } bind def
/ET { } bind def
/pdfmark where { pop globaldict /?pdfmark /exec load put }
    { globaldict begin /?pdfmark /pop load def /pdfmark
    /cleartomark load def end } ifelse
/BDC { mark 3 1 roll /BDC pdfmark } bind def
/EMC { mark /EMC pdfmark } bind def
/cairo_store_point { /cairo_point_y exch def /cairo_point_x exch def } def
/Tj { show currentpoint cairo_store_point } bind def
/TJ {
  {
    dup
    type /stringtype eq
    { show } { -0.001 mul 0 cairo_font_matrix dtransform rmoveto } ifelse
  } forall
  currentpoint cairo_store_point
} bind def
/cairo_selectfont { cairo_font_matrix aload pop pop pop 0 0 6 array astore
    cairo_font exch selectfont cairo_point_x cairo_point_y moveto } bind def
/Tf { pop /cairo_font exch def /cairo_font_matrix where
      { pop cairo_selectfont } if } bind def
/Td { matrix translate cairo_font_matrix matrix concatmatrix dup
      /cairo_font_matrix exch def dup 4 get exch 5 get cairo_store_point
      /cairo_font where { pop cairo_selectfont } if } bind def
/Tm { 2 copy 8 2 roll 6 array astore /cairo_font_matrix exch def
      cairo_store_point /cairo_font where { pop cairo_selectfont } if } bind def
/g { setgray } bind def
/rg { setrgbcolor } bind def
/d1 { setcachedevice } bind def
%%EndProlog
%%BeginSetup
%%EndSetup
%%Page: 1 1
%%BeginPageSetup
%%PageBoundingBox: 0 32 410 377
%%EndPageSetup
q 0 32 410 345 rectclip q
0.909804 0.882353 0.839216 rg
128.211 39.104 m 126.027 39.104 123.941 39.795 122.18 41.104 c 72.07 78.424
 l 72.07 131.448 l 130.27 141.424 l 129.73 98.85 l 155.363 80.877 l 157.738
 79.209 159.285 76.604 159.602 73.721 c 159.922 70.834 158.984 67.952 157.027
 65.807 c 135.668 42.397 l 133.758 40.303 131.039 39.104 128.211 39.104 
c h
128.211 39.104 m f
0.886275 0.8 0.686275 rg
100.297 94.014 m 100.297 136.288 l 72.07 131.448 l 72.07 78.424 l 122.18
 41.104 l 123.941 39.795 126.027 39.104 128.211 39.104 c 131.039 39.104 
133.758 40.303 135.668 42.397 c 149.398 57.444 l h
100.297 94.014 m f
0.917647 0.231373 0.219608 rg
71.711 130.674 m 70.102 130.674 68.535 131.252 67.297 132.295 c 65.746 
133.608 64.863 135.514 64.863 137.534 c 64.863 211.955 l 99.906 211.955 
l 135.676 199.225 l 135.727 176.932 l 135.73 147.334 l 135.73 143.975 133.328
 141.131 130.02 140.573 c 72.945 130.788 l 72.539 130.713 72.125 130.674
 71.711 130.674 c h
71.711 130.674 m f
0.894118 0.00392157 0.211765 rg
92.223 137.534 m 92.223 211.955 l 64.863 211.955 l 64.863 137.534 l 64.863
 135.514 65.746 133.608 67.297 132.295 c 68.535 131.248 70.102 130.674 71.711
 130.674 c 72.125 130.674 72.539 130.713 72.945 130.788 c 93.078 134.241
 l 92.527 135.237 92.223 136.366 92.223 137.534 c h
92.223 137.534 m f
0.917647 0.231373 0.219608 rg
19.477 217.561 m 11.828 217.561 5.605 223.788 5.605 231.436 c 5.605 257.342
 l 5.605 264.991 11.828 271.213 19.477 271.213 c 33.633 271.213 l 33.633
 217.561 l h
19.477 217.561 m f
56.391 194.338 m 43.402 194.338 32.832 204.909 32.832 217.897 c 32.832 
270.815 l 32.832 283.87 43.402 294.436 56.391 294.436 c 100.176 294.436 
l 100.176 194.338 l h
56.391 194.338 m f
0.909804 0.882353 0.839216 rg
99.543 194.42 m 99.543 294.358 l 251.844 346.913 l 251.844 141.862 l h
99.543 194.42 m f
0.894118 0.00392157 0.211765 rg
5.633 257.889 m 5.625 257.705 5.605 257.526 5.605 257.342 c 5.605 231.432
 l 5.605 223.784 11.828 217.561 19.477 217.561 c 33.633 217.561 l 33.633
 244.565 l 19.477 244.565 l 12.012 244.569 5.926 250.498 5.633 257.889 c
 h
5.633 257.889 m f
32.832 244.905 m 32.832 217.897 l 32.832 204.909 43.402 194.338 56.391 
194.338 c 100.176 194.338 l 100.176 221.342 l 56.391 221.342 l 43.402 221.342
 32.832 231.913 32.832 244.905 c h
32.832 244.905 m f
0.886275 0.8 0.686275 rg
99.543 194.42 m 251.844 141.862 l 251.844 168.866 l 99.543 221.424 l h
99.543 194.42 m f
0.972549 0.807843 0.160784 rg
276.27 280.147 m 284.066 278.413 l 299.504 274.975 310.703 261.006 310.703
 245.19 c 310.703 243.588 l 310.703 227.772 299.5 213.799 284.066 210.366
 c 276.27 208.627 l h
276.27 280.147 m f
0.917647 0.231373 0.219608 rg
264.258 118.264 m 257.195 118.264 251.445 124.014 251.445 131.077 c 251.445
 357.698 l 251.445 364.764 257.195 370.51 264.258 370.51 c 271.324 370.51
 277.07 364.764 277.07 357.698 c 277.07 131.077 l 277.07 124.01 271.324 
118.264 264.258 118.264 c h
264.258 118.264 m f
0.894118 0.00392157 0.211765 rg
264.258 186.33 m 257.195 186.33 251.445 192.08 251.445 199.143 c 251.445
 131.077 l 251.445 124.014 257.195 118.264 264.258 118.264 c 271.324 118.264
 277.07 124.014 277.07 131.077 c 277.07 199.143 l 277.07 192.077 271.324
 186.33 264.258 186.33 c h
264.258 186.33 m f
0.764706 0.854902 0.25098 rg
336.355 129.479 m 325.359 129.479 l 318.824 129.479 313.508 134.799 313.508
 141.33 c 313.508 165.471 l 313.508 172.006 318.824 177.323 325.359 177.323
 c 372.125 177.323 l 378.66 177.323 383.977 172.002 383.977 165.471 c 383.977
 141.33 l 383.977 134.799 378.656 129.479 372.125 129.479 c 345.652 129.479
 l 341.004 124.311 l h
336.355 129.479 m f
1 0.384314 0.654902 rg
356.375 213.565 m 345.379 213.565 l 338.844 213.565 333.527 218.881 333.527
 225.413 c 333.527 249.553 l 333.527 256.088 338.844 261.405 345.379 261.405
 c 392.145 261.405 l 398.676 261.405 403.996 256.088 403.996 249.553 c 403.996
 225.413 l 403.996 218.881 398.676 213.565 392.145 213.565 c 365.668 213.565
 l 361.023 208.393 l h
356.375 213.565 m f
0.192157 0.823529 0.968627 rg
336.355 305.655 m 325.359 305.655 l 318.824 305.655 313.508 310.971 313.508
 317.502 c 313.508 341.643 l 313.508 348.178 318.824 353.495 325.359 353.495
 c 372.125 353.495 l 378.66 353.495 383.977 348.178 383.977 341.643 c 383.977
 317.506 l 383.977 310.971 378.656 305.655 372.125 305.655 c 345.652 305.655
 l 341.004 300.483 l h
336.355 305.655 m f
0.678431 0.737255 0.0823529 rg
331.391 131.202 m 331.391 155.342 l 331.391 161.877 336.707 167.194 343.242
 167.194 c 383.836 167.194 l 382.996 172.913 378.074 177.323 372.125 177.323
 c 325.359 177.323 l 318.824 177.323 313.508 172.002 313.508 165.471 c 313.508
 141.33 l 313.508 134.799 318.824 129.479 325.359 129.479 c 331.531 129.479
 l 331.449 130.045 331.391 130.616 331.391 131.202 c h
331.391 131.202 m f
0.988235 0.329412 0.47451 rg
351.41 215.288 m 351.41 239.424 l 351.41 245.959 356.727 251.276 363.262
 251.276 c 403.855 251.276 l 403.016 256.995 398.094 261.405 392.145 261.405
 c 345.379 261.405 l 338.844 261.405 333.527 256.088 333.527 249.553 c 333.527
 225.413 l 333.527 218.881 338.844 213.565 345.379 213.565 c 351.551 213.565
 l 351.469 214.127 351.41 214.698 351.41 215.288 c h
351.41 215.288 m f
0.0745098 0.67451 0.909804 rg
331.391 307.373 m 331.391 331.514 l 331.391 338.049 336.707 343.366 343.242
 343.366 c 383.836 343.366 l 382.996 349.084 378.074 353.495 372.125 353.495
 c 325.359 353.495 l 318.824 353.495 313.508 348.178 313.508 341.643 c 313.508
 317.502 l 313.508 310.971 318.824 305.655 325.359 305.655 c 331.531 305.655
 l 331.449 306.217 331.391 306.788 331.391 307.373 c h
331.391 307.373 m f
0 g
325.359 300.045 m 330.527 300.045 l 330.527 295.038 l 330.527 292.495 332.129
 290.225 334.527 289.377 c 335.184 289.143 335.863 289.03 336.531 289.03
 c 338.309 289.03 340.035 289.819 341.199 291.252 c 348.332 300.045 l 372.125
 300.045 l 381.75 300.045 389.578 307.877 389.578 317.502 c 389.578 341.643
 l 389.578 351.268 381.75 359.1 372.125 359.1 c 325.359 359.1 l 315.73 359.1
 307.902 351.268 307.902 341.643 c 307.902 317.506 l 307.902 307.877 315.73
 300.045 325.359 300.045 c h
319.914 341.643 m 319.914 344.647 322.355 347.088 325.359 347.088 c 372.125
 347.088 l 375.125 347.088 377.57 344.647 377.57 341.643 c 377.57 317.506
 l 377.57 314.502 375.125 312.061 372.125 312.061 c 345.473 312.061 l 343.762
 312.061 342.137 311.33 341.004 310.069 c 339.902 311.291 338.309 312.061
 336.535 312.061 c 325.359 312.061 l 322.355 312.061 319.914 314.502 319.914
 317.506 c h
319.914 341.643 m f
392.145 267.01 m 345.379 267.01 l 335.75 267.01 327.922 259.178 327.922
 249.553 c 327.922 225.416 l 327.922 215.788 335.754 207.959 345.379 207.959
 c 350.547 207.959 l 350.547 202.948 l 350.547 200.405 352.148 198.139 354.547
 197.288 c 355.203 197.057 355.883 196.944 356.555 196.944 c 358.328 196.944
 360.055 197.733 361.219 199.166 c 368.352 207.959 l 392.145 207.959 l 401.77
 207.959 409.602 215.791 409.602 225.416 c 409.602 249.553 l 409.602 259.178
 401.77 267.01 392.145 267.01 c h
397.59 225.413 m 397.59 222.413 395.145 219.967 392.141 219.967 c 365.488
 219.967 l 363.781 219.967 362.156 219.241 361.023 217.975 c 359.922 219.198
 358.328 219.967 356.555 219.967 c 345.375 219.967 l 342.375 219.967 339.93
 222.413 339.93 225.413 c 339.93 249.553 l 339.93 252.557 342.375 254.998
 345.375 254.998 c 392.141 254.998 l 395.145 254.998 397.59 252.557 397.59
 249.553 c h
397.59 225.413 m f
372.125 182.928 m 325.359 182.928 l 315.73 182.928 307.902 175.096 307.902
 165.471 c 307.902 141.334 l 307.902 131.705 315.73 123.877 325.359 123.877
 c 330.527 123.877 l 330.527 118.866 l 330.527 116.323 332.129 114.057 334.527
 113.205 c 335.184 112.971 335.863 112.862 336.531 112.862 c 338.309 112.862
 340.035 113.647 341.199 115.08 c 348.332 123.877 l 372.125 123.877 l 381.75
 123.877 389.578 131.705 389.578 141.334 c 389.578 165.471 l 389.582 175.096
 381.75 182.928 372.125 182.928 c h
377.57 141.334 m 377.57 138.33 375.125 135.889 372.125 135.889 c 345.469
 135.889 l 343.762 135.889 342.137 135.159 341.004 133.897 c 339.902 135.12
 338.309 135.889 336.535 135.889 c 325.359 135.889 l 322.355 135.889 319.91
 138.33 319.91 141.334 c 319.91 165.471 l 319.91 168.475 322.355 170.916
 325.359 170.916 c 372.125 170.916 l 375.125 170.916 377.57 168.475 377.57
 165.471 c h
377.57 141.334 m f
282.676 284.373 m 282.676 357.698 l 282.676 367.854 274.414 376.116 264.258
 376.116 c 254.102 376.116 245.84 367.854 245.84 357.698 c 245.84 350.772
 l 98.832 300.041 l 56.391 300.041 l 42.344 300.041 30.59 290.061 27.836
 276.823 c 19.477 276.823 l 8.738 276.819 0 268.08 0 257.342 c 0 231.432
 l 0 220.694 8.738 211.955 19.477 211.955 c 27.836 211.955 l 30.59 198.713
 42.344 188.733 56.391 188.733 c 59.258 188.733 l 59.258 137.534 l 59.258
 133.854 60.871 130.377 63.688 128.006 c 64.539 127.288 65.477 126.694 66.465
 126.233 c 66.465 78.623 l 66.465 76.729 67.359 74.94 68.883 73.807 c 118.832
 36.608 l 121.652 34.506 124.941 33.483 128.215 33.483 c 132.484 33.483 
136.715 35.229 139.809 38.62 c 161.164 62.03 l 164.207 65.362 165.668 69.846
 165.172 74.33 c 164.676 78.819 162.273 82.873 158.582 85.467 c 135.371 
101.741 l 135.816 136.983 l 139.18 139.233 141.336 143.053 141.336 147.33
 c 141.336 174.065 l 245.84 138.002 l 245.84 131.077 l 245.84 120.92 254.102
 112.659 264.258 112.659 c 274.414 112.659 282.676 120.92 282.676 131.077
 c 282.676 204.405 l 301.691 207.307 316.309 223.772 316.309 243.588 c 316.309
 245.19 l 316.309 265.002 301.691 281.471 282.676 284.373 c h
27.227 223.967 m 19.477 223.967 l 15.359 223.967 12.012 227.319 12.012 
231.432 c 12.012 257.342 l 12.012 261.459 15.363 264.807 19.477 264.807 
c 27.227 264.807 l h
71.43 137.19 m 71.27 137.327 71.27 137.479 71.27 137.534 c 71.27 188.733
 l 98.832 188.733 l 129.441 178.17 l 129.367 177.795 129.328 177.405 129.328
 177.006 c 129.328 147.334 l 129.328 147.112 129.168 146.924 128.953 146.889
 c 71.797 137.088 l 71.742 137.077 71.59 137.053 71.43 137.19 c h
151.688 75.631 m 152.875 74.799 153.168 73.635 153.234 73.014 c 153.305
 72.397 153.273 71.198 152.293 70.127 c 130.934 46.713 l 129.652 45.307 
127.535 45.108 126.008 46.241 c 78.477 81.639 l 78.477 126.045 l 123.766
 133.811 l 123.32 98.721 l 123.297 96.737 124.254 94.866 125.879 93.729 
c h
245.441 150.85 m 105.949 198.987 l 105.949 215.155 l 105.949 218.518 103.223
 221.245 99.859 221.245 c 96.496 221.245 93.773 218.518 93.773 215.155 c
 93.773 200.745 l 56.391 200.745 l 46.918 200.745 39.238 208.424 39.238 
217.897 c 39.238 270.877 l 39.238 280.35 46.918 288.03 56.391 288.03 c 93.77
 288.03 l 93.77 254.401 l 93.77 251.038 96.496 248.311 99.859 248.311 c 
103.223 248.311 105.945 251.038 105.945 254.401 c 105.945 289.791 l 245.441
 337.928 l h
270.664 131.077 m 270.664 127.545 267.789 124.67 264.258 124.67 c 260.727
 124.67 257.852 127.545 257.852 131.077 c 257.852 357.698 l 257.852 361.233
 260.727 364.104 264.258 364.104 c 267.789 364.104 270.664 361.233 270.664
 357.698 c h
304.297 243.588 m 304.297 230.416 295.031 219.366 282.676 216.62 c 282.676
 272.159 l 295.031 269.409 304.297 258.362 304.297 245.19 c h
304.297 243.588 m f
Q Q
showpage
%%Trailer
end restore
%%EOF
