%!PS-Adobe-3.0 EPSF-3.0
%%Creator: cairo 1.14.2 (http://cairographics.org)
%%CreationDate: Mon Feb 19 09:15:05 2018
%%Pages: 1
%%DocumentData: Clean7Bit
%%LanguageLevel: 2
%%BoundingBox: 0 20 410 390
%%EndComments
%%BeginProlog
save
50 dict begin
/q { gsave } bind def
/Q { grestore } bind def
/cm { 6 array astore concat } bind def
/w { setlinewidth } bind def
/J { setlinecap } bind def
/j { setlinejoin } bind def
/M { setmiterlimit } bind def
/d { setdash } bind def
/m { moveto } bind def
/l { lineto } bind def
/c { curveto } bind def
/h { closepath } bind def
/re { exch dup neg 3 1 roll 5 3 roll moveto 0 rlineto
      0 exch rlineto 0 rlineto closepath } bind def
/S { stroke } bind def
/f { fill } bind def
/f* { eofill } bind def
/n { newpath } bind def
/W { clip } bind def
/W* { eoclip } bind def
/BT { } bind def
/ET { } bind def
/pdfmark where { pop globaldict /?pdfmark /exec load put }
    { globaldict begin /?pdfmark /pop load def /pdfmark
    /cleartomark load def end } ifelse
/BDC { mark 3 1 roll /BDC pdfmark } bind def
/EMC { mark /EMC pdfmark } bind def
/cairo_store_point { /cairo_point_y exch def /cairo_point_x exch def } def
/Tj { show currentpoint cairo_store_point } bind def
/TJ {
  {
    dup
    type /stringtype eq
    { show } { -0.001 mul 0 cairo_font_matrix dtransform rmoveto } ifelse
  } forall
  currentpoint cairo_store_point
} bind def
/cairo_selectfont { cairo_font_matrix aload pop pop pop 0 0 6 array astore
    cairo_font exch selectfont cairo_point_x cairo_point_y moveto } bind def
/Tf { pop /cairo_font exch def /cairo_font_matrix where
      { pop cairo_selectfont } if } bind def
/Td { matrix translate cairo_font_matrix matrix concatmatrix dup
      /cairo_font_matrix exch def dup 4 get exch 5 get cairo_store_point
      /cairo_font where { pop cairo_selectfont } if } bind def
/Tm { 2 copy 8 2 roll 6 array astore /cairo_font_matrix exch def
      cairo_store_point /cairo_font where { pop cairo_selectfont } if } bind def
/g { setgray } bind def
/rg { setrgbcolor } bind def
/d1 { setcachedevice } bind def
%%EndProlog
%%BeginSetup
%%EndSetup
%%Page: 1 1
%%BeginPageSetup
%%PageBoundingBox: 0 20 410 390
%%EndPageSetup
q 0 20 410 370 rectclip q
0.247059 0.152941 0.145098 rg
187.121 209.975 m 187.121 248.475 l 187.141 248.823 l 187.125 249.17 l 
186.07 270.6 177.121 290.795 161.922 306.038 c 145.531 322.483 123.715 331.538
 100.496 331.538 c 52.672 331.538 13.762 292.631 13.762 244.803 c 13.762
 209.491 l 13.73 171.561 l 13.73 136.092 l 13.73 111.444 26.828 88.205 47.914
 75.444 c 51.094 73.522 l 150.773 73.522 l 153.953 75.444 l 175.039 88.205
 188.137 111.444 188.137 136.092 c 188.137 171.561 l h
187.121 209.975 m f
0.227451 0.117647 0.109804 rg
80.168 209.655 m 80.168 245.799 l 80.168 281.182 100.977 311.791 130.996
 326.045 c 121.375 329.651 111.082 331.541 100.496 331.541 c 52.672 331.541
 13.762 292.631 13.762 244.807 c 13.762 209.495 l 13.73 171.561 l 13.73 
136.096 l 13.73 111.448 26.828 88.205 47.914 75.448 c 51.094 73.522 l 113.422
 73.522 l 92.84 86.784 80.137 109.971 80.137 134.53 c 80.137 170.83 l h
80.168 209.655 m f
0.858824 0.682353 0.431373 rg
24.836 168.955 m 14.23 168.955 5.605 177.58 5.605 188.186 c 5.605 192.846
 l 5.605 203.448 14.23 212.073 24.836 212.073 c 33.375 212.073 l 33.375 
168.955 l h
24.836 168.955 m f
168.496 168.955 m 168.496 212.073 l 177.035 212.073 l 187.641 212.073 196.266
 203.448 196.266 192.842 c 196.266 188.186 l 196.266 177.58 187.641 168.955
 177.035 168.955 c h
168.496 168.955 m f
1 0.384314 0.654902 rg
131.754 80.213 m 70.117 80.213 l 51.703 80.213 36.723 65.233 36.723 46.823
 c 36.723 34.241 l 36.723 29.928 40.23 26.42 44.543 26.42 c 157.324 26.42
 l 161.637 26.42 165.148 29.928 165.148 34.241 c 165.148 46.823 l 165.148
 65.233 150.168 80.213 131.754 80.213 c h
131.754 80.213 m f
0.988235 0.329412 0.47451 rg
117.566 80.213 m 70.117 80.213 l 51.672 80.213 36.723 65.264 36.723 46.819
 c 36.723 34.241 l 36.723 29.92 40.227 26.42 44.543 26.42 c 90.188 26.42
 l 85.875 26.42 82.367 29.928 82.367 34.241 c 82.367 46.881 l 82.371 49.373
 85.09 50.955 87.273 49.756 c 91.633 47.362 96.68 46.073 102.039 46.28 c
 117.418 46.866 129.414 59.881 129.414 75.272 c 129.414 80.213 l h
117.566 80.213 m f
0.980392 0.827451 0.576471 rg
100.934 69.248 m 90.695 69.248 82.367 77.577 82.367 87.819 c 82.367 122.405
 l 89.824 121.163 l 93.492 120.553 97.23 120.245 100.938 120.245 c 104.641
 120.245 108.379 120.553 112.047 121.163 c 119.504 122.405 l 119.504 87.819
 l 119.504 77.577 111.172 69.248 100.934 69.248 c h
100.934 69.248 m f
0.929412 0.717647 0.411765 rg
99.586 87.819 m 99.586 120.272 l 96.324 120.338 93.047 120.627 89.82 121.163
 c 82.367 122.405 l 82.367 87.819 l 82.367 77.577 90.695 69.248 100.934 
69.248 c 104.039 69.248 106.969 70.018 109.543 71.373 c 103.629 74.483 99.586
 80.686 99.586 87.819 c h
99.586 87.819 m f
0.980392 0.827451 0.576471 rg
100.262 105.346 m 62.625 105.709 32.574 136.94 32.574 174.577 c 32.574 
249.483 l 32.574 252.834 36.594 254.541 39.004 252.213 c 43.43 247.936 l
 45.305 246.123 47.438 244.397 49.77 242.815 c 60.453 235.541 74.66 231.538
 89.777 231.538 c 113.719 231.538 135.766 242.338 143.395 257.803 c 143.973
 258.975 l 145.059 261.174 147.598 262.233 149.922 261.459 c 151.16 261.045
 l 153.832 260.159 156.609 259.709 159.422 259.709 c 160.309 259.709 161.254
 259.76 162.223 259.862 c 165.105 260.166 l 167.344 260.401 169.297 258.643
 169.297 256.393 c 169.297 173.705 l 169.297 135.788 138.262 104.979 100.262
 105.346 c h
100.262 105.346 m f
0.929412 0.717647 0.411765 rg
165.105 260.163 m 162.223 259.862 l 161.254 259.76 160.312 259.709 159.422
 259.709 c 156.609 259.709 153.832 260.159 151.164 261.045 c 149.926 261.459
 l 148 262.1 145.941 261.467 144.672 259.991 c 144.219 259.112 143.727 258.248
 143.188 257.401 c 135.371 242.155 113.508 231.538 89.777 231.538 c 74.66
 231.538 60.453 235.541 49.77 242.811 c 47.441 244.397 45.309 246.123 43.43
 247.936 c 39.004 252.213 l 36.598 254.538 32.574 252.834 32.574 249.483
 c 32.574 174.577 l 32.574 136.94 62.629 105.709 100.262 105.342 c 108.793
 105.26 116.973 106.752 124.527 109.541 c 100.605 121.151 84.168 145.94 
84.168 174.252 c 84.168 202.127 l 84.168 204.967 86.488 207.229 89.328 207.229
 c 89.379 207.229 l 114.18 207.229 137.023 218.42 144.926 234.44 c 145.527
 235.655 l 146.648 237.928 149.281 239.026 151.688 238.225 c 152.973 237.799
 l 155.738 236.877 158.617 236.413 161.527 236.413 c 162.449 236.413 163.426
 236.467 164.43 236.569 c 167.418 236.885 l 168.086 236.955 168.723 236.85
 169.301 236.616 c 169.301 256.389 l 169.297 258.643 167.348 260.397 165.105
 260.163 c h
165.105 260.163 m f
1 0.811765 0.34902 rg
264.492 67.725 m 249.094 67.725 236.613 80.209 236.613 95.604 c 236.613
 123.12 l 219.746 141.221 l 217.559 143.565 219.223 147.389 222.43 147.389
 c 236.613 147.389 l 236.613 153.526 l 236.613 168.924 249.098 181.405 264.492
 181.405 c 376.711 181.405 l 392.109 181.405 404.59 168.924 404.59 153.526
 c 404.59 95.604 l 404.59 80.209 392.105 67.725 376.711 67.725 c h
264.492 67.725 m f
0.976471 0.631373 0.254902 rg
307.891 95.604 m 307.891 123.12 l 291.02 141.221 l 288.836 143.565 290.5
 147.389 293.703 147.389 c 307.891 147.389 l 307.891 153.526 l 307.891 168.924
 320.371 181.405 335.766 181.405 c 264.492 181.405 l 249.094 181.405 236.613
 168.924 236.613 153.526 c 236.613 147.389 l 222.43 147.389 l 219.223 147.389
 217.559 143.565 219.746 141.221 c 236.613 123.12 l 236.613 95.604 l 236.613
 80.209 249.098 67.729 264.492 67.729 c 335.766 67.729 l 320.371 67.725 
307.891 80.209 307.891 95.604 c h
307.891 95.604 m f
0.909804 0.882353 0.839216 rg
374.867 88.475 m 266.34 88.475 l 261.875 88.475 258.258 92.092 258.258 
96.553 c 258.258 152.702 l 258.258 157.166 261.875 160.784 266.34 160.784
 c 374.867 160.784 l 379.328 160.784 382.945 157.166 382.945 152.702 c 382.945
 96.553 l 382.945 92.092 379.328 88.475 374.867 88.475 c h
374.867 88.475 m f
1 0.811765 0.34902 rg
276.98 269.502 m 264.492 269.502 l 249.098 269.502 236.613 281.983 236.613
 297.377 c 236.613 355.303 l 236.613 370.698 249.098 383.178 264.492 383.178
 c 376.711 383.178 l 392.109 383.178 404.59 370.698 404.59 355.303 c 404.59
 297.377 l 404.59 281.983 392.105 269.502 376.711 269.502 c 299.016 269.502
 l 283.496 250.373 l 281.32 247.69 276.977 249.229 276.977 252.686 c 276.977
 269.502 l h
276.98 269.502 m f
0.976471 0.631373 0.254902 rg
307.891 297.377 m 307.891 355.303 l 307.891 370.698 320.371 383.178 335.766
 383.178 c 264.492 383.178 l 249.094 383.178 236.613 370.698 236.613 355.303
 c 236.613 297.377 l 236.613 281.983 249.098 269.502 264.492 269.502 c 276.98
 269.502 l 276.98 252.686 l 276.98 249.229 281.32 247.69 283.496 250.373
 c 299.016 269.502 l 335.77 269.502 l 320.371 269.502 307.891 281.983 307.891
 297.377 c h
307.891 297.377 m f
0.909804 0.882353 0.839216 rg
374.867 290.979 m 266.34 290.979 l 261.875 290.979 258.258 294.6 258.258
 299.061 c 258.258 355.209 l 258.258 359.67 261.875 363.291 266.34 363.291
 c 374.867 363.291 l 379.328 363.291 382.945 359.67 382.945 355.209 c 382.945
 299.061 l 382.945 294.596 379.328 290.979 374.867 290.979 c h
374.867 290.979 m f
0.980392 0.827451 0.576471 rg
320.602 321.932 m 309.344 321.932 300.184 331.088 300.184 342.346 c 300.184
 353.608 309.344 362.764 320.602 362.764 c 331.859 362.764 341.02 353.608
 341.02 342.346 c 341.02 331.088 331.859 321.932 320.602 321.932 c h
320.602 321.932 m f
0.192157 0.823529 0.968627 rg
287.895 291.506 m 289.922 299.487 l 293.395 313.174 305.68 322.733 319.801
 322.733 c 321.402 322.733 l 335.523 322.733 347.812 313.174 351.285 299.487
 c 353.309 291.506 l h
287.895 291.506 m f
0.980392 0.827451 0.576471 rg
320.602 119.362 m 309.344 119.362 300.184 128.522 300.184 139.78 c 300.184
 151.038 309.344 160.198 320.602 160.198 c 331.859 160.198 341.02 151.038
 341.02 139.78 c 341.02 128.522 331.859 119.362 320.602 119.362 c h
320.602 119.362 m f
1 0.384314 0.654902 rg
287.895 88.94 m 289.922 96.92 l 293.395 110.604 305.68 120.163 319.801 
120.163 c 321.402 120.163 l 335.523 120.163 347.812 110.604 351.285 96.92
 c 353.309 88.94 l h
287.895 88.94 m f
0.929412 0.717647 0.411765 rg
322.859 342.346 m 322.859 349.413 326.469 355.651 331.938 359.319 c 328.695
 361.491 324.793 362.764 320.602 362.764 c 309.344 362.764 300.188 353.604
 300.188 342.346 c 300.188 331.088 309.344 321.928 320.602 321.928 c 324.793
 321.928 328.695 323.202 331.938 325.377 c 326.469 329.045 322.859 335.284
 322.859 342.346 c h
322.859 342.346 m f
0.0745098 0.67451 0.909804 rg
331.938 320.877 m 328.633 322.077 325.082 322.733 321.402 322.733 c 319.801
 322.733 l 305.68 322.733 293.391 313.174 289.922 299.487 c 287.895 291.506
 l 310.57 291.506 l 312.594 299.487 l 315.164 309.608 322.555 317.467 331.938
 320.877 c h
331.938 320.877 m f
0.929412 0.717647 0.411765 rg
322.859 139.78 m 322.859 146.846 326.469 153.08 331.938 156.748 c 328.695
 158.924 324.793 160.194 320.602 160.194 c 309.344 160.194 300.188 151.038
 300.188 139.78 c 300.188 128.522 309.344 119.362 320.602 119.362 c 324.793
 119.362 328.695 120.631 331.938 122.807 c 326.469 126.475 322.859 132.713
 322.859 139.78 c h
322.859 139.78 m f
0.988235 0.329412 0.47451 rg
331.938 118.307 m 328.633 119.506 325.082 120.163 321.402 120.163 c 319.801
 120.163 l 305.68 120.163 293.391 110.604 289.922 96.92 c 287.895 88.936
 l 310.57 88.936 l 312.594 96.92 l 315.164 107.038 322.555 114.897 331.938
 118.307 c h
331.938 118.307 m f
0 g
192.734 212.073 m 192.832 243.463 l 192.91 268.28 183.461 292.338 165.957
 309.932 c 148.605 327.373 125.531 337.026 100.953 337.143 c 49.605 337.389
 8.156 295.084 8.156 243.737 c 8.156 211.842 l 8.156 211.643 8.168 211.448
 8.188 211.256 c 3.16 206.709 0 200.139 0 192.846 c 0 188.186 l 0 180.92
 3.137 174.373 8.125 169.83 c 8.125 136.092 l 8.125 110.713 20.652 87.225
 41.281 73.053 c 34.969 66.12 31.117 56.913 31.117 46.823 c 31.117 34.241
 l 31.117 26.827 37.129 20.815 44.543 20.815 c 62.254 20.815 l 65.566 20.815
 68.258 23.506 68.258 26.823 c 68.258 30.135 65.566 32.827 62.254 32.827
 c 44.543 32.827 l 43.762 32.827 43.129 33.459 43.129 34.241 c 43.129 46.823
 l 43.129 61.729 55.211 73.811 70.113 73.811 c 80.906 73.811 l 85.254 67.385
 92.609 63.155 100.934 63.155 c 109.262 63.155 116.617 67.385 120.965 73.811
 c 131.754 73.811 l 146.66 73.811 158.742 61.729 158.742 46.823 c 158.742
 34.241 l 158.742 33.459 158.109 32.827 157.324 32.827 c 101.324 32.827 
l 98.008 32.827 95.32 30.135 95.32 26.823 c 95.32 23.506 98.008 20.815 101.324
 20.815 c 157.324 20.815 l 164.742 20.815 170.754 26.827 170.754 34.241 
c 170.754 46.823 l 170.754 56.913 166.898 66.12 160.59 73.053 c 181.219 
87.225 193.746 110.713 193.746 136.092 c 193.746 169.83 l 198.734 174.373
 201.871 180.92 201.871 188.186 c 201.871 192.846 l 201.871 200.588 198.305
 207.514 192.734 212.073 c h
20.168 244.803 m 20.168 289.096 56.203 325.135 100.496 325.135 c 122 325.135
 142.203 316.745 157.387 301.518 c 171.551 287.307 179.746 268.745 180.727
 248.854 c 180.719 248.737 180.715 248.616 180.715 248.495 c 180.715 217.405
 l 179.516 217.584 178.285 217.678 177.035 217.678 c 174.902 217.678 l 174.902
 260.616 l 174.902 260.663 174.895 260.709 174.895 260.76 c 174.934 261.565
 174.812 262.393 174.504 263.194 c 173.32 266.291 169.848 267.838 166.75
 266.651 c 164.43 265.764 161.965 265.311 159.422 265.311 c 156.523 265.311
 153.684 265.924 151.105 267.077 c 150.289 268.389 148.969 269.389 147.34
 269.76 c 144.109 270.495 140.887 268.475 140.152 265.241 c 140.07 264.889
 139.984 264.538 139.887 264.194 c 135.57 248.772 114.027 237.143 89.777
 237.143 c 75.773 237.143 62.688 240.799 52.926 247.444 c 43.961 253.545
 38.984 261.413 38.887 269.62 c 38.887 269.901 l 38.867 273.205 36.184 275.873
 32.879 275.873 c 32.863 275.873 l 29.555 275.862 26.875 273.178 26.875 
269.866 c 26.875 269.748 26.875 269.627 26.875 269.506 c 26.969 253.58 l
 26.969 217.678 l 24.832 217.678 l 23.238 217.678 21.68 217.522 20.164 217.233
 c 20.164 244.803 l h
12.008 188.186 m 12.008 192.846 l 12.008 199.916 17.762 205.67 24.836 205.67
 c 26.969 205.67 l 26.969 175.362 l 24.836 175.362 l 17.762 175.362 12.008
 181.112 12.008 188.186 c h
70.117 85.819 m 63.27 85.819 56.832 84.038 51.23 80.924 c 31.977 92.577
 20.137 113.44 20.137 136.092 c 20.137 163.803 l 21.66 163.51 23.227 163.35
 24.836 163.35 c 27.695 163.35 l 31.602 135.6 50.961 112.745 76.762 103.799
 c 76.762 87.327 l 76.762 86.819 76.781 86.319 76.812 85.819 c h
113.098 87.327 m 113.098 80.62 107.645 75.163 100.938 75.163 c 94.23 75.163
 88.773 80.62 88.773 87.327 c 88.773 100.745 l 92.73 100.084 96.793 99.737
 100.938 99.737 c 105.078 99.737 109.141 100.084 113.098 100.745 c h
100.934 111.748 m 66.773 111.748 38.977 139.541 38.977 173.705 c 38.977
 243.33 l 41.109 241.268 43.512 239.323 46.168 237.518 c 57.898 229.53 73.387
 225.131 89.777 225.131 c 116.738 225.131 140.457 237.362 149.141 254.967
 c 152.43 253.873 155.906 253.299 159.422 253.299 c 160.59 253.299 161.746
 253.37 162.891 253.491 c 162.891 173.705 l 162.895 139.541 135.098 111.748
 100.934 111.748 c h
181.734 136.092 m 181.734 113.44 169.891 92.577 150.641 80.924 c 145.039
 84.038 138.602 85.819 131.754 85.819 c 125.055 85.819 l 125.086 86.319 
125.109 86.819 125.109 87.327 c 125.109 103.799 l 150.91 112.748 170.27 
135.6 174.172 163.354 c 177.035 163.354 l 178.641 163.354 180.211 163.51
 181.734 163.803 c h
189.859 188.186 m 189.859 181.112 184.105 175.362 177.035 175.362 c 174.902
 175.362 l 174.902 205.666 l 177.035 205.666 l 184.105 205.666 189.859 199.913
 189.859 192.842 c h
189.859 188.186 m f
376.117 388.784 m 263.898 388.784 l 245.434 388.784 230.414 373.764 230.414
 355.303 c 230.414 297.377 l 230.414 278.916 245.434 263.897 263.898 263.897
 c 270.781 263.897 l 270.781 243.467 l 270.781 240.924 272.383 238.659 274.777
 237.807 c 275.434 237.577 276.113 237.463 276.781 237.463 c 278.559 237.463
 280.285 238.252 281.449 239.682 c 301.094 263.897 l 376.117 263.897 l 394.578
 263.897 409.598 278.916 409.598 297.377 c 409.598 355.303 l 409.602 373.764
 394.578 388.784 376.117 388.784 c h
397.59 297.377 m 397.59 285.538 387.957 275.905 376.117 275.905 c 298.23
 275.905 l 296.422 275.905 294.707 275.088 293.57 273.686 c 282.793 260.401
 l 282.793 269.901 l 282.793 273.221 280.102 275.909 276.785 275.909 c 263.898
 275.909 l 252.059 275.909 242.426 285.541 242.426 297.381 c 242.426 355.303
 l 242.426 367.143 252.059 376.776 263.898 376.776 c 376.117 376.776 l 387.957
 376.776 397.59 367.143 397.59 355.303 c h
397.59 297.377 m f
377.297 368.37 m 262.719 368.37 l 257.004 368.37 252.355 363.721 252.355
 358.006 c 252.355 296.268 l 252.355 290.553 257.004 285.905 262.719 285.905
 c 377.297 285.905 l 383.012 285.905 387.66 290.553 387.66 296.268 c 387.66
 358.006 l 387.664 363.721 383.012 368.37 377.297 368.37 c h
320.008 356.358 m 327.734 356.358 334.02 350.073 334.02 342.346 c 334.02
 334.623 327.734 328.334 320.008 328.334 c 312.281 328.334 305.996 334.623
 305.996 342.346 c 305.996 350.073 312.281 356.358 320.008 356.358 c h
283.281 297.913 m 264.363 297.913 l 264.363 356.358 l 298.098 356.358 l
 295.5 352.311 293.988 347.502 293.988 342.346 c 293.988 335.12 296.949 
328.573 301.723 323.854 c 292.121 318.58 285.145 309.1 283.281 297.913 c
 h
295.535 297.913 m 298.219 308.483 307.812 316.327 319.207 316.327 c 320.809
 316.327 l 332.203 316.327 341.801 308.483 344.48 297.913 c h
375.652 297.913 m 356.734 297.913 l 354.871 309.1 347.895 318.58 338.293
 323.858 c 343.066 328.577 346.027 335.12 346.027 342.346 c 346.027 347.502
 344.516 352.311 341.918 356.358 c 375.652 356.358 l h
375.652 297.913 m f
377.297 165.807 m 262.719 165.807 l 257.004 165.807 252.355 161.155 252.355
 155.444 c 252.355 93.702 l 252.355 87.991 257.004 83.342 262.719 83.342
 c 377.297 83.342 l 383.012 83.342 387.66 87.991 387.66 93.702 c 387.66 
155.444 l 387.664 161.159 383.012 165.807 377.297 165.807 c h
320.008 153.795 m 327.734 153.795 334.02 147.51 334.02 139.784 c 334.02
 132.061 327.734 125.772 320.008 125.772 c 312.281 125.772 305.996 132.061
 305.996 139.784 c 305.996 147.51 312.281 153.795 320.008 153.795 c h
283.281 95.35 m 264.363 95.35 l 264.363 153.795 l 298.098 153.795 l 295.5
 149.748 293.988 144.94 293.988 139.784 c 293.988 132.557 296.949 126.01
 301.723 121.291 c 292.121 116.018 285.145 106.538 283.281 95.35 c h
295.535 95.35 m 298.219 105.92 307.812 113.764 319.207 113.764 c 320.809
 113.764 l 332.203 113.764 341.801 105.92 344.48 95.35 c h
375.652 95.35 m 356.734 95.35 l 354.871 106.538 347.895 116.014 338.293
 121.291 c 343.066 126.014 346.027 132.557 346.027 139.784 c 346.027 144.94
 344.516 149.748 341.918 153.795 c 375.652 153.795 l h
375.652 95.35 m f
376.117 187.01 m 263.898 187.01 l 245.434 187.01 230.414 171.991 230.414
 153.53 c 230.414 152.995 l 214.324 152.995 l 211.934 152.995 209.77 151.577
 208.816 149.385 c 207.863 147.194 208.301 144.643 209.93 142.897 c 230.414
 120.913 l 230.414 95.604 l 230.414 77.143 245.438 62.123 263.898 62.123
 c 376.117 62.123 l 394.578 62.123 409.602 77.143 409.602 95.604 c 409.602
 153.53 l 409.602 171.991 394.578 187.01 376.117 187.01 c h
397.59 95.604 m 397.59 83.764 387.957 74.131 376.117 74.131 c 263.898 74.131
 l 252.059 74.131 242.426 83.764 242.426 95.604 c 242.426 123.276 l 242.426
 124.795 241.848 126.26 240.812 127.37 c 228.125 140.987 l 236.418 140.987
 l 239.734 140.987 242.426 143.674 242.426 146.991 c 242.426 153.53 l 242.426
 165.37 252.059 175.002 263.898 175.002 c 376.117 175.002 l 387.957 175.002
 397.59 165.37 397.59 153.53 c h
397.59 95.604 m f
Q Q
showpage
%%Trailer
end restore
%%EOF
