%!PS-Adobe-3.0 EPSF-3.0
%%Creator: cairo 1.14.2 (http://cairographics.org)
%%CreationDate: Mon Feb 19 09:15:05 2018
%%Pages: 1
%%DocumentData: Clean7Bit
%%LanguageLevel: 2
%%BoundingBox: 0 103 410 306
%%EndComments
%%BeginProlog
save
50 dict begin
/q { gsave } bind def
/Q { grestore } bind def
/cm { 6 array astore concat } bind def
/w { setlinewidth } bind def
/J { setlinecap } bind def
/j { setlinejoin } bind def
/M { setmiterlimit } bind def
/d { setdash } bind def
/m { moveto } bind def
/l { lineto } bind def
/c { curveto } bind def
/h { closepath } bind def
/re { exch dup neg 3 1 roll 5 3 roll moveto 0 rlineto
      0 exch rlineto 0 rlineto closepath } bind def
/S { stroke } bind def
/f { fill } bind def
/f* { eofill } bind def
/n { newpath } bind def
/W { clip } bind def
/W* { eoclip } bind def
/BT { } bind def
/ET { } bind def
/pdfmark where { pop globaldict /?pdfmark /exec load put }
    { globaldict begin /?pdfmark /pop load def /pdfmark
    /cleartomark load def end } ifelse
/BDC { mark 3 1 roll /BDC pdfmark } bind def
/EMC { mark /EMC pdfmark } bind def
/cairo_store_point { /cairo_point_y exch def /cairo_point_x exch def } def
/Tj { show currentpoint cairo_store_point } bind def
/TJ {
  {
    dup
    type /stringtype eq
    { show } { -0.001 mul 0 cairo_font_matrix dtransform rmoveto } ifelse
  } forall
  currentpoint cairo_store_point
} bind def
/cairo_selectfont { cairo_font_matrix aload pop pop pop 0 0 6 array astore
    cairo_font exch selectfont cairo_point_x cairo_point_y moveto } bind def
/Tf { pop /cairo_font exch def /cairo_font_matrix where
      { pop cairo_selectfont } if } bind def
/Td { matrix translate cairo_font_matrix matrix concatmatrix dup
      /cairo_font_matrix exch def dup 4 get exch 5 get cairo_store_point
      /cairo_font where { pop cairo_selectfont } if } bind def
/Tm { 2 copy 8 2 roll 6 array astore /cairo_font_matrix exch def
      cairo_store_point /cairo_font where { pop cairo_selectfont } if } bind def
/g { setgray } bind def
/rg { setrgbcolor } bind def
/d1 { setcachedevice } bind def
%%EndProlog
%%BeginSetup
%%EndSetup
%%Page: 1 1
%%BeginPageSetup
%%PageBoundingBox: 0 103 410 306
%%EndPageSetup
q 0 103 410 203 rectclip q
0.627451 0.458824 0.188235 rg
185.395 109.806 m 181.379 109.806 177.602 111.368 174.766 114.204 c 169.348
 119.622 168.867 128.223 173.645 134.208 c 177.664 138.231 l 180.316 140.356
 183.648 141.524 187.047 141.524 c 191.062 141.524 194.84 139.958 197.68
 137.118 c 200.52 134.278 202.082 130.505 202.082 126.489 c 202.082 122.473
 200.52 118.696 197.68 115.856 c 196.027 114.204 l 193.191 111.368 189.414
 109.806 185.395 109.806 c h
185.395 109.806 m f
0.980392 0.827451 0.576471 rg
215.594 124.298 m 211.578 124.298 207.801 125.86 204.965 128.696 c 166.465
 166.751 l 92.824 172.138 l 71.477 172.138 l 71.477 266.47 l 107.344 266.47
 l 118.336 279.223 l 121.941 283.407 127.18 285.806 132.703 285.806 c 179.875
 285.806 l 260.754 240.091 l 311.023 189.821 l 312.207 188.638 313.18 187.263
 313.922 185.731 c 314.332 184.88 l 314.473 184.009 l 314.906 183.235 l 
315.105 182.274 l 315.32 181.251 315.426 180.216 315.426 179.192 c 315.426
 173.891 312.676 169.052 308.07 166.243 c 306.852 165.497 305.527 164.95
 304.133 164.61 c 302.898 164.313 301.637 164.161 300.391 164.161 c 296.371
 164.161 292.598 165.723 289.758 168.559 c 286.234 172.028 l 287.578 169.915
 288.387 167.544 288.566 165.118 c 288.992 159.388 286.152 153.962 281.152
 150.962 c 279.965 150.247 278.68 149.72 277.332 149.391 c 276.09 149.087
 274.824 148.934 273.574 148.934 c 269.559 148.934 265.781 150.501 262.941
 153.341 c 259.605 156.684 l 260.898 153.989 261.355 150.946 260.895 147.848
 c 260.594 145.813 259.844 143.837 258.734 142.122 c 255.898 137.766 251.152
 135.165 246.035 135.165 c 245.695 135.165 245.352 135.177 245.008 135.2
 c 241.395 135.438 237.902 137.067 235.18 139.79 c 229.184 145.786 l 229.691
 144.735 230.07 143.641 230.301 142.536 c 231.586 136.345 229.133 130.309
 223.898 126.782 c 222.262 125.677 220.363 124.903 218.406 124.552 c 217.473
 124.384 216.527 124.298 215.594 124.298 c h
215.594 124.298 m f
0.929412 0.717647 0.411765 rg
163.066 185.13 m 159.539 188.657 154.844 190.602 149.844 190.602 c 144.844
 190.602 140.148 188.657 136.621 185.13 c 121.531 170.04 l 166.469 166.751
 l 167.5 165.731 l 168.184 167.688 168.543 169.766 168.543 171.907 c 168.539
 176.903 166.598 181.598 163.066 185.13 c h
163.066 185.13 m f
117.605 200.579 m 112.562 200.579 107.82 198.614 104.258 195.052 c 95.812
 186.606 l 92.25 183.044 90.289 178.302 90.289 173.255 c 90.289 172.88 90.301
 172.509 90.324 172.138 c 92.824 172.138 l 131.824 169.286 l 134.836 172.723
 136.484 177.083 136.484 181.7 c 136.484 186.743 134.523 191.485 130.957
 195.048 c 127.391 198.614 122.648 200.579 117.605 200.579 c h
117.605 200.579 m f
308.07 166.243 m 308.582 166.556 309.07 166.899 309.535 167.263 c 266.656
 209.641 l 262.023 214.223 254.293 213.095 251.156 207.384 c 250.879 206.876
 l 290.395 167.981 l 293.148 165.52 296.66 164.161 300.391 164.161 c 301.637
 164.161 302.895 164.313 304.133 164.61 c 305.527 164.95 306.852 165.501
 308.07 166.243 c h
308.07 166.243 m f
273.574 148.934 m 274.824 148.934 276.09 149.091 277.332 149.391 c 278.676
 149.72 279.961 150.247 281.152 150.962 c 281.742 151.313 282.301 151.708
 282.832 152.126 c 240.047 194.415 l 235.41 198.997 227.68 197.868 224.547
 192.157 c 224.27 191.649 l 264.703 151.852 l 267.262 149.97 270.336 148.934
 273.574 148.934 c h
273.574 148.934 m f
197.031 178.184 m 196.75 177.677 l 229.211 145.727 l 229.199 145.747 229.191
 145.766 229.184 145.79 c 231.43 143.54 l 236.062 138.981 l 238.637 136.751
 241.77 135.415 245.008 135.2 c 245.352 135.177 245.695 135.165 246.035 
135.165 c 249.387 135.165 252.578 136.29 255.18 138.286 c 212.531 180.442
 l 207.895 185.02 200.164 183.895 197.031 178.184 c h
197.031 178.184 m f
215.594 124.298 m 216.527 124.298 217.477 124.384 218.406 124.552 c 220.363
 124.907 222.262 125.677 223.898 126.782 c 224.215 126.993 224.516 127.216
 224.809 127.446 c 182.242 169.516 l 177.609 174.098 169.879 172.97 166.746
 167.259 c 166.465 166.751 l 181.668 151.79 l 181.934 151.727 l 194.703 
138.958 l 206.387 127.458 l 209.008 125.415 212.211 124.298 215.594 124.298
 c h
215.594 124.298 m f
0.627451 0.458824 0.188235 rg
160.754 126.473 m 156.734 126.473 152.961 128.036 150.125 130.872 c 144.707
 136.29 144.227 144.891 149.004 150.88 c 149.227 151.161 l 157.828 159.759
 l 158.109 159.981 l 160.754 162.095 164.086 163.259 167.484 163.259 c 171.5
 163.259 175.273 161.696 178.113 158.86 c 180.953 156.024 182.516 152.247
 182.516 148.231 c 182.516 144.216 180.953 140.438 178.113 137.598 c 177.953
 137.438 l 177.738 137.247 l 177.48 137.024 177.23 136.798 176.988 136.556
 c 175.332 134.899 l 175.09 134.661 174.863 134.411 174.645 134.157 c 174.496
 133.981 l 171.387 130.872 l 168.547 128.036 164.773 126.473 160.754 126.473
 c h
160.754 126.473 m f
135.387 142.411 m 131.371 142.411 127.598 143.977 124.758 146.817 c 118.895
 152.677 118.895 162.216 124.758 168.079 c 137.641 180.966 l 140.477 183.802
 144.254 185.364 148.273 185.364 c 152.293 185.364 156.066 183.802 158.902
 180.966 c 161.742 178.126 163.305 174.352 163.305 170.333 c 163.305 166.313
 161.742 162.536 158.902 159.7 c 146.02 146.817 l 143.18 143.977 139.402
 142.411 135.387 142.411 c h
135.387 142.411 m f
110.023 159.087 m 106.004 159.087 102.227 160.649 99.391 163.485 c 96.555
 166.325 94.992 170.098 94.992 174.118 c 94.992 178.138 96.555 181.911 99.391
 184.747 c 106.113 191.473 l 108.953 194.313 112.73 195.876 116.746 195.876
 c 120.762 195.876 124.539 194.313 127.379 191.473 c 130.219 188.634 131.781
 184.856 131.781 180.841 c 131.781 176.825 130.219 173.048 127.379 170.208
 c 120.652 163.485 l 117.816 160.649 114.039 159.087 110.023 159.087 c h
110.023 159.087 m f
0.509804 0.321569 0.0666667 rg
197.68 137.118 m 195.863 138.934 193.66 140.223 191.258 140.919 c 191.613
 139.622 191.812 138.27 191.812 136.888 c 191.812 132.872 190.25 129.095
 187.41 126.255 c 185.758 124.602 l 182.922 121.766 179.145 120.204 175.129
 120.204 c 173.684 120.204 172.27 120.411 170.922 120.802 c 171.594 118.38
 172.871 116.098 174.766 114.204 c 177.602 111.368 181.375 109.806 185.395
 109.806 c 189.414 109.806 193.191 111.368 196.027 114.204 c 197.68 115.856
 l 200.52 118.696 202.082 122.473 202.082 126.489 c 202.082 130.501 200.52
 134.278 197.68 137.118 c h
197.68 137.118 m f
178.109 158.86 m 176.293 160.677 174.094 161.962 171.688 162.657 c 172.047
 161.36 172.246 160.013 172.246 158.63 c 172.246 154.61 170.684 150.837 
167.844 147.997 c 167.684 147.837 l 167.469 147.641 l 167.211 147.423 166.961
 147.192 166.719 146.954 c 165.062 145.298 l 164.82 145.059 164.594 144.806
 164.375 144.552 c 164.227 144.38 l 161.117 141.27 l 158.277 138.434 154.504
 136.872 150.484 136.872 c 149.039 136.872 147.629 137.079 146.281 137.47
 c 146.953 135.048 148.23 132.766 150.121 130.872 c 152.961 128.036 156.734
 126.473 160.754 126.473 c 164.773 126.473 168.547 128.036 171.387 130.872
 c 174.496 133.981 l 174.645 134.153 l 174.863 134.407 175.09 134.661 175.332
 134.899 c 176.984 136.556 l 177.227 136.798 177.48 137.024 177.738 137.243
 c 177.953 137.438 l 178.113 137.598 l 180.953 140.438 182.516 144.212 182.516
 148.231 c 182.516 152.247 180.949 156.02 178.109 158.86 c h
178.109 158.86 m f
158.902 180.966 m 157.086 182.782 154.883 184.067 152.48 184.763 c 152.836
 183.466 153.035 182.114 153.035 180.731 c 153.035 176.712 151.473 172.938
 148.637 170.102 c 135.75 157.216 l 132.91 154.376 129.137 152.813 125.121
 152.813 c 123.676 152.813 122.266 153.02 120.918 153.411 c 121.59 150.997
 122.859 148.712 124.758 146.817 c 127.598 143.977 131.371 142.411 135.391
 142.411 c 139.406 142.411 143.18 143.977 146.02 146.817 c 158.906 159.7
 l 161.742 162.536 163.305 166.313 163.305 170.333 c 163.305 174.352 161.742
 178.126 158.902 180.966 c h
158.902 180.966 m f
127.379 191.473 m 125.562 193.29 123.359 194.579 120.957 195.274 c 121.316
 193.977 121.516 192.626 121.516 191.239 c 121.516 187.223 119.949 183.45
 117.109 180.61 c 110.387 173.884 l 107.547 171.048 103.773 169.485 99.754
 169.485 c 98.309 169.485 96.898 169.696 95.547 170.087 c 96.23 167.614 
97.531 165.348 99.391 163.485 c 102.227 160.649 106.004 159.087 110.023 
159.087 c 114.039 159.087 117.816 160.649 120.656 163.485 c 127.379 170.208
 l 130.219 173.048 131.781 176.825 131.781 180.841 c 131.781 184.86 130.219
 188.634 127.379 191.473 c h
127.379 191.473 m f
0.929412 0.717647 0.411765 rg
260.754 240.091 m 187.27 281.626 l 184.09 277.782 180.797 274.036 177.387
 270.446 c 174.438 267.341 171.34 264.294 168.695 260.915 c 168.734 260.942
 168.195 260.184 167.977 259.868 c 167.32 258.911 166.645 257.97 166 257.005
 c 164.828 255.266 163.695 253.505 162.602 251.716 c 153.582 236.981 151.145
 232.141 147.023 215.321 c 147.32 215.079 146.711 215.556 147.023 215.321
 c 151.859 211.692 153.5 206.845 164.25 206.145 c 169.645 205.794 172.566
 205.966 176.191 207.364 c 180.293 208.95 183.863 211.665 186.652 215.067
 c 194.605 224.766 l 198.992 230.114 206.219 232.165 212.781 229.973 c 219.887
 227.602 228.52 225.583 237.332 225.583 c 245.129 225.587 252.215 226.735
 258.266 229.809 c 258.266 229.809 264.371 232.462 266.848 234.263 c h
260.754 240.091 m f
0.627451 0.458824 0.188235 rg
312.551 186.583 m 311.957 187.559 311.25 188.458 310.453 189.255 c 259.32
 240.391 l 253.461 235.888 246.09 233.61 237.328 233.61 c 237.324 233.61
 l 219.863 233.606 202.609 242.759 200.113 244.138 c 176.945 215.888 l 173.191
 211.309 167.652 208.684 161.75 208.684 c 157.473 208.684 153.395 210.048
 149.957 212.626 c 145.637 215.864 142.898 220.602 142.242 225.966 c 141.59
 231.329 143.109 236.587 146.523 240.77 c 184.289 287.048 l 190.902 295.149
 200.688 299.794 211.145 299.794 c 247.258 299.794 l 257.969 299.794 268.25
 294.72 274.766 286.22 c 286.602 270.782 l 338.121 270.782 l 338.121 183.548
 l 314.43 183.493 l h
312.551 186.583 m f
0.509804 0.321569 0.0666667 rg
322.961 183.907 m 322.508 186.071 l 322.172 186.677 l 322.07 187.309 l 
321.145 189.227 l 320.012 191.563 318.516 193.673 316.695 195.493 c 275.453
 236.739 l 271.816 240.372 266.156 240.806 261.871 237.962 c 261.797 237.915
 l 310.453 189.255 l 311.254 188.458 311.957 187.559 312.551 186.583 c 314.434
 183.489 l 322.641 183.509 l 322.77 183.673 322.828 183.743 322.961 183.907
 c h
322.961 183.907 m f
157.312 217.032 m 156.66 222.395 158.18 227.653 161.594 231.841 c 199.359
 278.114 l 205.973 286.216 215.758 290.864 226.215 290.864 c 262.328 290.864
 l 265.59 290.864 268.812 290.384 271.898 289.489 c 265.438 296.001 256.512
 299.794 247.258 299.794 c 211.145 299.794 l 200.691 299.794 190.902 295.149
 184.293 287.048 c 146.523 240.77 l 143.109 236.587 141.59 231.329 142.242
 225.966 c 142.898 220.602 145.637 215.864 149.961 212.626 c 153.004 210.341
 156.559 209.016 160.301 208.743 c 158.707 211.204 157.68 214.02 157.312
 217.032 c h
157.312 217.032 m f
0.192157 0.823529 0.968627 rg
15.691 163.239 m 10.137 163.239 5.617 167.759 5.617 173.313 c 5.617 270.899
 l 5.617 276.458 10.137 280.977 15.691 280.977 c 62.203 280.977 l 67.758
 280.977 72.277 276.458 72.277 270.899 c 72.277 173.313 l 72.277 167.759
 67.758 163.239 62.203 163.239 c h
15.691 163.239 m f
347.398 163.239 m 341.844 163.239 337.32 167.759 337.32 173.313 c 337.32
 270.899 l 337.32 276.458 341.84 280.977 347.398 280.977 c 393.906 280.977
 l 399.465 280.977 403.984 276.458 403.984 270.899 c 403.984 173.313 l 403.984
 167.759 399.465 163.239 393.906 163.239 c h
347.398 163.239 m f
0.0745098 0.67451 0.909804 rg
39.945 173.313 m 39.945 270.899 l 39.945 276.458 44.465 280.977 50.02 280.977
 c 15.691 280.977 l 10.137 280.977 5.617 276.458 5.617 270.899 c 5.617 173.313
 l 5.617 167.759 10.137 163.239 15.691 163.239 c 50.02 163.239 l 44.465 
163.239 39.945 167.759 39.945 173.313 c h
39.945 173.313 m f
371.648 173.313 m 371.648 270.899 l 371.648 276.458 376.168 280.977 381.727
 280.977 c 347.398 280.977 l 341.844 280.977 337.32 276.458 337.32 270.899
 c 337.32 173.313 l 337.32 167.759 341.84 163.239 347.398 163.239 c 381.727
 163.239 l 376.172 163.239 371.648 167.759 371.648 173.313 c h
371.648 173.313 m f
0 g
393.906 286.591 m 347.398 286.591 l 340.68 286.591 334.953 282.341 332.719
 276.399 c 289.375 276.399 l 279.227 289.634 l 271.656 299.513 259.703 305.407
 247.262 305.407 c 211.145 305.407 l 199.363 305.407 188.316 300.317 180.652
 291.423 c 124.199 291.423 l 122.445 291.423 120.781 290.661 119.641 289.333
 c 104.77 272.083 l 77.836 272.083 l 77.227 280.184 70.457 286.591 62.203
 286.591 c 15.691 286.591 l 7.039 286.591 0 279.552 0 270.899 c 0 173.313
 l 0 164.661 7.039 157.622 15.691 157.622 c 62.203 157.622 l 68.418 157.622
 73.789 161.266 76.324 166.52 c 90.824 166.52 l 91.828 163.966 93.359 161.575
 95.418 159.513 c 99.445 155.489 104.734 153.473 110.023 153.473 c 111.703
 153.473 113.383 153.681 115.023 154.087 c 115.699 149.966 117.613 146.013
 120.785 142.845 c 124.688 138.942 129.871 136.794 135.387 136.794 c 137.141
 136.794 138.859 137.013 140.516 137.434 c 141.285 133.571 143.164 129.888
 146.152 126.899 c 150.176 122.872 155.465 120.86 160.754 120.86 c 162.195
 120.86 163.641 121.016 165.059 121.317 c 165.754 117.255 167.66 113.36 
170.789 110.231 c 174.816 106.204 180.105 104.192 185.395 104.192 c 190.68
 104.192 195.969 106.204 199.996 110.231 c 201.648 111.88 l 204.121 114.356
 205.891 117.352 206.852 120.618 c 209.613 119.329 212.602 118.684 215.594
 118.684 c 220.883 118.684 226.172 120.7 230.195 124.723 c 232.465 126.993
 234.137 129.7 235.141 132.649 c 238.379 130.63 242.121 129.548 246.031 
129.548 c 251.547 129.548 256.734 131.696 260.633 135.595 c 263.219 138.181
 265.027 141.329 265.961 144.766 c 268.352 143.817 270.922 143.317 273.57
 143.317 c 279.09 143.317 284.273 145.466 288.176 149.364 c 291.094 152.286
 292.949 155.872 293.754 159.638 c 295.902 158.911 298.145 158.548 300.387
 158.548 c 305.676 158.548 310.965 160.559 314.992 164.583 c 318.688 168.282
 320.68 173.04 320.984 177.888 c 331.703 177.915 l 331.703 173.313 l 331.703
 164.661 338.742 157.622 347.398 157.622 c 393.906 157.622 l 402.559 157.622
 409.598 164.661 409.598 173.313 c 409.598 270.899 l 409.602 279.552 402.562
 286.591 393.906 286.591 c h
122.84 174.747 m 116.117 168.024 l 112.758 164.665 107.289 164.665 103.93
 168.024 c 100.57 171.384 100.57 176.852 103.93 180.212 c 110.656 186.934
 l 112.281 188.563 114.445 189.458 116.746 189.458 c 119.047 189.458 121.211
 188.563 122.84 186.934 c 124.469 185.309 125.363 183.141 125.363 180.841
 c 125.363 178.54 124.469 176.376 122.84 174.747 c h
145.156 155.032 m 141.48 151.356 l 139.855 149.727 137.688 148.829 135.387
 148.829 c 133.086 148.829 130.922 149.727 129.297 151.356 c 125.934 154.716
 125.938 160.181 129.297 163.54 c 142.18 176.427 l 143.859 178.106 146.066
 178.946 148.273 178.946 c 150.48 178.946 152.688 178.106 154.367 176.427
 c 157.727 173.067 157.727 167.598 154.367 164.239 c 153.949 163.821 l 153.582
 163.505 153.223 163.177 152.875 162.829 c 146.152 156.106 l 145.805 155.759
 145.477 155.399 145.156 155.032 c h
173.57 142.134 m 173.527 142.091 l 173.156 141.77 172.793 141.438 172.445
 141.091 c 170.793 139.438 l 170.441 139.091 170.113 138.727 169.793 138.36
 c 166.848 135.411 l 163.488 132.052 158.02 132.052 154.66 135.411 c 151.531
 138.54 151.32 143.493 154.02 146.872 c 162.109 154.966 l 165.492 157.665
 170.441 157.45 173.57 154.321 c 175.199 152.692 176.094 150.528 176.094
 148.227 c 176.094 145.927 175.199 143.763 173.57 142.134 c h
193.141 120.391 m 191.488 118.743 l 188.129 115.38 182.66 115.38 179.301
 118.743 c 176.172 121.868 175.961 126.825 178.66 130.204 c 181.676 133.22
 l 183.195 134.438 185.07 135.102 187.047 135.102 c 189.348 135.102 191.512
 134.208 193.141 132.579 c 194.766 130.95 195.664 128.786 195.664 126.485
 c 195.664 124.184 194.766 122.02 193.141 120.391 c h
306.258 172.88 m 302.828 169.688 297.41 169.981 294.098 173.298 c 259.547
 207.848 l 258.973 208.423 258.312 208.852 257.605 209.145 c 253.605 213.145
 l 251.277 215.477 247.449 215.712 245.051 213.45 c 242.57 211.114 242.523
 207.208 244.918 204.813 c 279.469 170.263 l 281.055 168.681 282.09 166.583
 282.184 164.345 c 282.285 161.903 281.383 159.595 279.668 157.876 c 277.953
 156.165 275.641 155.259 273.203 155.36 c 270.965 155.454 268.867 156.493
 267.281 158.075 c 261.641 163.72 l 261.32 164.091 260.988 164.454 260.637
 164.806 c 225.887 199.556 l 223.496 201.946 219.586 201.903 217.246 199.419
 c 214.988 197.02 215.227 193.196 217.555 190.864 c 223.707 184.716 l 223.863
 184.509 224.031 184.309 224.223 184.118 c 252.77 155.571 l 253.988 154.052
 254.652 152.177 254.652 150.2 c 254.652 147.899 253.758 145.735 252.129
 144.106 c 250.414 142.395 248.102 141.489 245.664 141.591 c 243.426 141.684
 241.328 142.723 239.742 144.306 c 231.199 152.852 l 230.875 153.223 230.547
 153.587 230.199 153.934 c 195.449 188.684 l 193.055 191.075 189.145 191.032
 186.809 188.552 c 184.551 186.149 184.789 182.325 187.117 179.997 c 196.164
 170.95 l 196.324 170.739 196.492 170.54 196.684 170.348 c 222.328 144.704
 l 223.547 143.184 224.215 141.309 224.215 139.333 c 224.215 137.032 223.316
 134.868 221.691 133.239 c 218.328 129.88 212.863 129.88 209.504 133.239
 c 186.543 156.2 l 185.52 158.649 184.016 160.899 182.082 162.833 c 178.406
 166.509 173.676 168.501 168.855 168.821 c 169.277 174.602 167.289 180.528
 162.879 184.938 c 155.68 192.138 144.449 192.891 136.395 187.223 c 135.004
 191.52 132.211 195.317 128.223 198.032 c 125.879 199.626 123.203 200.704
 120.406 201.181 c 113.566 202.352 106.902 200.2 102.145 195.446 c 95.422
 188.723 l 92.531 185.833 90.684 182.286 89.867 178.559 c 77.895 178.559
 l 77.895 210.657 l 77.895 213.981 75.199 216.673 71.875 216.673 c 68.555
 216.673 65.859 213.981 65.859 210.657 c 65.859 173.321 l 65.859 171.298
 64.223 169.661 62.199 169.661 c 15.691 169.661 l 13.672 169.661 12.035 
171.298 12.035 173.321 c 12.035 270.903 l 12.035 272.923 13.672 274.563 
15.691 274.563 c 62.203 274.563 l 64.223 274.563 65.859 272.923 65.859 270.903
 c 65.859 249.809 l 65.859 246.489 68.555 243.794 71.879 243.794 c 75.199
 243.794 77.895 246.489 77.895 249.809 c 77.895 260.056 l 107.527 260.056
 l 109.277 260.056 110.941 260.817 112.086 262.145 c 126.953 279.391 l 170.793
 279.391 l 142.176 244.321 l 137.621 238.743 135.688 231.677 136.773 224.516
 c 137.719 218.306 141 212.61 145.898 208.669 c 150.598 204.891 156.199 
203.059 161.754 203.059 c 169.062 203.059 176.297 206.235 181.289 212.325
 c 201.59 237.079 l 212.141 232.04 238.625 221.669 258.617 233.149 c 306.484
 185.282 l 307.176 184.591 307.73 183.794 308.145 182.934 c 308.258 182.231
 308.488 181.567 308.82 180.966 c 308.941 180.388 309.008 179.794 309.008
 179.192 c 309.004 176.786 308.027 174.532 306.258 172.88 c h
331.707 189.95 m 318.035 189.919 l 317.195 191.298 316.184 192.602 314.992
 193.794 c 267.953 240.833 l 269.992 243.313 269.734 246.981 267.316 249.141
 c 264.84 251.356 261.035 251.138 258.82 248.657 c 240.957 228.649 203.375
 249.665 203 249.876 c 200.453 251.333 197.223 250.735 195.363 248.466 c
 171.984 219.954 l 167.477 214.462 159.496 213.497 153.809 217.759 c 150.902
 219.942 149.055 223.13 148.613 226.743 c 148.172 230.352 149.199 233.895
 151.496 236.712 c 189.266 282.989 l 194.652 289.591 202.625 293.376 211.145
 293.376 c 247.258 293.376 l 255.984 293.376 264.363 289.239 269.672 282.313
 c 281.629 266.72 l 282.766 265.231 284.531 264.36 286.402 264.36 c 331.707
 264.36 l h
397.566 173.313 m 397.566 171.298 395.926 169.657 393.906 169.657 c 347.398
 169.657 l 345.379 169.657 343.738 171.298 343.738 173.313 c 343.738 270.899
 l 343.738 272.919 345.379 274.559 347.398 274.559 c 393.906 274.559 l 395.926
 274.559 397.566 272.919 397.566 270.899 c h
397.566 173.313 m f
Q Q
showpage
%%Trailer
end restore
%%EOF
