<?xml version="1.0" encoding="iso-8859-1"?>
<!-- Generator: Adobe Illustrator 19.0.0, SVG Export Plug-In . SVG Version: 6.00 Build 0)  -->
<svg version="1.1" id="Capa_1" xmlns="http://www.w3.org/2000/svg" xmlns:xlink="http://www.w3.org/1999/xlink" x="0px" y="0px"
	 viewBox="0 0 512 512" style="enable-background:new 0 0 512 512;" xml:space="preserve">
<path style="fill:#F4AC45;" d="M269.97,416l-1.838-9.517C263.817,384.141,244.26,368,221.505,368H14.21
	c-2.561,0-3.601,3.295-1.505,4.766l18.039,12.656C23.812,393.886,20,404.545,20,415.5c0,26.191,21.309,47.5,47.5,47.5h70.383H270
	L269.97,416z"/>
<path style="fill:#ED9829;" d="M181.883,438.108H111.5c-26.191,0-47.5-21.309-47.5-47.5c0-7.933,2.008-15.707,5.744-22.608H14.21
	c-2.561,0-3.601,3.295-1.505,4.766l18.039,12.656C23.812,393.886,20,404.545,20,415.5c0,26.191,21.309,47.5,47.5,47.5h70.383H270
	l-0.016-24.892H181.883z"/>
<path style="fill:#C3DA40;" d="M142.418,505c-3.544,0-6.417-2.873-6.417-6.417V467.5c0-1.554-0.076-3.13-0.234-4.817l-0.022-0.303
	c-1.303-12.929-7.374-24.754-17.115-33.396l-9.522-8.448c-2.18-1.934-0.812-5.536,2.102-5.536h149.15l0.641-0.045l0.644,0.045
	C290.528,415.077,314,438.599,314,467.5v31.083c0,3.544-2.873,6.417-6.417,6.417H142.418z"/>
<g>
	<polygon style="fill:#ADBC15;" points="261,414.955 260.36,415 261.644,415 	"/>
	<path style="fill:#ADBC15;" d="M180.871,498.583V467.5c0-1.554-0.076-3.13-0.234-4.817l-0.022-0.303
		c-1.303-12.929-7.374-24.754-17.115-33.396l-9.521-8.448c-2.18-1.934-0.812-5.536,2.102-5.536H111.21
		c-2.914,0-4.281,3.603-2.102,5.536l9.522,8.448c9.741,8.642,15.813,20.467,17.115,33.396l0.022,0.303
		c0.158,1.688,0.234,3.264,0.234,4.817v31.083c0,3.544,2.873,6.417,6.417,6.417h44.871C183.745,505,180.871,502.127,180.871,498.583
		z"/>
</g>
<path style="fill:#F4AC45;" d="M494.49,7H290.495c-22.755,0-42.312,16.141-46.627,38.483L242.03,55v47h132.087H444.5
	c26.191,0,47.5-21.309,47.5-47.5c0-10.956-3.813-21.616-10.744-30.078l15.338-10.761C499.524,11.606,498.069,7,494.49,7z"/>
<path style="fill:#ED9829;" d="M434.022,75H301.935V28l1.838-9.517c0.783-4.053,2.073-7.898,3.787-11.483h-17.065
	c-22.755,0-42.312,16.141-46.626,38.483L242.03,55v47h132.087H444.5c18.854,0,35.176-11.043,42.843-27H434.022z"/>
<path style="fill:#C3DA40;" d="M207.69,144c-5.351,0-9.689-4.338-9.689-9.689V106.5c0-28.901,23.474-52.423,52.356-52.5L251,53.955
	L251.641,54h148.7c3.071,0,4.513,3.798,2.216,5.836l-9.184,8.148c-9.767,8.664-15.844,20.527-17.116,33.408l-0.021,0.29
	c-0.158,1.688-0.234,3.264-0.234,4.817v27.811c0,5.351-4.338,9.689-9.689,9.689H207.69V144z"/>
<path style="fill:#ADBC15;" d="M245.157,134.311V106.5c0-28.901,23.474-52.423,52.356-52.5H251.64L251,53.955L250.357,54
	C221.474,54.077,198,77.599,198,106.5v27.811c0,5.352,4.338,9.689,9.689,9.689h47.157C249.496,144,245.157,139.662,245.157,134.311z
	"/>
<path style="fill:#31D2F7;" d="M247.625,291.12H117.67c-22.012,0-40.534-17.332-41.055-39.338
	c-0.537-22.669,17.748-41.282,40.298-41.282h280.42c22.012,0,40.534,17.333,41.054,39.339c0.535,22.669-17.749,41.281-40.298,41.281
	H268.941l-7.593,21.695c-1.196,3.417-6.062,3.321-7.122-0.141L247.625,291.12z"/>
<path style="fill:#13ACE8;" d="M136.114,276.457c-0.537-22.669,17.748-41.282,40.298-41.282h258.762
	c-6.281-14.569-21.039-24.675-37.843-24.675h-280.42c-22.55,0-40.835,18.613-40.298,41.282
	c0.521,22.006,19.043,39.338,41.055,39.338h21.656C137.379,286.604,136.237,281.664,136.114,276.457z"/>
<path d="M398.088,203.5H117.706c-25.905,0-47.603,20.494-48.095,46.395c-0.503,26.504,20.91,48.225,47.301,48.225h41.551
	c4.142,0,7.5-3.358,7.5-7.5l0,0c0-4.142-3.358-7.5-7.5-7.5h-40.906c-18.077,0-33.257-14.793-32.949-32.868
	c0.299-17.559,14.676-31.752,32.305-31.752h280.532c18.078,0,33.257,14.794,32.948,32.869c-0.3,17.559-14.676,31.751-32.305,31.751
	H268.586c-3.187,0-6.026,2.014-7.079,5.023l-3.428,9.794l-2.913-9.513c-0.965-3.152-3.875-5.304-7.171-5.304h-40.731
	c-4.142,0-7.5,3.358-7.5,7.5l0,0c0,4.142,3.358,7.5,7.5,7.5h35.184l7.761,25.345c0.932,3.043,3.453,5.371,6.581,5.959
	c0.407,0.076,0.602,0.076,0.815,0.076c3.181,0,6.023-2.01,7.078-5.022l9.224-26.357h123.386c25.906,0,47.604-20.495,48.096-46.396
	C445.892,225.22,424.479,203.5,398.088,203.5z"/>
<path d="M511.652,5.241C510.666,2.121,507.772,0,504.5,0h-214c-28.1,0-51.296,21.378-54.191,48.724
	C210.332,55.106,191,78.582,191,106.5v37c0,4.143,3.357,7.5,7.5,7.5h177c4.143,0,7.5-3.357,7.5-7.5V109h61.5
	c30.052,0,54.5-24.448,54.5-54.5c0-10.047-2.794-19.878-7.979-28.379l17.787-12.481C511.487,11.76,512.637,8.362,511.652,5.241z
	 M368,136H206v-29.5c0-24.537,19.963-44.5,44.5-44.5c0.169,0,0.334-0.014,0.5-0.025c0.166,0.011,0.331,0.025,0.5,0.025h136.563
	c-10.926,9.693-18.273,23.331-19.773,38.664c-0.01,0.091-0.014,0.184-0.021,0.275c-0.171,1.832-0.269,3.685-0.269,5.561L368,136
	L368,136z M444.5,94h-59.7c5.416-18.469,22.503-32,42.7-32H463c4.143,0,7.5-3.357,7.5-7.5S467.143,47,463,47H251.723
	c3.515-18.205,19.561-32,38.777-32h190.256l-4.539,3.185c-1.72,1.207-2.854,3.08-3.128,5.163s0.34,4.186,1.689,5.796
	C480.725,36.235,484,45.24,484,54.5C484,76.28,466.28,94,444.5,94z"/>
<path d="M275.691,409.724C272.797,382.378,249.601,361,221.5,361H7.5c-3.271,0-6.166,2.121-7.151,5.241s0.165,6.519,2.843,8.398
	l17.787,12.481C15.794,395.622,13,405.453,13,415.5c0,30.052,24.448,54.5,54.5,54.5H129v34.5c0,4.143,3.357,7.5,7.5,7.5h177
	c4.143,0,7.5-3.357,7.5-7.5v-37C321,439.582,301.668,416.106,275.691,409.724z M28,415.5c0-9.26,3.275-18.266,9.222-25.356
	c1.35-1.61,1.963-3.713,1.689-5.796s-1.408-3.956-3.128-5.163L31.244,376H221.5c19.216,0,35.262,13.795,38.777,32H49
	c-4.143,0-7.5,3.357-7.5,7.5s3.357,7.5,7.5,7.5h35.5c20.197,0,37.284,13.531,42.7,32H67.5C45.72,455,28,437.28,28,415.5z M306,497
	H144v-29.5c0-1.876-0.098-3.729-0.269-5.561c-0.007-0.092-0.011-0.185-0.021-0.275c-1.5-15.333-8.848-28.97-19.773-38.664H260.5
	c0.169,0,0.334-0.014,0.5-0.025c0.166,0.011,0.331,0.025,0.5,0.025c24.537,0,44.5,19.963,44.5,44.5V497z"/>
<path d="M285.807,89.549H303c4.143,0,7.5-3.357,7.5-7.5s-3.357-7.5-7.5-7.5h-5.542c-0.395-3.771-3.582-6.71-7.458-6.71
	c-3.988,0-7.239,3.114-7.477,7.042C275.1,76.404,269.5,82.988,269.5,90.855v0.839c0,8.991,7.315,16.307,16.307,16.307h8.387
	c0.721,0,1.307,0.586,1.307,1.307s-0.586,1.307-1.307,1.307H277c-4.143,0-7.5,3.357-7.5,7.5s3.357,7.5,7.5,7.5h5.919v0.048
	c0,4.143,3.357,7.5,7.5,7.5s7.5-3.357,7.5-7.5v-0.494c7.199-1.692,12.581-8.153,12.581-15.86c0-8.991-7.315-16.307-16.307-16.307
	h-8.387c-0.721,0-1.307-0.586-1.307-1.307v-0.839C284.5,90.135,285.086,89.549,285.807,89.549z"/>
<path d="M215.807,449.549H233c4.143,0,7.5-3.357,7.5-7.5s-3.357-7.5-7.5-7.5h-5.542c-0.395-3.771-3.582-6.71-7.458-6.71
	c-3.988,0-7.239,3.114-7.477,7.042c-7.423,1.523-13.023,8.107-13.023,15.974v0.839c0,8.991,7.315,16.307,16.307,16.307h8.387
	c0.721,0,1.307,0.586,1.307,1.307s-0.586,1.307-1.307,1.307H207c-4.143,0-7.5,3.357-7.5,7.5s3.357,7.5,7.5,7.5h5.919v0.048
	c0,4.143,3.357,7.5,7.5,7.5s7.5-3.357,7.5-7.5v-0.494c7.199-1.692,12.581-8.153,12.581-15.86c0-8.991-7.315-16.307-16.307-16.307
	h-8.387c-0.721,0-1.307-0.586-1.307-1.307v-0.839C214.5,450.135,215.086,449.549,215.807,449.549z"/>
<circle cx="138.5" cy="251.5" r="9.5"/>
<circle cx="185.5" cy="251.5" r="9.5"/>
<circle cx="232.5" cy="251.5" r="9.5"/>
<circle cx="279.5" cy="251.5" r="9.5"/>
<circle cx="326.5" cy="251.5" r="9.5"/>
<circle cx="373.5" cy="251.5" r="9.5"/>
<g>
</g>
<g>
</g>
<g>
</g>
<g>
</g>
<g>
</g>
<g>
</g>
<g>
</g>
<g>
</g>
<g>
</g>
<g>
</g>
<g>
</g>
<g>
</g>
<g>
</g>
<g>
</g>
<g>
</g>
</svg>
