<?xml version="1.0" encoding="iso-8859-1"?>
<!-- Generator: Adobe Illustrator 19.0.0, SVG Export Plug-In . SVG Version: 6.00 Build 0)  -->
<svg version="1.1" id="Capa_1" xmlns="http://www.w3.org/2000/svg" xmlns:xlink="http://www.w3.org/1999/xlink" x="0px" y="0px"
	 viewBox="0 0 512 512" style="enable-background:new 0 0 512 512;" xml:space="preserve">
<path style="fill:#FFCF59;" d="M408.308,425.331h-78.164c-16.298,0-29.558-13.26-29.558-29.558s13.26-29.558,29.558-29.558h102.2
	c16.298,0,29.558,13.26,29.558,29.558s-13.26,29.558-29.558,29.558h-0.879l-11.127,24.726L408.308,425.331z"/>
<path style="fill:#F7A33E;" d="M359.719,395.773c0-16.298,13.26-29.558,29.558-29.558h-59.132c-16.298,0-29.558,13.26-29.558,29.558
	s13.26,29.558,29.558,29.558h59.132C372.978,425.331,359.719,412.071,359.719,395.773z"/>
<path style="fill:#FF62A7;" d="M41.565,473.425h-4.994c-16.298,0-29.558-13.26-29.558-29.558s13.26-29.558,29.558-29.558h102.2
	c16.298,0,29.558,13.26,29.558,29.558s-13.26,29.558-29.558,29.558H62.846l-10.225,22.722L41.565,473.425z"/>
<path style="fill:#FC5479;" d="M70.848,443.867c0-16.298,13.26-29.558,29.558-29.558H36.571c-16.298,0-29.558,13.26-29.558,29.558
	s13.26,29.558,29.558,29.558h4.994l11.056,22.722l10.225-22.722h37.56C84.108,473.425,70.848,460.165,70.848,443.867z"/>
<path style="fill:#FF62A7;" d="M445.913,78.654H340.164c-15.746,0-28.556-12.81-28.556-28.556s12.81-28.556,28.556-28.556h136.266
	c15.746,0,28.556,12.81,28.556,28.556s-12.81,28.556-28.556,28.556h-1.545l-14.486,36.942L445.913,78.654z"/>
<path style="fill:#FC5479;" d="M358.585,50.098c0-15.746,12.81-28.556,28.556-28.556h-46.977c-15.746,0-28.556,12.81-28.556,28.556
	s12.81,28.556,28.556,28.556h46.977C371.395,78.654,358.585,65.844,358.585,50.098z"/>
<path style="fill:#FFCF59;" d="M31.329,60.618h-2.272c-12.155,0-22.043-9.888-22.043-22.043s9.888-22.043,22.043-22.043h42.082
	c12.155,0,22.043,9.888,22.043,22.043s-9.888,22.043-22.043,22.043H47.743l-9.226,20.909L31.329,60.618z"/>
<path style="fill:#F7A33E;" d="M35.623,38.575c0-12.155,9.888-22.043,22.043-22.043H29.057c-12.155,0-22.043,9.888-22.043,22.043
	s9.888,22.043,22.043,22.043h2.272l7.188,20.909l9.226-20.909h9.922C45.511,60.618,35.623,50.73,35.623,38.575z"/>
<path style="fill:#FFCF59;" d="M361.021,139.626H275.51H141.47l0.045,54.523l-0.034,7.876c-0.007,0.163-0.011,0.327-0.011,0.489
	v143.689c0,5.956,6.814,9.341,11.561,5.743l55.541-42.101h152.449c34.733,0,62.89-28.157,62.89-62.89v-44.44
	C423.911,167.783,395.754,139.626,361.021,139.626z"/>
<path style="fill:#F7A33E;" d="M275.51,139.626H175.42H141.47l0.045,54.523l-0.034,7.876c-0.007,0.163-0.011,0.327-0.011,0.489
	v7.665v136.024c0,5.956,6.814,9.341,11.561,5.743l22.389-16.971v-72.852c0-28.688,23.256-51.944,51.944-51.944l0,0l30.53,18.255
	c3.461,2.069,7.401,3.162,11.398,3.162c12.269,0,22.249-9.979,22.249-22.247v-69.724H275.51V139.626z"/>
<path id="SVGCleanerId_0" style="fill:#FF62A7;" d="M231.515,195.152H129.747c-23.283,0-42.159-18.875-42.159-42.159v-29.675
	c0-23.283,18.876-42.159,42.159-42.159h104.605c23.284,0,42.159,18.876,42.159,42.159v86.032c0,5.597-6.102,9.058-10.905,6.186
	L231.515,195.152z"/>
<g>
	<path id="SVGCleanerId_0_1_" style="fill:#FF62A7;" d="M231.515,195.152H129.747c-23.283,0-42.159-18.875-42.159-42.159v-29.675
		c0-23.283,18.876-42.159,42.159-42.159h104.605c23.284,0,42.159,18.876,42.159,42.159v86.032c0,5.597-6.102,9.058-10.905,6.186
		L231.515,195.152z"/>
</g>
<path style="fill:#FC5479;" d="M151.899,152.993v-29.675c0-23.246,18.912-42.159,42.159-42.159h-64.311
	c-23.246,0-42.159,18.913-42.159,42.159v29.675c0,23.246,18.912,42.159,42.159,42.159h64.311
	C170.811,195.152,151.899,176.239,151.899,152.993z"/>
<path d="M361.021,132.612h-77.495v-9.294c0-27.114-22.059-49.173-49.173-49.173H129.747c-27.114,0-49.173,22.059-49.173,49.173
	v29.675c0,27.114,22.059,49.173,49.173,49.173h4.715c-0.001,0.116-0.005,0.233-0.005,0.351v157.186c0,2.854,1.616,5.461,4.171,6.73
	c1.059,0.526,2.203,0.785,3.343,0.785c1.609,0,3.209-0.517,4.541-1.526l64.419-48.83h150.091c38.544,0,69.904-31.358,69.904-69.904
	v-44.442C430.925,163.97,399.566,132.612,361.021,132.612z M415.895,246.957c0,30.306-24.568,54.874-54.874,54.874H208.404
	c-1.639,0-3.233,0.536-4.539,1.526l-54.378,41.22V202.516c0.136-0.136,0.214-0.214,0.351-0.351h9.414
	c4.15,0,7.515-3.365,7.515-7.515l0,0c0-4.15-3.365-7.515-7.515-7.515h-29.505c-18.857,0-34.144-15.287-34.144-34.144v-29.675
	c0-18.857,15.287-34.144,34.144-34.144h104.605c18.857,0,34.144,15.287,34.144,34.144v84.606L235.51,188.2
	c-1.165-0.697-2.499-1.065-3.857-1.065h-23.505c-4.15,0-7.515,3.365-7.515,7.515l0,0c0,4.15,3.365,7.515,7.515,7.515h21.429
	l42.577,25.458c1.187,0.709,2.521,1.065,3.857,1.065c1.361,0,2.723-0.37,3.931-1.109c2.296-1.408,3.584-4.014,3.584-6.707v-73.23
	h77.495c30.306,0,54.874,24.568,54.874,54.874L415.895,246.957L415.895,246.957z"/>
<path d="M476.431,14.528H340.164c-19.613,0-35.569,15.956-35.569,35.569s15.956,35.569,35.569,35.569H441.13l12.274,31.299
	c1.128,2.878,3.905,4.771,6.996,4.771c3.091,0,5.867-1.894,6.996-4.771l12.334-31.451C497.801,83.846,512,68.599,512,50.098
	C512,30.485,496.044,14.528,476.431,14.528z M476.431,70.638h-1.886c-3.091,0-5.867,1.894-6.996,4.771l-7.15,18.231l-7.149-18.231
	c-1.128-2.878-3.905-4.771-6.996-4.771h-106.09c-11.326,0-20.54-9.214-20.54-20.54s9.214-20.54,20.54-20.54h136.266
	c11.326,0,20.54,9.214,20.54,20.54S487.757,70.638,476.431,70.638z"/>
<path d="M138.771,407.296h-102.2C16.406,407.296,0,423.702,0,443.867c0,20.165,16.406,36.571,36.571,36.571h0.606l8.667,17.816
	c1.259,2.589,3.885,4.227,6.757,4.227c0.038,0,0.075,0,0.113-0.001c2.916-0.043,5.544-1.77,6.74-4.43l7.925-17.612h71.389
	c20.165,0,36.571-16.406,36.571-36.571C175.341,423.702,158.936,407.296,138.771,407.296z M138.771,465.409H62.522
	c-2.957,0-5.639,1.734-6.852,4.431l-3.332,7.403l-3.701-7.607c-1.257-2.586-3.882-4.227-6.757-4.227h-5.308
	c-11.878,0-21.542-9.664-21.542-21.542c0-11.878,9.664-21.542,21.542-21.542h102.2c11.878,0,21.542,9.664,21.542,21.542
	C160.313,455.745,150.649,465.409,138.771,465.409z"/>
<path d="M431.644,359.202h-16.463c-4.15,0-7.515,3.365-7.515,7.515l0,0c0,4.15,3.365,7.515,7.515,7.515h16.634
	c11.666,0,21.614,9.054,22.055,20.71c0.464,12.255-9.372,22.374-21.526,22.374h-1.202c-2.957,0-5.639,1.734-6.852,4.431
	l-4.233,9.407l-4.676-9.611c-1.258-2.586-3.883-4.227-6.758-4.227h-77.947c-11.666,0-21.614-9.054-22.055-20.71
	c-0.464-12.255,9.372-22.374,21.526-22.374h36.139c4.15,0,7.515-3.365,7.515-7.515l0,0c0-4.15-3.365-7.515-7.515-7.515h-35.452
	c-19.971,0-36.775,15.725-37.247,35.69c-0.487,20.567,16.102,37.453,36.561,37.453h73.776l9.643,19.82
	c1.259,2.589,3.885,4.227,6.757,4.227c0.025,0,0.049,0,0.074,0c2.931-0.033,5.577-1.758,6.779-4.431l8.912-19.806
	c18.171-1.855,32.447-17.068,32.822-35.634C469.323,376,452.17,359.202,431.644,359.202z"/>
<path d="M26.278,67.501l5.19,15.098c1.005,2.925,3.699,4.935,6.789,5.065c0.106,0.005,0.212,0.007,0.319,0.007
	c2.966,0,5.668-1.749,6.873-4.482l6.864-15.557h18.825c16.022,0,29.057-13.034,29.057-29.057S87.161,9.519,71.139,9.519H29.057
	C13.034,9.519,0,22.553,0,38.575C0,53.661,11.555,66.097,26.278,67.501z M29.057,24.548h42.082c7.735,0,14.027,6.292,14.027,14.027
	s-6.292,14.027-14.027,14.027H47.417c-2.977,0-5.674,1.757-6.875,4.482l-1.096,2.485l-0.651-1.895
	c-1.043-3.035-3.898-5.072-7.107-5.072h-2.63c-7.735,0-14.027-6.292-14.027-14.027S21.322,24.548,29.057,24.548z"/>
<g>
</g>
<g>
</g>
<g>
</g>
<g>
</g>
<g>
</g>
<g>
</g>
<g>
</g>
<g>
</g>
<g>
</g>
<g>
</g>
<g>
</g>
<g>
</g>
<g>
</g>
<g>
</g>
<g>
</g>
</svg>
