%!PS-Adobe-3.0 EPSF-3.0
%%Creator: cairo 1.14.2 (http://cairographics.org)
%%CreationDate: Mon Feb 19 09:15:05 2018
%%Pages: 1
%%DocumentData: Clean7Bit
%%LanguageLevel: 2
%%BoundingBox: 0 63 410 346
%%EndComments
%%BeginProlog
save
50 dict begin
/q { gsave } bind def
/Q { grestore } bind def
/cm { 6 array astore concat } bind def
/w { setlinewidth } bind def
/J { setlinecap } bind def
/j { setlinejoin } bind def
/M { setmiterlimit } bind def
/d { setdash } bind def
/m { moveto } bind def
/l { lineto } bind def
/c { curveto } bind def
/h { closepath } bind def
/re { exch dup neg 3 1 roll 5 3 roll moveto 0 rlineto
      0 exch rlineto 0 rlineto closepath } bind def
/S { stroke } bind def
/f { fill } bind def
/f* { eofill } bind def
/n { newpath } bind def
/W { clip } bind def
/W* { eoclip } bind def
/BT { } bind def
/ET { } bind def
/pdfmark where { pop globaldict /?pdfmark /exec load put }
    { globaldict begin /?pdfmark /pop load def /pdfmark
    /cleartomark load def end } ifelse
/BDC { mark 3 1 roll /BDC pdfmark } bind def
/EMC { mark /EMC pdfmark } bind def
/cairo_store_point { /cairo_point_y exch def /cairo_point_x exch def } def
/Tj { show currentpoint cairo_store_point } bind def
/TJ {
  {
    dup
    type /stringtype eq
    { show } { -0.001 mul 0 cairo_font_matrix dtransform rmoveto } ifelse
  } forall
  currentpoint cairo_store_point
} bind def
/cairo_selectfont { cairo_font_matrix aload pop pop pop 0 0 6 array astore
    cairo_font exch selectfont cairo_point_x cairo_point_y moveto } bind def
/Tf { pop /cairo_font exch def /cairo_font_matrix where
      { pop cairo_selectfont } if } bind def
/Td { matrix translate cairo_font_matrix matrix concatmatrix dup
      /cairo_font_matrix exch def dup 4 get exch 5 get cairo_store_point
      /cairo_font where { pop cairo_selectfont } if } bind def
/Tm { 2 copy 8 2 roll 6 array astore /cairo_font_matrix exch def
      cairo_store_point /cairo_font where { pop cairo_selectfont } if } bind def
/g { setgray } bind def
/rg { setrgbcolor } bind def
/d1 { setcachedevice } bind def
%%EndProlog
%%BeginSetup
%%EndSetup
%%Page: 1 1
%%BeginPageSetup
%%PageBoundingBox: 0 63 410 346
%%EndPageSetup
q 0 63 410 283 rectclip q
0.407843 g
337.219 284.799 m 61.359 284.799 l 53.551 284.799 47.199 278.448 47.199
 270.639 c 47.199 95.202 l 361.602 95.202 l 361.602 284.799 l h
337.219 284.799 m f
0.329412 0.317647 0.317647 rg
130.961 284.799 m 61.359 284.799 l 53.551 284.799 47.199 278.448 47.199
 270.639 c 47.199 95.202 l 116.801 95.202 l 116.801 270.639 l 116.801 278.448
 123.152 284.799 130.961 284.799 c h
130.961 284.799 m f
0.317647 0.301961 0.290196 rg
43.609 69.6 m 32.316 69.6 22.312 76.889 18.848 87.635 c 18.219 89.592 l
 17.195 92.76 19.559 95.998 22.887 95.998 c 387.516 95.998 l 390.84 95.998
 393.203 92.76 392.184 89.592 c 391.551 87.635 l 388.09 76.889 378.086 69.6
 366.789 69.6 c h
43.609 69.6 m f
0.764706 0.854902 0.25098 rg
199.855 264.799 m 73.805 264.799 l 70.156 264.799 67.199 261.842 67.199
 258.194 c 67.199 121.807 l 67.199 118.159 70.156 115.202 73.805 115.202
 c 334.996 115.202 l 338.641 115.202 341.602 118.159 341.602 121.807 c 341.602
 258.194 l 341.602 261.842 338.641 264.799 334.996 264.799 c h
199.855 264.799 m f
0.678431 0.737255 0.0823529 rg
116.801 264.799 m 73.805 264.799 l 70.156 264.799 67.199 261.842 67.199
 258.194 c 67.199 121.807 l 67.199 118.159 70.156 115.202 73.805 115.202
 c 116.801 115.202 l h
116.801 264.799 m f
1 0.384314 0.654902 rg
367.602 267.202 m 347.527 267.202 331.199 283.53 331.199 303.6 c 331.199
 323.67 347.527 339.998 367.602 339.998 c 387.672 339.998 404 323.67 404
 303.6 c 404 283.53 387.672 267.202 367.602 267.202 c h
367.602 267.202 m f
0.988235 0.329412 0.47451 rg
361.602 303.6 m 361.602 318.248 370.301 330.893 382.801 336.663 c 378.172
 338.799 373.023 339.998 367.602 339.998 c 347.527 339.998 331.199 323.67
 331.199 303.6 c 331.199 283.53 347.527 267.202 367.602 267.202 c 373.023
 267.202 378.172 268.401 382.801 270.538 c 370.301 276.307 361.602 288.952
 361.602 303.6 c h
361.602 303.6 m f
0.192157 0.823529 0.968627 rg
165.199 237.6 m 145.129 237.6 128.801 253.928 128.801 273.998 c 128.801
 294.073 145.129 310.401 165.199 310.401 c 185.27 310.401 201.602 294.073
 201.602 273.998 c 201.602 253.928 185.27 237.6 165.199 237.6 c h
165.199 237.6 m f
0.0745098 0.67451 0.909804 rg
160.188 282.245 m 160.188 293.159 165.02 302.955 172.645 309.631 c 170.242
 310.131 167.75 310.401 165.199 310.401 c 145.129 310.401 128.801 294.073
 128.801 273.998 c 128.801 253.928 145.129 237.6 165.199 237.6 c 174.359
 237.6 182.734 241.01 189.141 246.616 c 172.629 250.061 160.188 264.729 
160.188 282.245 c h
160.188 282.245 m f
1 0.811765 0.34902 rg
42 151.202 m 21.93 151.202 5.602 167.53 5.602 187.6 c 5.602 207.67 21.93
 223.998 42 223.998 c 62.07 223.998 78.398 207.67 78.398 187.6 c 78.398 
167.53 62.07 151.202 42 151.202 c h
42 151.202 m f
1 0.709804 0.360784 rg
42 187.6 m 42 201.041 49.332 212.799 60.199 219.104 c 54.84 222.209 48.629
 223.998 42 223.998 c 21.93 223.998 5.602 207.67 5.602 187.6 c 5.602 167.53
 21.93 151.202 42 151.202 c 48.629 151.202 54.84 152.991 60.199 156.096 
c 49.332 162.401 42 174.159 42 187.6 c h
42 187.6 m f
0.317647 0.301961 0.290196 rg
231.512 197.6 38.578 -31.199 re f
0.407843 g
279.961 150.401 m 269.863 150.463 261.602 158.78 261.602 168.877 c 261.602
 195.123 l 261.602 205.221 269.863 213.538 279.961 213.6 c 282.301 213.616
 l 284.559 213.627 286.398 211.799 286.398 209.541 c 286.398 154.459 l 286.398
 152.198 284.559 150.37 282.301 150.385 c h
279.961 150.401 m f
0.34902 0.321569 0.317647 rg
274 183.202 m 274 209.448 l 274 210.541 274.102 211.616 274.289 212.659
 c 266.945 210.205 261.602 203.245 261.602 195.123 c 261.602 168.877 l 261.602
 158.78 269.863 150.463 279.961 150.401 c 282.301 150.385 l 284.559 150.37
 286.398 152.198 286.398 154.459 c 286.398 165.764 l 279.207 168.303 274
 175.19 274 183.202 c h
274 183.202 m f
0.407843 g
198.301 146.248 m 185.77 146.248 173.109 147.381 160.676 149.62 c 158.008
 150.1 155.934 152.205 155.496 154.877 c 151.977 176.268 151.871 193.979
 155.172 209.034 c 155.766 211.745 158.039 213.764 160.805 214.034 c 173.203
 215.237 185.82 215.846 198.309 215.846 c 210.395 215.846 222.602 215.276
 234.598 214.147 c 237.887 213.838 240.398 211.08 240.398 207.776 c 240.398
 155.776 l 240.398 152.67 238.168 150.01 235.109 149.475 c 222.941 147.334
 210.559 146.248 198.301 146.248 c h
198.301 146.248 m f
0.34902 0.321569 0.317647 rg
227.926 162.803 m 215.395 162.803 202.738 163.936 190.305 166.174 c 190.301
 166.174 l 187.637 166.655 185.562 168.76 185.121 171.432 c 182.355 188.245
 181.707 202.78 183.156 215.541 c 175.68 215.252 168.203 214.748 160.805
 214.034 c 158.043 213.764 155.766 211.745 155.172 209.034 c 151.871 193.979
 151.977 176.264 155.496 154.877 c 155.934 152.205 158.008 150.1 160.676
 149.62 c 173.109 147.381 185.77 146.248 198.301 146.248 c 210.559 146.248
 222.941 147.334 235.109 149.475 c 238.168 150.01 240.402 152.67 240.402
 155.776 c 240.402 163.182 l 236.238 162.936 232.074 162.803 227.926 162.803
 c h
227.926 162.803 m f
0.909804 0.882353 0.839216 rg
367.602 287.202 m 358.559 287.202 351.199 294.557 351.199 303.6 c 351.199
 312.643 358.559 319.998 367.602 319.998 c 376.645 319.998 384 312.643 384
 303.6 c 384 300.178 382.941 296.889 380.941 294.088 c 379.91 290.538 l 
376.309 289.717 l 373.688 288.069 370.676 287.202 367.602 287.202 c h
367.602 287.202 m f
0 g
392.398 101.6 m 367.199 101.6 l 367.199 261.612 l 367.332 261.608 367.465
 261.6 367.602 261.6 c 390.758 261.6 409.602 280.44 409.602 303.6 c 409.602
 326.76 390.758 345.6 367.602 345.6 c 344.441 345.6 325.602 326.76 325.602
 303.6 c 325.602 298.991 326.359 294.553 327.738 290.401 c 203.863 290.401
 l 197.465 305.432 182.543 315.998 165.199 315.998 c 147.855 315.998 132.938
 305.432 126.535 290.401 c 61.359 290.401 l 50.465 290.401 41.602 281.534
 41.602 270.639 c 41.602 229.588 l 18.625 229.373 0 210.623 0 187.6 c 0 
164.577 18.625 145.827 41.602 145.612 c 41.602 101.6 l 18 101.6 l 14.688
 101.6 12 98.913 12 95.6 c 12 78.174 26.176 63.998 43.602 63.998 c 366.801
 63.998 l 384.223 63.998 398.398 78.174 398.398 95.6 c 398.398 98.913 395.715
 101.6 392.398 101.6 c h
367.602 333.6 m 384.141 333.6 397.602 320.143 397.602 303.6 c 397.602 287.057
 384.141 273.6 367.602 273.6 c 351.059 273.6 337.602 287.057 337.602 303.6
 c 337.602 320.143 351.059 333.6 367.602 333.6 c h
334.023 278.401 m 336.305 275.366 338.992 272.659 341.996 270.342 c 341.734
 270.377 341.469 270.401 341.199 270.401 c 207.035 270.401 l 207.137 271.588
 207.199 272.788 207.199 273.998 c 207.199 275.487 207.121 276.955 206.969
 278.401 c h
165.199 303.998 m 181.742 303.998 195.199 290.541 195.199 273.998 c 195.199
 257.459 181.742 243.998 165.199 243.998 c 148.656 243.998 135.199 257.459
 135.199 273.998 c 135.199 290.541 148.656 303.998 165.199 303.998 c h
165.199 231.998 m 182.848 231.998 197.977 242.944 204.184 258.401 c 335.199
 258.401 l 335.199 121.6 l 73.602 121.6 l 73.602 159.979 l 80.066 167.37
 84 177.03 84 187.6 c 84 198.17 80.066 207.83 73.602 215.221 c 73.602 258.401
 l 126.219 258.401 l 132.422 242.944 147.555 231.998 165.199 231.998 c h
53.602 270.639 m 53.602 274.92 57.082 278.401 61.359 278.401 c 123.434 
278.401 l 123.281 276.955 123.199 275.487 123.199 273.998 c 123.199 272.788
 123.266 271.588 123.367 270.401 c 67.602 270.401 l 64.285 270.401 61.602
 267.713 61.602 264.401 c 61.602 224.729 l 59.074 226.069 56.395 227.155
 53.602 227.959 c h
12 187.6 m 12 204.143 25.457 217.6 42 217.6 c 58.543 217.6 72 204.143 72
 187.6 c 72 171.057 58.543 157.6 42 157.6 c 25.457 157.6 12 171.057 12 187.6
 c h
366.801 75.998 m 43.602 75.998 l 34.883 75.998 27.48 81.717 24.938 89.6
 c 256.836 89.6 l 259.945 89.6 262.492 92.041 262.648 95.143 c 262.652 95.229
 262.656 95.311 262.664 95.393 c 262.852 98.756 260.223 101.6 256.855 101.6
 c 53.602 101.6 l 53.602 147.245 l 56.395 148.049 59.074 149.131 61.602 
150.471 c 61.602 115.6 l 61.602 112.288 64.285 109.6 67.602 109.6 c 341.199
 109.6 l 344.512 109.6 347.199 112.288 347.199 115.6 c 347.199 264.401 l
 347.199 265.475 346.914 266.483 346.418 267.354 c 349.164 265.745 352.105
 264.428 355.199 263.471 c 355.199 101.6 l 293.891 101.6 l 290.477 101.6
 287.777 98.674 288.094 95.276 c 288.105 95.155 288.113 95.038 288.125 94.916
 c 288.379 91.909 290.902 89.6 293.922 89.6 c 385.461 89.6 l 382.922 81.717
 375.516 75.998 366.801 75.998 c h
366.801 75.998 m f
153.199 261.6 m 154.398 261.6 l 154.398 257.998 l 154.398 254.686 157.086
 251.998 160.398 251.998 c 163.715 251.998 166.398 254.686 166.398 257.998
 c 166.398 261.6 l 168.398 261.6 l 171.715 261.6 174.398 264.288 174.398
 267.6 c 174.398 270.913 171.715 273.6 168.398 273.6 c 166.398 273.6 l 166.398
 280.401 l 166.398 281.502 167.297 282.401 168.398 282.401 c 169.504 282.401
 170.398 281.502 170.398 280.401 c 170.398 279.6 l 170.398 276.288 173.086
 273.6 176.398 273.6 c 179.715 273.6 182.398 276.288 182.398 279.6 c 182.398
 280.401 l 182.398 288.12 176.121 294.401 168.398 294.401 c 160.68 294.401
 154.398 288.12 154.398 280.401 c 154.398 273.6 l 153.199 273.6 l 149.887
 273.6 147.199 270.913 147.199 267.6 c 147.199 264.288 149.887 261.6 153.199
 261.6 c h
153.199 261.6 m f
367.602 281.6 m 370.707 281.6 373.762 282.26 376.578 283.526 c 380.695 
281.983 l 381.379 281.725 382.094 281.6 382.801 281.6 c 384.324 281.6 385.824
 282.182 386.965 283.28 c 388.629 284.885 389.223 287.303 388.492 289.495
 c 387.148 293.526 l 388.762 296.631 389.602 300.061 389.602 303.6 c 389.602
 315.729 379.73 325.6 367.602 325.6 c 355.469 325.6 345.602 315.729 345.602
 303.6 c 345.602 291.471 355.469 281.6 367.602 281.6 c h
367.602 313.6 m 373.113 313.6 377.602 309.116 377.602 303.6 c 377.602 301.506
 376.945 299.491 375.711 297.776 c 375.305 297.213 375.004 296.592 374.816
 295.944 c 374.16 295.791 373.523 295.53 372.938 295.159 c 371.332 294.139
 369.484 293.6 367.602 293.6 c 362.086 293.6 357.602 298.088 357.602 303.6
 c 357.602 309.116 362.086 313.6 367.602 313.6 c h
367.602 313.6 m f
47.199 187.6 m 47.199 184.729 44.871 182.401 42 182.401 c 39.129 182.401
 36.801 184.729 36.801 187.6 c 36.801 190.471 39.129 192.799 42 192.799 
c 44.871 192.799 47.199 190.471 47.199 187.6 c h
47.199 187.6 m f
28.801 187.6 m 28.801 184.729 26.473 182.401 23.602 182.401 c 20.727 182.401
 18.398 184.729 18.398 187.6 c 18.398 190.471 20.727 192.799 23.602 192.799
 c 26.473 192.799 28.801 190.471 28.801 187.6 c h
28.801 187.6 m f
65.602 187.6 m 65.602 184.729 63.273 182.401 60.398 182.401 c 57.527 182.401
 55.199 184.729 55.199 187.6 c 55.199 190.471 57.527 192.799 60.398 192.799
 c 63.273 192.799 65.602 190.471 65.602 187.6 c h
65.602 187.6 m f
281.434 219.202 m 280.078 219.202 l 269.633 219.202 260.727 212.514 257.398
 203.202 c 246 203.202 l 246 213.202 l 246 216.264 243.691 218.834 240.645
 219.166 c 212.551 222.205 184.059 222.205 155.961 219.166 c 153.508 218.901
 151.465 217.159 150.816 214.776 c 146.008 197.135 145.973 175.858 150.703
 149.733 c 151.141 147.307 153.016 145.401 155.43 144.916 c 169.652 142.069
 183.977 140.647 198.301 140.647 c 212.629 140.647 226.953 142.069 241.176
 144.916 c 243.98 145.479 246 147.94 246 150.799 c 246 160.799 l 257.398
 160.799 l 260.727 151.487 269.633 144.799 280.078 144.799 c 281.434 144.799
 l 287.262 144.799 292 149.541 292 155.366 c 292 208.635 l 292 214.459 287.262
 219.202 281.434 219.202 c h
234 155.776 m 210.023 151.561 185.781 151.604 161.809 155.92 c 158.434 
176.436 158.305 193.448 161.422 207.663 c 185.523 210.002 209.895 210.041
 234 207.776 c h
255.199 172.799 m 246.398 172.799 l 246.398 191.202 l 255.199 191.202 l
 h
280 156.799 m 273.375 156.842 268 162.245 268 168.877 c 268 195.123 l 268
 201.756 273.375 207.159 280 207.202 c h
280 156.799 m f
224.398 189.998 m 224.398 183.815 219.387 178.799 213.199 178.799 c 207.016
 178.799 202 183.815 202 189.998 c 202 196.186 207.016 201.202 213.199 201.202
 c 219.387 201.202 224.398 196.186 224.398 189.998 c h
224.398 189.998 m f
178.398 176.401 m 175.086 176.401 172.398 173.713 172.398 170.401 c 172.398
 167.084 175.086 164.401 178.398 164.401 c 196.801 164.401 l 200.113 164.401
 202.801 167.084 202.801 170.401 c 202.801 173.713 200.113 176.401 196.801
 176.401 c h
178.398 176.401 m f
Q Q
showpage
%%Trailer
end restore
%%EOF
