%!PS-Adobe-3.0 EPSF-3.0
%%Creator: cairo 1.14.2 (http://cairographics.org)
%%CreationDate: Mon Feb 19 09:15:05 2018
%%Pages: 1
%%DocumentData: Clean7Bit
%%LanguageLevel: 2
%%BoundingBox: 0 -1 410 410
%%EndComments
%%BeginProlog
save
50 dict begin
/q { gsave } bind def
/Q { grestore } bind def
/cm { 6 array astore concat } bind def
/w { setlinewidth } bind def
/J { setlinecap } bind def
/j { setlinejoin } bind def
/M { setmiterlimit } bind def
/d { setdash } bind def
/m { moveto } bind def
/l { lineto } bind def
/c { curveto } bind def
/h { closepath } bind def
/re { exch dup neg 3 1 roll 5 3 roll moveto 0 rlineto
      0 exch rlineto 0 rlineto closepath } bind def
/S { stroke } bind def
/f { fill } bind def
/f* { eofill } bind def
/n { newpath } bind def
/W { clip } bind def
/W* { eoclip } bind def
/BT { } bind def
/ET { } bind def
/pdfmark where { pop globaldict /?pdfmark /exec load put }
    { globaldict begin /?pdfmark /pop load def /pdfmark
    /cleartomark load def end } ifelse
/BDC { mark 3 1 roll /BDC pdfmark } bind def
/EMC { mark /EMC pdfmark } bind def
/cairo_store_point { /cairo_point_y exch def /cairo_point_x exch def } def
/Tj { show currentpoint cairo_store_point } bind def
/TJ {
  {
    dup
    type /stringtype eq
    { show } { -0.001 mul 0 cairo_font_matrix dtransform rmoveto } ifelse
  } forall
  currentpoint cairo_store_point
} bind def
/cairo_selectfont { cairo_font_matrix aload pop pop pop 0 0 6 array astore
    cairo_font exch selectfont cairo_point_x cairo_point_y moveto } bind def
/Tf { pop /cairo_font exch def /cairo_font_matrix where
      { pop cairo_selectfont } if } bind def
/Td { matrix translate cairo_font_matrix matrix concatmatrix dup
      /cairo_font_matrix exch def dup 4 get exch 5 get cairo_store_point
      /cairo_font where { pop cairo_selectfont } if } bind def
/Tm { 2 copy 8 2 roll 6 array astore /cairo_font_matrix exch def
      cairo_store_point /cairo_font where { pop cairo_selectfont } if } bind def
/g { setgray } bind def
/rg { setrgbcolor } bind def
/d1 { setcachedevice } bind def
%%EndProlog
%%BeginSetup
%%EndSetup
%%Page: 1 1
%%BeginPageSetup
%%PageBoundingBox: 0 -1 410 410
%%EndPageSetup
q 0 -1 410 411 rectclip q
1 0.811765 0.34902 rg
235.805 209.495 m 238.871 214.241 241.246 219.893 242.875 226.295 c 218.797
 245.307 204.996 273.768 204.996 304.424 c 204.996 359.784 250.738 404.788
 306.09 403.913 c 360.098 403.057 403.793 358.959 403.996 304.799 c 404.191
 252.471 363.352 208.549 311.137 205.139 c 298.391 204.307 285.77 205.873
 273.781 209.76 c 266.547 205.53 255.961 202.151 242.309 199.717 c 236.449
 198.67 l 233.168 198.088 230.77 201.694 232.578 204.495 c h
235.805 209.495 m f
1 0.709804 0.360784 rg
325.5 207.237 m 328.352 213.217 326.961 220.389 322.18 224.975 c 302.668
 243.69 291.66 269.319 291.66 296.698 c 291.66 339.041 318.422 375.327 355.777
 389.655 c 340.324 398.991 322.145 404.245 302.734 403.909 c 249.5 402.979
 206.086 359.709 205.016 306.479 c 204.383 275.045 218.258 245.733 242.875
 226.295 c 241.246 219.893 238.871 214.245 235.805 209.495 c 232.578 204.495
 l 230.77 201.698 233.168 198.088 236.449 198.674 c 242.309 199.717 l 255.961
 202.151 266.547 205.53 273.781 209.76 c 285.77 205.873 298.391 204.307 
311.133 205.139 c 316.012 205.459 320.793 206.131 325.449 207.131 c 325.465
 207.166 325.484 207.202 325.5 207.237 c h
325.5 207.237 m f
1 g
242.859 300.26 m 237.34 300.26 232.852 304.748 232.852 310.264 c 232.852
 315.784 237.34 320.272 242.859 320.272 c 248.375 320.272 252.863 315.784
 252.863 310.264 c 252.863 304.748 248.375 300.26 242.859 300.26 c h
242.859 300.26 m f
304.496 300.26 m 298.977 300.26 294.488 304.748 294.488 310.264 c 294.488
 315.784 298.977 320.272 304.496 320.272 c 310.012 320.272 314.5 315.784
 314.5 310.264 c 314.5 304.748 310.012 300.26 304.496 300.26 c h
304.496 300.26 m f
366.133 300.26 m 360.617 300.26 356.129 304.748 356.129 310.264 c 356.129
 315.784 360.613 320.272 366.133 320.272 c 371.652 320.272 376.141 315.784
 376.141 310.264 c 376.141 304.748 371.652 300.26 366.133 300.26 c h
366.133 300.26 m f
0.407843 g
160.18 229.424 m 154.418 237.686 l 29.043 239.803 l 21.812 230.065 l 17.168
 223.702 14.715 216.209 14.715 208.405 c 14.715 176.362 l 166.809 176.362
 l 166.809 208.405 l 166.809 215.94 164.52 223.209 160.18 229.424 c h
160.18 229.424 m f
0.207843 g
89.82 202.401 m 78.512 202.401 64.164 207.088 53.449 211.354 c 43.117 215.467
 34.312 222.713 28.492 232.19 c 28.18 232.694 27.938 233.112 27.793 233.401
 c 27.293 234.413 27.066 235.538 27.141 236.663 c 27.691 245.143 34.234 
253.088 45.559 259.034 c 57.391 265.248 73.109 268.67 89.82 268.67 c 91.031
 268.67 92.262 268.647 93.582 268.608 c 94.031 268.663 l 94.391 268.647 
l 95.371 268.623 96.984 268.596 99.113 268.596 c 104.348 268.596 112.375
 268.76 120.914 269.534 c 134.68 270.784 144.723 273.17 150.77 276.623 c
 152.211 277.448 l 154.98 279.03 158.504 277.678 159.504 274.651 c 160.027
 273.077 l 163.945 261.233 162.238 249.147 154.953 237.155 c 154.902 237.061
 154.836 236.936 154.758 236.784 c 147.398 222.639 137.852 215.112 131.141
 211.288 c 131 211.205 l 130.855 211.135 l 119.68 205.502 105.105 202.401
 89.82 202.401 c h
89.82 202.401 m f
0.188235 0.164706 0.129412 rg
99.684 221.061 m 89.355 225.174 80.547 232.42 74.727 241.893 c 74.414 242.401
 74.176 242.815 74.031 243.108 c 73.531 244.12 73.305 245.245 73.375 246.37
 c 73.926 254.807 80.41 262.717 91.641 268.655 c 91.023 268.666 90.422 268.67
 89.82 268.67 c 73.109 268.67 57.391 265.248 45.559 259.038 c 34.234 253.088
 27.691 245.143 27.141 236.666 c 27.066 235.541 27.293 234.416 27.793 233.405
 c 27.938 233.112 28.18 232.698 28.492 232.19 c 34.312 222.717 43.121 215.471
 53.449 211.358 c 64.168 207.088 78.512 202.401 89.824 202.401 c 105.105
 202.401 119.68 205.502 130.855 211.135 c 131 211.209 l 131.141 211.291 
l 131.656 211.584 132.191 211.905 132.734 212.241 c 122.035 213.006 109.379
 217.198 99.684 221.061 c h
99.684 221.061 m f
0.858824 0.682353 0.431373 rg
17.297 147.721 m 10.848 147.721 5.602 152.967 5.602 159.416 c 5.602 165.471
 l 5.602 170.768 9.184 175.413 14.309 176.772 c 14.309 176.772 16.816 177.166
 17.297 177.166 c 33.293 177.166 l 33.293 147.721 l h
17.297 147.721 m f
164.227 147.721 m 170.676 147.721 175.922 152.967 175.922 159.416 c 175.922
 165.471 l 175.922 170.768 172.344 175.413 167.215 176.772 c 167.215 176.772
 164.707 177.166 164.227 177.166 c 148.234 177.166 l 148.234 147.721 l h
164.227 147.721 m f
0.764706 0.854902 0.25098 rg
40.676 12.26 m 40.676 31.92 l 40.676 46.6 52.578 58.502 67.258 58.502 c
 113.102 58.502 l 127.781 58.502 139.68 46.6 139.68 31.92 c 139.68 12.26
 l 139.68 8.623 136.734 5.678 133.098 5.678 c 47.262 5.678 l 43.625 5.674
 40.676 8.623 40.676 12.26 c h
40.676 12.26 m f
0.678431 0.737255 0.0823529 rg
101.07 58.502 m 67.258 58.502 l 52.574 58.502 40.676 46.6 40.676 31.92 
c 40.676 12.26 l 40.676 8.623 43.625 5.674 47.258 5.674 c 72.465 5.674 l
 68.828 5.674 65.879 8.623 65.879 12.26 c 65.879 31.92 l 65.879 35.518 66.594
 38.944 67.891 42.073 c 69.395 45.709 74.129 46.604 76.922 43.834 c 80.449
 40.334 85.352 38.217 90.734 38.373 c 101 38.67 109.02 47.413 109.02 57.682
 c 109.02 58.502 l h
101.07 58.502 m f
0.980392 0.827451 0.576471 rg
90.18 52.475 m 82.867 52.475 76.918 58.424 76.918 65.737 c 76.918 96.702
 l 84.066 95.87 l 86.367 95.6 88.621 95.463 90.766 95.463 c 92.609 95.463
 94.512 95.557 96.41 95.745 c 103.438 96.436 l 103.438 65.737 l 103.438 
58.424 97.492 52.475 90.18 52.475 c h
90.18 52.475 m f
0.929412 0.717647 0.411765 rg
92.43 65.737 m 92.43 95.506 l 91.871 95.491 91.312 95.463 90.762 95.463
 c 88.617 95.463 86.363 95.6 84.062 95.87 c 76.918 96.702 l 76.918 65.737
 l 76.918 58.424 82.867 52.475 90.176 52.475 c 93.074 52.475 95.75 53.42
 97.934 55.002 c 94.605 57.413 92.43 61.323 92.43 65.737 c h
92.43 65.737 m f
0.980392 0.827451 0.576471 rg
90.188 82.838 m 58.109 83.151 32.492 109.768 32.492 141.85 c 32.492 208.401
 l 32.492 210.213 32.711 212.026 33.145 213.788 c 33.793 216.428 l 34.559
 219.561 38.242 220.928 40.867 219.057 c 43.082 217.475 l 54.512 209.319
 71.891 204.639 90.762 204.639 c 105.637 204.639 119.953 207.655 131.074
 213.135 c 131.316 213.252 l 131.555 213.346 l 131.859 213.522 l 131.98 
213.584 l 134.363 214.807 136.539 216.116 138.449 217.479 c 140.664 219.057
 l 143.289 220.924 146.973 219.557 147.738 216.428 c 148.387 213.788 l 148.812
 212.038 149.031 210.225 149.031 208.405 c 149.031 141.108 l 149.035 108.784
 122.578 82.526 90.188 82.838 c h
90.188 82.838 m f
0.929412 0.717647 0.411765 rg
140.664 219.057 m 138.453 217.479 l 136.539 216.12 134.363 214.807 131.98
 213.588 c 131.859 213.522 l 131.559 213.346 l 131.316 213.252 l 131.078
 213.135 l 119.953 207.659 105.637 204.639 90.766 204.639 c 71.891 204.639
 54.516 209.319 43.086 217.475 c 40.867 219.057 l 38.246 220.928 34.559 
219.561 33.793 216.432 c 33.145 213.788 l 32.711 212.026 32.492 210.217 
32.492 208.401 c 32.492 141.948 l 32.492 110.061 57.77 83.448 89.652 82.846
 c 94.988 82.748 100.164 83.373 105.094 84.627 c 82.91 93.842 67.395 115.998
 67.395 141.463 c 67.395 170.776 l 67.395 182.979 77.395 192.663 89.598 
192.604 c 89.664 192.604 89.734 192.604 89.801 192.604 c 105.703 192.604
 120.867 195.83 132.496 201.69 c 132.645 201.768 l 132.793 201.854 l 137.184
 204.354 142.738 208.393 148.164 214.698 c 147.738 216.428 l 146.973 219.557
 143.289 220.928 140.664 219.057 c h
140.664 219.057 m f
0 g
304.496 409.526 m 246.539 409.526 199.391 362.377 199.391 304.424 c 199.391
 273.303 212.855 244.323 236.48 224.288 c 234.113 216.784 229.723 208.018
 221.613 202.862 c 219.293 201.381 218.273 198.518 219.141 195.905 c 219.961
 193.436 222.266 191.791 224.836 191.791 c 224.984 191.791 225.133 191.799
 225.281 191.807 c 226.582 191.905 256.09 194.19 274.391 203.702 c 284.137
 200.791 294.25 199.319 304.492 199.319 c 362.449 199.319 409.598 246.467
 409.598 304.424 c 409.598 362.377 362.449 409.526 304.496 409.526 c h
304.496 211.327 m 294.633 211.327 284.91 212.866 275.598 215.905 c 273.957
 216.44 272.164 216.245 270.68 215.366 c 262.727 210.666 250.895 207.752
 241.184 206.022 c 244.656 211.401 247.34 217.768 249.148 224.991 c 249.723
 227.288 248.895 229.709 247.031 231.17 c 224.387 248.963 211.395 275.663
 211.395 304.424 c 211.395 355.756 253.16 397.522 304.492 397.522 c 355.828
 397.522 397.59 355.76 397.59 304.424 c 397.59 253.088 355.828 211.327 304.496
 211.327 c h
304.496 211.327 m f
172.414 180.705 m 172.414 208.405 l 172.414 219.28 168.305 229.545 160.793
 237.541 c 176.938 265.686 162.188 284.776 161.539 285.588 c 160.371 287.057
 158.594 287.909 156.707 287.85 c 154.832 287.807 153.082 286.889 151.98
 285.37 c 146.406 277.678 114.496 275.057 94.684 275.709 c 94.391 275.717
 94.102 275.705 93.816 275.67 c 92.762 275.698 91.754 275.709 90.766 275.709
 c 53.902 275.709 24.727 259.967 22.555 239.436 c 22.137 238.971 l 13.734
 230.788 9.113 219.94 9.113 208.405 c 9.113 180.705 l 3.691 177.78 0 172.049
 0 165.471 c 0 159.413 l 0 149.862 7.742 142.12 17.297 142.12 c 26.887 142.12
 l 26.887 141.108 l 26.887 112.666 45.574 88.518 71.312 80.272 c 71.312 
65.116 l 71.312 64.776 71.324 64.44 71.34 64.104 c 67.258 64.104 l 49.48
 64.104 35.07 49.694 35.07 31.92 c 35.07 11.639 l 35.07 5.252 40.25 0.073
 46.641 0.073 c 64.402 0.073 l 67.719 0.073 70.406 2.76 70.406 6.077 c 70.406
 9.393 67.719 12.08 64.402 12.08 c 47.082 12.08 l 47.082 31.92 l 47.082 
43.065 56.113 52.096 67.258 52.096 c 76.547 52.096 l 79.984 48.498 84.824
 46.252 90.18 46.252 c 95.535 46.252 100.375 48.498 103.812 52.096 c 113.102
 52.096 l 124.242 52.096 133.277 43.065 133.277 31.92 c 133.277 12.08 l 
103.473 12.08 l 100.156 12.08 97.469 9.393 97.469 6.077 c 97.469 2.76 100.156
 0.073 103.473 0.073 c 133.719 0.073 l 140.105 0.073 145.285 5.252 145.285
 11.639 c 145.285 31.92 l 145.285 49.694 130.875 64.104 113.102 64.104 c
 109.016 64.104 l 109.031 64.44 109.043 64.776 109.043 65.116 c 109.043 
79.913 l 135.379 87.795 154.637 112.237 154.637 141.108 c 154.637 142.12
 l 164.23 142.12 l 173.781 142.12 181.527 149.862 181.527 159.416 c 181.527
 165.471 l 181.527 172.049 177.832 177.78 172.414 180.705 c h
26.891 154.127 m 17.297 154.127 l 14.379 154.127 12.008 156.498 12.008 
159.416 c 12.008 165.471 l 12.008 167.92 13.684 169.979 15.945 170.58 c 
16.172 170.612 16.395 170.655 16.613 170.709 c 16.84 170.741 17.066 170.76
 17.297 170.76 c 26.891 170.76 l h
26.891 208.405 m 26.891 182.768 l 21.121 182.768 l 21.121 208.405 l 21.121
 214.885 23.18 221.073 26.988 226.291 c 27.91 224.713 28.949 223.034 30.074
 221.397 c 27.996 217.405 26.891 212.928 26.891 208.405 c h
97.035 65.116 m 97.035 61.334 93.961 58.26 90.18 58.26 c 86.398 58.26 83.324
 61.334 83.324 65.116 c 83.324 77.678 l 85.766 77.397 88.246 77.233 90.762
 77.233 c 92.879 77.233 94.969 77.342 97.035 77.545 c 97.035 77.545 97.035
 65.116 97.035 65.116 c h
142.629 141.108 m 142.629 112.506 119.363 89.241 90.766 89.241 c 62.164
 89.241 38.898 112.506 38.898 141.108 c 38.898 208.405 l 38.898 209.709 
39.059 211.006 39.363 212.26 c 51.758 203.416 70.543 198.233 90.766 198.233
 c 106.766 198.233 122.078 201.565 133.906 207.389 c 134.168 207.491 134.426
 207.608 134.676 207.752 c 134.754 207.795 134.828 207.842 134.91 207.889
 c 137.516 209.225 139.953 210.682 142.168 212.26 c 142.477 211.006 142.633
 209.717 142.633 208.405 c 142.633 141.108 l h
148.219 238.264 m 147.605 236.635 143.336 226.506 128.914 218.291 c 118.77
 213.178 105.188 210.241 90.762 210.241 c 71.527 210.241 53.445 215.596 
43.574 224.213 c 43.168 224.569 42.73 224.881 42.27 225.151 c 39.156 228.823
 36.055 234.498 34.473 237.686 c 34.867 243.772 40.277 249.971 49.477 254.803
 c 60.406 260.541 75.066 263.705 90.762 263.705 c 91.902 263.705 93.066 
263.686 94.324 263.647 c 94.613 263.639 94.902 263.651 95.188 263.682 c 
98.438 263.608 109.887 263.459 122.434 264.596 c 137.23 265.94 147.965 268.545
 154.891 272.502 c 156.883 266.483 157.949 255.893 149.555 242.127 c 148.816
 240.913 148.375 239.596 148.219 238.264 c h
152.656 218.791 m 152.316 219.651 151.867 220.436 151.34 221.151 c 152.742
 222.764 153.93 224.315 154.93 225.76 c 158.492 220.655 160.406 214.666 
160.406 208.405 c 160.406 182.768 l 154.637 182.768 l 154.637 208.405 l 
154.637 211.991 153.969 215.483 152.656 218.791 c h
169.52 159.416 m 169.52 156.498 167.145 154.127 164.23 154.127 c 154.637
 154.127 l 154.637 170.76 l 164.23 170.76 l 164.461 170.76 164.688 170.741
 164.914 170.709 c 165.129 170.655 165.352 170.612 165.578 170.58 c 167.844
 169.979 169.52 167.92 169.52 165.471 c h
169.52 159.416 m f
242.859 325.873 m 234.25 325.873 227.246 318.873 227.246 310.264 c 227.246
 301.659 234.25 294.655 242.859 294.655 c 251.465 294.655 258.469 301.659
 258.469 310.264 c 258.469 318.873 251.465 325.873 242.859 325.873 c h
242.859 306.663 m 240.871 306.663 239.254 308.28 239.254 310.264 c 239.254
 312.252 240.871 313.87 242.859 313.87 c 244.844 313.87 246.461 312.252 
246.461 310.264 c 246.461 308.28 244.844 306.663 242.859 306.663 c h
242.859 306.663 m f
304.496 325.873 m 295.887 325.873 288.887 318.873 288.887 310.264 c 288.887
 301.659 295.887 294.655 304.496 294.655 c 313.102 294.655 320.105 301.659
 320.105 310.264 c 320.105 318.873 313.102 325.873 304.496 325.873 c h
304.496 306.663 m 302.508 306.663 300.895 308.28 300.895 310.264 c 300.895
 312.252 302.508 313.87 304.496 313.87 c 306.48 313.87 308.098 312.252 308.098
 310.264 c 308.098 308.28 306.48 306.663 304.496 306.663 c h
304.496 306.663 m f
366.133 325.873 m 357.527 325.873 350.523 318.873 350.523 310.264 c 350.523
 301.659 357.527 294.655 366.133 294.655 c 374.742 294.655 381.742 301.659
 381.742 310.264 c 381.742 318.873 374.742 325.873 366.133 325.873 c h
366.133 306.663 m 364.148 306.663 362.531 308.28 362.531 310.264 c 362.531
 312.252 364.148 313.87 366.133 313.87 c 368.121 313.87 369.734 312.252 
369.734 310.264 c 369.734 308.28 368.121 306.663 366.133 306.663 c h
366.133 306.663 m f
Q Q
showpage
%%Trailer
end restore
%%EOF
