%!PS-Adobe-3.0 EPSF-3.0
%%Creator: cairo 1.14.2 (http://cairographics.org)
%%CreationDate: Mon Feb 19 09:15:05 2018
%%Pages: 1
%%DocumentData: Clean7Bit
%%LanguageLevel: 2
%%BoundingBox: 39 -1 370 410
%%EndComments
%%BeginProlog
save
50 dict begin
/q { gsave } bind def
/Q { grestore } bind def
/cm { 6 array astore concat } bind def
/w { setlinewidth } bind def
/J { setlinecap } bind def
/j { setlinejoin } bind def
/M { setmiterlimit } bind def
/d { setdash } bind def
/m { moveto } bind def
/l { lineto } bind def
/c { curveto } bind def
/h { closepath } bind def
/re { exch dup neg 3 1 roll 5 3 roll moveto 0 rlineto
      0 exch rlineto 0 rlineto closepath } bind def
/S { stroke } bind def
/f { fill } bind def
/f* { eofill } bind def
/n { newpath } bind def
/W { clip } bind def
/W* { eoclip } bind def
/BT { } bind def
/ET { } bind def
/pdfmark where { pop globaldict /?pdfmark /exec load put }
    { globaldict begin /?pdfmark /pop load def /pdfmark
    /cleartomark load def end } ifelse
/BDC { mark 3 1 roll /BDC pdfmark } bind def
/EMC { mark /EMC pdfmark } bind def
/cairo_store_point { /cairo_point_y exch def /cairo_point_x exch def } def
/Tj { show currentpoint cairo_store_point } bind def
/TJ {
  {
    dup
    type /stringtype eq
    { show } { -0.001 mul 0 cairo_font_matrix dtransform rmoveto } ifelse
  } forall
  currentpoint cairo_store_point
} bind def
/cairo_selectfont { cairo_font_matrix aload pop pop pop 0 0 6 array astore
    cairo_font exch selectfont cairo_point_x cairo_point_y moveto } bind def
/Tf { pop /cairo_font exch def /cairo_font_matrix where
      { pop cairo_selectfont } if } bind def
/Td { matrix translate cairo_font_matrix matrix concatmatrix dup
      /cairo_font_matrix exch def dup 4 get exch 5 get cairo_store_point
      /cairo_font where { pop cairo_selectfont } if } bind def
/Tm { 2 copy 8 2 roll 6 array astore /cairo_font_matrix exch def
      cairo_store_point /cairo_font where { pop cairo_selectfont } if } bind def
/g { setgray } bind def
/rg { setrgbcolor } bind def
/d1 { setcachedevice } bind def
%%EndProlog
%%BeginSetup
%%EndSetup
%%Page: 1 1
%%BeginPageSetup
%%PageBoundingBox: 39 -1 370 410
%%EndPageSetup
q 39 -1 331 411 rectclip q
1 0.811765 0.34902 rg
76.875 5.6 m 73.465 5.6 70.168 7.147 68.199 9.936 c 66.352 12.557 65.84
 15.799 66.801 18.87 c 95.465 110.682 l 96.527 114.084 99.68 116.401 103.242
 116.401 c 304.758 116.401 l 308.324 116.401 311.473 114.084 312.535 110.682
 c 341.199 18.87 l 342.16 15.803 341.648 12.561 339.805 9.94 c 337.836 7.151
 334.539 5.6 331.125 5.6 c h
76.875 5.6 m f
0.886275 0.603922 0.0470588 rg
102.375 116.401 m 305.75 116.401 l 204.801 56.221 l h
102.375 116.401 m f
0.937255 0.72549 0.247059 rg
76.559 5.6 m 73.27 5.6 70.27 7.12 68.32 9.768 c 66.375 12.416 65.82 15.733
 66.801 18.87 c 70.562 30.92 l 179.082 78.616 l 230.316 78.705 l 337.133
 31.889 l 341.199 18.87 l 342.18 15.733 341.625 12.416 339.676 9.768 c 337.73
 7.12 334.73 5.6 331.441 5.6 c h
76.559 5.6 m f
0.886275 0.603922 0.0470588 rg
204.801 56.221 m 237.348 75.623 l 230.316 78.705 l 179.082 78.616 l 171.988
 75.498 l h
204.801 56.221 m f
0.956863 0.67451 0.270588 rg
102.375 116.401 m 305.75 116.401 l 204.801 64.752 l h
102.375 116.401 m f
1 0.384314 0.654902 rg
302.145 339.998 m 238.734 339.998 l 102.832 339.94 l 98.98 339.416 l 84.059
 337.397 70.406 330.065 60.539 318.772 c 50.648 307.455 45.199 292.885 45.199
 277.745 c 45.199 270.252 l 45.199 235.873 73.07 207.998 107.453 207.998
 c 255.289 207.998 l 274.895 108.901 l 275.715 104.756 281.641 104.745 282.477
 108.885 c 302.477 208.002 l 336.652 208.182 364.398 236.038 364.398 270.252
 c 364.398 277.745 l 364.398 312.127 336.527 339.998 302.145 339.998 c h
302.145 339.998 m f
0.988235 0.329412 0.47451 rg
302.383 339.995 m 302.301 339.995 302.227 339.998 302.145 339.998 c 238.734
 339.998 l 102.832 339.94 l 98.98 339.416 l 98.148 339.303 97.32 339.17 
96.496 339.022 c 96.098 338.952 95.703 338.87 95.305 338.791 c 94.914 338.713
 94.527 338.639 94.141 338.553 c 93.613 338.44 93.09 338.319 92.57 338.19
 c 92.355 338.139 92.145 338.084 91.93 338.03 c 91.316 337.873 90.707 337.709
 90.098 337.538 c 78.688 334.252 68.406 327.776 60.539 318.772 c 50.648 
307.455 45.199 292.885 45.199 277.745 c 45.199 270.252 l 45.199 235.873 
73.07 207.998 107.453 207.998 c 184.215 207.998 l 149.832 207.998 121.961
 235.873 121.961 270.252 c 121.961 277.745 l 121.961 277.866 121.961 277.987
 121.961 278.104 c 122.066 296.459 137.18 311.202 155.535 311.202 c 175.062
 311.202 l 174.23 306.592 175.445 301.905 178.41 298.311 c 181.453 294.623
 185.93 292.506 190.695 292.506 c 194.227 292.506 197.582 293.663 200.406
 295.854 c 205.73 299.987 l 210.711 303.854 214.938 307.768 218.355 311.674
 c 234.211 314.053 247.258 325.202 252.418 339.971 c h
302.383 339.995 m f
1 0.811765 0.34902 rg
188.16 315.737 m 188.625 318.123 188.895 320.631 188.973 323.202 c 129.598
 323.202 l 112.59 323.202 98.801 336.987 98.801 353.995 c 98.801 373.205
 l 98.801 390.213 112.59 403.998 129.598 403.998 c 212.004 403.998 l 229.012
 403.998 242.801 390.213 242.801 373.205 c 242.801 353.995 l 242.801 337.084
 229.098 323.311 212.211 323.202 c 209.027 318.745 204.371 314.123 198.371
 309.463 c 193.043 305.33 l 190.227 303.143 186.203 305.616 186.879 309.12
 c h
188.16 315.737 m f
1 0.709804 0.360784 rg
138.586 342.944 m 138.586 362.151 l 138.586 379.159 152.371 392.948 169.379
 392.948 c 235.633 392.948 l 229.984 399.702 221.496 403.998 212.004 403.998
 c 129.598 403.998 l 112.59 403.998 98.801 390.213 98.801 373.205 c 98.801
 353.995 l 98.801 336.987 112.59 323.202 129.598 323.202 c 145.75 323.202
 l 141.277 328.545 138.586 335.428 138.586 342.944 c h
138.586 342.944 m f
187.465 312.147 m 186.879 309.12 l 186.203 305.616 190.227 303.143 193.047
 305.33 c 198.371 309.463 l 199.523 310.362 200.613 311.256 201.668 312.147
 c h
187.465 312.147 m f
0 g
302.145 345.6 m 247.418 345.6 l 248.059 348.295 248.398 351.108 248.398
 353.995 c 248.398 373.205 l 248.398 393.272 232.074 409.6 212.004 409.6
 c 129.598 409.6 l 109.527 409.6 93.199 393.272 93.199 373.205 c 93.199 
353.995 l 93.199 350.663 93.66 347.432 94.504 344.362 c 80.219 341.6 67.164
 334.291 57.25 323.397 c 45.867 310.885 39.602 294.674 39.602 277.745 c 
39.602 270.252 l 39.602 232.838 70.039 202.401 107.453 202.401 c 250.688
 202.401 l 266.594 121.998 l 97.543 121.998 l 94.922 121.998 92.598 120.295
 91.816 117.788 c 61.453 20.541 l 59.938 15.686 60.797 10.549 63.809 6.448
 c 66.824 2.35 71.473 -0.002 76.559 -0.002 c 331.441 -0.002 l 336.527 -0.002
 341.176 2.35 344.191 6.448 c 347.203 10.549 348.062 15.686 346.547 20.541
 c 316.184 117.788 l 315.402 120.295 313.082 122.002 310.457 122.002 c 291.625
 122.002 l 307.137 202.58 l 342.23 205.147 370 234.518 370 270.256 c 370
 277.748 l 370 315.163 339.562 345.6 302.145 345.6 c h
268.969 109.998 m 269.906 105.252 l 204.781 71.928 l 129.281 109.998 l 
h
101.957 109.998 m 102.629 109.998 l 165.004 78.545 l 80.547 41.428 l h
335.09 16.963 m 335.457 15.791 335.25 14.549 334.523 13.557 c 333.793 12.569
 332.672 11.998 331.441 11.998 c 76.559 11.998 l 75.328 11.998 74.207 12.569
 73.477 13.557 c 72.75 14.549 72.543 15.791 72.906 16.963 c 75.805 26.233
 l 178.895 71.541 l 202.098 59.842 l 202.949 59.413 203.875 59.202 204.801
 59.202 c 205.738 59.202 206.676 59.42 207.531 59.858 c 230.531 71.623 l
 331.895 27.198 l h
306.043 109.998 m 327.156 42.377 l 244.324 78.682 l 272.328 93.01 l 273.312
 88.038 l 273.871 85.225 276.336 83.202 279.199 83.202 c 279.215 83.202 
l 282.086 83.205 284.551 85.248 285.094 88.065 c 289.316 109.998 l h
358 270.252 m 358 239.455 332.945 214.401 302.145 214.401 c 299.27 214.401
 296.797 212.358 296.254 209.534 c 279.121 120.522 l 261.504 209.565 l 260.945
 212.373 258.48 214.401 255.617 214.401 c 107.453 214.401 l 76.605 214.401
 51.602 239.405 51.602 270.252 c 51.602 277.745 l 51.602 305.889 72.203 
329.33 99.84 333.073 c 103.844 327.397 109.43 322.92 115.945 320.272 c 119.867
 318.682 124.152 321.62 124.152 325.854 c 124.152 328.272 122.707 330.471
 120.465 331.381 c 111.523 335.002 105.199 343.772 105.199 353.995 c 105.199
 373.202 l 105.199 386.678 116.121 397.6 129.598 397.6 c 212.004 397.6 l
 225.477 397.6 236.398 386.678 236.398 373.205 c 236.398 353.995 l 236.398
 340.545 225.457 329.6 212.004 329.6 c 210.07 329.6 208.258 328.698 207.141
 327.116 c 203.926 322.545 199.195 318.209 194.445 314.522 c 194.992 317.338
 195.305 320.28 195.379 323.319 c 195.402 324.299 195.234 325.291 194.809
 326.174 c 193.777 328.323 191.648 329.6 189.387 329.6 c 157.188 329.6 l
 153.879 329.6 151.195 326.916 151.195 323.604 c 151.195 323.596 l 151.195
 320.284 153.879 317.6 157.188 317.6 c 182.82 317.6 l 181.797 311.522 179.406
 306.35 175.688 302.178 c 174.051 300.342 173.496 297.725 174.539 295.498
 c 175.598 293.245 177.773 291.998 180.004 291.998 c 180.941 291.998 181.895
 292.221 182.773 292.682 c 183.676 293.151 203.863 303.788 215.082 317.729
 c 226.32 318.674 236.113 324.756 242.125 333.6 c 302.145 333.6 l 332.992
 333.6 358 308.596 358 277.748 c h
358 270.252 m f
Q Q
showpage
%%Trailer
end restore
%%EOF
