%!PS-Adobe-3.0 EPSF-3.0
%%Creator: cairo 1.14.2 (http://cairographics.org)
%%CreationDate: Mon Feb 19 09:15:05 2018
%%Pages: 1
%%DocumentData: Clean7Bit
%%LanguageLevel: 2
%%BoundingBox: 38 -1 371 410
%%EndComments
%%BeginProlog
save
50 dict begin
/q { gsave } bind def
/Q { grestore } bind def
/cm { 6 array astore concat } bind def
/w { setlinewidth } bind def
/J { setlinecap } bind def
/j { setlinejoin } bind def
/M { setmiterlimit } bind def
/d { setdash } bind def
/m { moveto } bind def
/l { lineto } bind def
/c { curveto } bind def
/h { closepath } bind def
/re { exch dup neg 3 1 roll 5 3 roll moveto 0 rlineto
      0 exch rlineto 0 rlineto closepath } bind def
/S { stroke } bind def
/f { fill } bind def
/f* { eofill } bind def
/n { newpath } bind def
/W { clip } bind def
/W* { eoclip } bind def
/BT { } bind def
/ET { } bind def
/pdfmark where { pop globaldict /?pdfmark /exec load put }
    { globaldict begin /?pdfmark /pop load def /pdfmark
    /cleartomark load def end } ifelse
/BDC { mark 3 1 roll /BDC pdfmark } bind def
/EMC { mark /EMC pdfmark } bind def
/cairo_store_point { /cairo_point_y exch def /cairo_point_x exch def } def
/Tj { show currentpoint cairo_store_point } bind def
/TJ {
  {
    dup
    type /stringtype eq
    { show } { -0.001 mul 0 cairo_font_matrix dtransform rmoveto } ifelse
  } forall
  currentpoint cairo_store_point
} bind def
/cairo_selectfont { cairo_font_matrix aload pop pop pop 0 0 6 array astore
    cairo_font exch selectfont cairo_point_x cairo_point_y moveto } bind def
/Tf { pop /cairo_font exch def /cairo_font_matrix where
      { pop cairo_selectfont } if } bind def
/Td { matrix translate cairo_font_matrix matrix concatmatrix dup
      /cairo_font_matrix exch def dup 4 get exch 5 get cairo_store_point
      /cairo_font where { pop cairo_selectfont } if } bind def
/Tm { 2 copy 8 2 roll 6 array astore /cairo_font_matrix exch def
      cairo_store_point /cairo_font where { pop cairo_selectfont } if } bind def
/g { setgray } bind def
/rg { setrgbcolor } bind def
/d1 { setcachedevice } bind def
%%EndProlog
%%BeginSetup
%%EndSetup
%%Page: 1 1
%%BeginPageSetup
%%PageBoundingBox: 38 -1 371 410
%%EndPageSetup
q 38 -1 333 411 rectclip q
1 0.811765 0.34902 rg
233.574 188.799 m 72.953 188.799 l 57.184 188.799 44.398 201.584 44.398
 217.354 c 44.398 375.448 l 44.398 391.217 57.184 403.998 72.953 403.998
 c 336.648 403.998 l 352.414 403.998 365.199 391.217 365.199 375.448 c 365.199
 217.354 l 365.199 201.584 352.414 188.799 336.645 188.799 c 279.48 188.799
 l 266.039 54.381 l 262.801 27.299 l 262.43 24.166 257.902 24.104 257.441
 27.225 c h
233.574 188.799 m f
1 0.709804 0.360784 rg
108.801 191.799 m 108.801 349.889 l 108.801 365.659 121.586 378.444 137.355
 378.444 c 365.043 378.444 l 363.543 392.803 351.402 403.998 336.648 403.998
 c 72.953 403.998 l 57.184 403.998 44.398 391.217 44.398 375.448 c 44.398
 217.354 l 44.398 201.584 57.184 188.799 72.953 188.799 c 108.957 188.799
 l 108.855 189.788 108.801 190.784 108.801 191.799 c h
108.801 191.799 m f
0.192157 0.823529 0.968627 rg
85.152 265.6 58.328 -76.695 re f
0.0745098 0.67451 0.909804 rg
85.152 265.6 29.164 -76.695 re f
0.627451 0.458824 0.188235 rg
148.672 329.065 m 145.074 329.065 142.148 326.139 142.148 322.538 c 142.148
 310.241 l 142.148 309.139 141.25 308.241 140.148 308.241 c 139.043 308.241
 138.148 309.139 138.148 310.241 c 138.148 348.768 l 138.148 350.584 137.395
 352.366 136.086 353.651 c 134.879 354.83 133.297 355.495 131.625 355.518
 c 131.496 355.518 l 127.965 355.452 125.094 352.522 125.094 348.991 c 125.094
 320.924 l 125.094 319.819 124.195 318.924 123.094 318.924 c 121.992 318.924
 121.094 319.819 121.094 320.924 c 121.094 348.991 l 121.094 352.588 118.168
 355.518 114.566 355.518 c 110.969 355.518 108.043 352.588 108.043 348.991
 c 108.043 320.92 l 108.043 319.819 107.145 318.92 106.043 318.92 c 104.938
 318.92 104.043 319.819 104.043 320.92 c 104.043 348.991 l 104.043 352.588
 101.113 355.518 97.516 355.518 c 93.918 355.518 90.988 352.588 90.988 348.991
 c 90.988 320.92 l 90.988 319.819 90.09 318.92 88.988 318.92 c 87.887 318.92
 86.988 319.819 86.988 320.92 c 86.988 348.991 l 86.988 352.588 84.062 355.518
 80.461 355.518 c 76.863 355.518 73.938 352.588 73.938 348.991 c 73.938 
301.346 l 73.938 292.034 77.984 283.186 85.043 277.077 c 86.168 276.104 
l 86.168 271.198 l 142.238 271.198 l 142.469 276.104 l 143.582 277.026 l
 150.965 283.155 155.199 292.159 155.199 301.725 c 155.199 322.538 l 155.199
 326.139 152.273 329.065 148.672 329.065 c h
148.672 329.065 m f
0 0.443137 0.717647 rg
86.129 258.35 m 81.676 258.35 78.055 261.975 78.055 266.428 c 78.055 270.881
 81.676 274.502 86.129 274.502 c 142.492 274.502 l 146.945 274.502 150.57
 270.881 150.57 266.428 c 150.57 261.975 146.945 258.35 142.492 258.35 c
 h
86.129 258.35 m f
1 0.384314 0.654902 rg
170.008 265.6 58.328 -76.695 re f
0.988235 0.329412 0.47451 rg
170.008 265.6 29.164 -76.695 re f
0.980392 0.827451 0.576471 rg
233.535 329.065 m 229.938 329.065 227.012 326.139 227.012 322.538 c 227.012
 310.241 l 227.012 309.139 226.113 308.241 225.012 308.241 c 223.906 308.241
 223.012 309.139 223.012 310.241 c 223.012 348.768 l 223.012 350.584 222.258
 352.366 220.945 353.651 c 219.742 354.83 218.16 355.495 216.488 355.518
 c 216.359 355.518 l 212.828 355.452 209.957 352.522 209.957 348.991 c 209.957
 320.924 l 209.957 319.819 209.059 318.924 207.957 318.924 c 206.855 318.924
 205.957 319.819 205.957 320.924 c 205.957 348.991 l 205.957 352.588 203.031
 355.518 199.43 355.518 c 195.832 355.518 192.906 352.588 192.906 348.991
 c 192.906 320.92 l 192.906 319.819 192.008 318.92 190.906 318.92 c 189.801
 318.92 188.906 319.819 188.906 320.92 c 188.906 348.991 l 188.906 352.588
 185.977 355.518 182.379 355.518 c 178.781 355.518 175.852 352.588 175.852
 348.991 c 175.852 320.92 l 175.852 319.819 174.953 318.92 173.852 318.92
 c 172.75 318.92 171.852 319.819 171.852 320.92 c 171.852 348.991 l 171.852
 352.588 168.926 355.518 165.324 355.518 c 161.727 355.518 158.801 352.588
 158.801 348.991 c 158.801 301.346 l 158.801 292.034 162.848 283.186 169.906
 277.077 c 171.031 276.104 l 171.031 272.366 l 227.664 272.366 l 227.332
 276.104 l 228.445 277.026 l 235.828 283.155 240.062 292.159 240.062 301.725
 c 240.062 322.538 l 240.062 326.139 237.137 329.065 233.535 329.065 c h
233.535 329.065 m f
0.917647 0.121569 0.34902 rg
170.992 258.35 m 166.539 258.35 162.918 261.975 162.918 266.428 c 162.918
 270.881 166.539 274.502 170.992 274.502 c 227.355 274.502 l 231.809 274.502
 235.434 270.881 235.434 266.428 c 235.434 261.975 231.809 258.35 227.355
 258.35 c h
170.992 258.35 m f
0.709804 0.768627 0.133333 rg
254.871 265.6 58.328 -76.695 re f
0.678431 0.737255 0.0823529 rg
254.871 265.6 29.164 -76.695 re f
0.980392 0.827451 0.576471 rg
318.398 329.065 m 314.801 329.065 311.875 326.139 311.875 322.538 c 311.875
 310.241 l 311.875 309.139 310.977 308.241 309.875 308.241 c 308.77 308.241
 307.875 309.139 307.875 310.241 c 307.875 348.768 l 307.875 350.584 307.121
 352.366 305.809 353.651 c 304.605 354.83 303.023 355.495 301.352 355.518
 c 301.223 355.518 l 297.691 355.452 294.82 352.522 294.82 348.991 c 294.82
 320.924 l 294.82 319.819 293.922 318.924 292.82 318.924 c 291.719 318.924
 290.82 319.819 290.82 320.924 c 290.82 348.991 l 290.82 352.588 287.895
 355.518 284.293 355.518 c 280.695 355.518 277.77 352.588 277.77 348.991
 c 277.77 320.92 l 277.77 319.819 276.871 318.92 275.77 318.92 c 274.664
 318.92 273.77 319.819 273.77 320.92 c 273.77 348.991 l 273.77 352.588 270.84
 355.518 267.242 355.518 c 263.645 355.518 260.715 352.588 260.715 348.991
 c 260.715 320.92 l 260.715 319.819 259.816 318.92 258.715 318.92 c 257.613
 318.92 256.715 319.819 256.715 320.92 c 256.715 348.991 l 256.715 352.588
 253.789 355.518 250.188 355.518 c 246.59 355.518 243.664 352.588 243.664
 348.991 c 243.664 301.346 l 243.664 292.034 247.711 283.186 254.77 277.077
 c 255.895 276.104 l 255.895 271.198 l 312.086 271.198 l 312.195 276.104
 l 313.309 277.026 l 320.691 283.155 324.926 292.159 324.926 301.725 c 324.926
 322.538 l 324.926 326.139 322 329.065 318.398 329.065 c h
318.398 329.065 m f
0.509804 0.321569 0.0666667 rg
75.008 321.065 m 78.156 321.065 80.707 323.62 80.707 326.764 c 80.707 348.991
 l 80.707 351.35 81.969 353.413 83.848 354.561 c 82.66 355.288 81.23 355.651
 79.703 355.475 c 76.371 355.088 73.938 352.127 73.938 348.772 c 73.938 
321.065 l h
75.008 321.065 m f
0.929412 0.717647 0.411765 rg
159.871 321.065 m 163.02 321.065 165.57 323.62 165.57 326.764 c 165.57 
348.991 l 165.57 351.35 166.832 353.413 168.711 354.561 c 167.523 355.288
 166.094 355.651 164.566 355.475 c 161.234 355.088 158.801 352.127 158.801
 348.772 c 158.801 321.065 l h
159.871 321.065 m f
245.766 321.065 m 248.344 321.065 250.434 323.155 250.434 325.733 c 250.434
 348.991 l 250.434 351.35 251.695 353.413 253.574 354.561 c 252.387 355.288
 250.957 355.651 249.43 355.475 c 246.102 355.088 243.664 352.127 243.664
 348.772 c 243.664 321.065 l h
245.766 321.065 m f
0.509804 0.321569 0.0666667 rg
99.66 355.147 m 98.555 355.534 97.32 355.647 96.023 355.338 c 93.027 354.627
 90.988 351.827 90.988 348.745 c 90.988 321.065 l 91.125 321.065 l 94.273
 321.065 96.824 323.62 96.824 326.764 c 96.824 349.791 l 96.824 352.018 
97.957 353.971 99.66 355.147 c h
99.66 355.147 m f
0.929412 0.717647 0.411765 rg
184.523 355.147 m 183.418 355.534 182.184 355.647 180.887 355.338 c 177.891
 354.627 175.852 351.827 175.852 348.745 c 175.852 321.065 l 175.988 321.065
 l 179.137 321.065 181.688 323.62 181.688 326.764 c 181.688 349.791 l 181.688
 352.018 182.82 353.971 184.523 355.147 c h
184.523 355.147 m f
269.387 355.147 m 268.281 355.534 267.047 355.647 265.75 355.338 c 262.754
 354.627 260.715 351.827 260.715 348.745 c 260.715 321.065 l 260.852 321.065
 l 264 321.065 266.551 323.62 266.551 326.764 c 266.551 349.791 l 266.551
 352.018 267.684 353.971 269.387 355.147 c h
269.387 355.147 m f
0.509804 0.321569 0.0666667 rg
116.625 355.178 m 115.516 355.549 114.277 355.643 112.988 355.323 c 110.039
 354.588 108.043 351.827 108.043 348.791 c 108.043 321.065 l 111.188 321.065
 113.742 323.62 113.742 326.764 c 113.742 349.791 l 113.742 352.038 114.895
 354.006 116.625 355.178 c h
116.625 355.178 m f
0.929412 0.717647 0.411765 rg
201.488 355.178 m 200.379 355.549 199.141 355.643 197.852 355.323 c 194.902
 354.588 192.906 351.827 192.906 348.791 c 192.906 321.065 l 196.055 321.065
 198.605 323.62 198.605 326.764 c 198.605 349.791 l 198.605 352.038 199.758
 354.006 201.488 355.178 c h
201.488 355.178 m f
286.352 355.178 m 285.242 355.549 284.004 355.643 282.715 355.323 c 279.766
 354.588 277.77 351.827 277.77 348.791 c 277.77 321.065 l 280.914 321.065
 283.469 323.62 283.469 326.764 c 283.469 349.791 l 283.469 352.038 284.621
 354.006 286.352 355.178 c h
286.352 355.178 m f
0.509804 0.321569 0.0666667 rg
125.094 348.991 m 125.094 321.065 l 125.266 321.065 l 128.414 321.065 130.965
 323.62 130.965 326.764 c 130.965 349.791 l 130.965 351.998 132.078 353.936
 133.758 355.116 c 133.082 355.366 132.363 355.506 131.625 355.518 c 131.496
 355.518 l 127.965 355.448 125.094 352.522 125.094 348.991 c h
125.094 348.991 m f
0.929412 0.717647 0.411765 rg
209.957 348.991 m 209.957 321.065 l 210.129 321.065 l 213.277 321.065 215.828
 323.62 215.828 326.764 c 215.828 349.791 l 215.828 351.998 216.941 353.936
 218.621 355.116 c 217.945 355.366 217.227 355.506 216.488 355.518 c 216.359
 355.518 l 212.828 355.448 209.957 352.522 209.957 348.991 c h
209.957 348.991 m f
294.82 348.991 m 294.82 321.065 l 294.992 321.065 l 298.141 321.065 300.691
 323.62 300.691 326.764 c 300.691 349.791 l 300.691 351.998 301.805 353.936
 303.484 355.116 c 302.809 355.366 302.09 355.506 301.352 355.518 c 301.223
 355.518 l 297.691 355.448 294.82 352.522 294.82 348.991 c h
294.82 348.991 m f
0.509804 0.321569 0.0666667 rg
148.625 322.932 m 148.625 325.209 149.809 327.205 151.582 328.373 c 150.422
 328.955 149.07 329.209 147.641 328.983 c 144.434 328.475 142.148 325.569
 142.148 322.319 c 142.148 310.241 l 142.148 309.862 142.035 309.51 141.852
 309.209 c 141.852 308.971 l 142.922 308.971 l 146.07 308.971 148.621 311.522
 148.621 314.67 c 148.621 322.932 l h
148.625 322.932 m f
0.929412 0.717647 0.411765 rg
233.488 322.932 m 233.488 325.209 234.672 327.205 236.445 328.373 c 235.285
 328.955 233.934 329.209 232.504 328.983 c 229.297 328.475 227.012 325.569
 227.012 322.319 c 227.012 310.241 l 227.012 309.862 226.898 309.51 226.715
 309.209 c 226.715 308.971 l 227.785 308.971 l 230.934 308.971 233.484 311.522
 233.484 314.67 c h
233.488 322.932 m f
311.852 308.971 m 314.996 308.971 317.551 311.522 317.551 314.67 c 317.551
 323.729 l 317.551 325.807 318.527 327.651 320.043 328.846 c 318.863 329.155
 317.57 329.178 316.191 328.643 c 313.539 327.62 311.875 324.963 311.875
 322.12 c 311.875 310.241 l 311.875 309.756 311.695 309.319 311.406 308.971
 c h
311.852 308.971 m f
0.54902 0.607843 0 rg
255.855 258.35 m 251.402 258.35 247.781 261.975 247.781 266.428 c 247.781
 270.881 251.402 274.502 255.855 274.502 c 312.219 274.502 l 316.672 274.502
 320.297 270.881 320.297 266.428 c 320.297 261.975 316.672 258.35 312.219
 258.35 c h
255.855 258.35 m f
0.0117647 0.384314 0.568627 rg
107.219 266.428 m 107.219 270.881 110.84 274.502 115.293 274.502 c 86.129
 274.502 l 81.676 274.502 78.055 270.881 78.055 266.428 c 78.055 261.975
 81.676 258.35 86.129 258.35 c 115.293 258.35 l 110.84 258.35 107.219 261.975
 107.219 266.428 c h
107.219 266.428 m f
0.8 0.0352941 0.329412 rg
192.082 266.428 m 192.082 270.881 195.703 274.502 200.156 274.502 c 170.992
 274.502 l 166.539 274.502 162.918 270.881 162.918 266.428 c 162.918 261.975
 166.539 258.35 170.992 258.35 c 200.156 258.35 l 195.703 258.35 192.082
 261.975 192.082 266.428 c h
192.082 266.428 m f
0.443137 0.466667 0 rg
276.945 266.428 m 276.945 270.881 280.566 274.502 285.02 274.502 c 255.855
 274.502 l 251.402 274.502 247.781 270.881 247.781 266.428 c 247.781 261.975
 251.402 258.35 255.855 258.35 c 285.02 258.35 l 280.566 258.35 276.945 
261.975 276.945 266.428 c h
276.945 266.428 m f
0 g
336.648 409.6 m 72.953 409.6 l 54.121 409.6 38.801 394.28 38.801 375.448
 c 38.801 217.354 l 38.801 198.522 54.121 183.202 72.953 183.202 c 228.738
 183.202 l 254.863 5.127 l 255.297 2.178 257.828 -0.002 260.797 -0.002 c
 260.844 -0.002 260.891 -0.002 260.938 0.002 c 263.969 0.073 266.469 2.389
 266.77 5.405 c 284.551 183.202 l 336.648 183.202 l 355.48 183.202 370.801
 198.522 370.801 217.354 c 370.801 375.448 l 370.801 394.28 355.48 409.6
 336.648 409.6 c h
84.453 266.428 m 84.453 267.35 85.207 268.104 86.129 268.104 c 142.492 
268.104 l 143.418 268.104 144.168 267.35 144.168 266.428 c 144.168 265.502
 143.418 264.752 142.492 264.752 c 86.129 264.752 l 85.207 264.752 84.453
 265.502 84.453 266.428 c h
88.988 314.92 m 92.305 314.92 94.988 317.608 94.988 320.92 c 94.988 348.991
 l 94.988 350.385 96.125 351.518 97.516 351.518 c 98.91 351.518 100.043 
350.385 100.043 348.991 c 100.043 320.92 l 100.043 317.608 102.73 314.92
 106.043 314.92 c 109.355 314.92 112.043 317.608 112.043 320.92 c 112.043
 348.991 l 112.043 350.385 113.176 351.518 114.57 351.518 c 115.961 351.518
 117.094 350.385 117.094 348.991 c 117.094 320.92 l 117.094 317.608 119.781
 314.92 123.094 314.92 c 126.41 314.92 129.094 317.608 129.094 320.92 c 
129.094 348.991 l 129.094 350.358 130.207 351.491 131.57 351.518 c 132.367
 351.506 132.938 351.131 133.281 350.795 c 133.832 350.256 134.148 349.518
 134.148 348.768 c 134.148 310.241 l 134.148 306.928 136.836 304.241 140.148
 304.241 c 143.461 304.241 146.148 306.928 146.148 310.241 c 146.148 322.538
 l 146.148 323.932 147.281 325.065 148.676 325.065 c 150.066 325.065 151.199
 323.932 151.199 322.538 c 151.199 301.725 l 151.199 293.37 147.441 285.428
 141.027 280.104 c 87.66 280.104 l 81.543 285.401 77.938 293.205 77.938 
301.346 c 77.938 348.991 l 77.938 350.385 79.07 351.518 80.465 351.518 c
 81.855 351.518 82.992 350.385 82.992 348.991 c 82.992 320.92 l 82.988 317.608
 85.676 314.92 88.988 314.92 c h
165.148 195.202 m 149.074 195.202 l 149.074 204.729 l 149.074 208.147 146.191
 210.877 142.781 210.643 c 142.73 210.639 142.68 210.635 142.629 210.631
 c 139.508 210.428 137.074 207.85 137.074 204.721 c 137.074 195.303 l 91.547
 195.303 l 91.547 252.752 l 137.074 252.752 l 137.074 242.014 l 137.074 
238.873 139.531 236.288 142.668 236.104 c 142.719 236.1 142.77 236.096 142.82
 236.092 c 146.215 235.881 149.074 238.608 149.074 242.006 c 149.074 254.444
 l 153.297 256.776 156.168 261.272 156.168 266.428 c 156.168 269.721 155
 272.745 153.055 275.108 c 154.625 276.877 156.027 278.776 157.258 280.78
 c 158.43 278.819 159.77 276.955 161.266 275.213 c 159.266 272.834 158.055
 269.772 158.055 266.428 c 158.055 261.272 160.922 256.776 165.148 254.444
 c h
174.59 314.92 m 177.902 314.92 180.59 317.608 180.59 320.92 c 180.59 348.991
 l 180.59 350.385 181.723 351.518 183.117 351.518 c 184.508 351.518 185.641
 350.385 185.641 348.991 c 185.641 320.92 l 185.641 317.608 188.328 314.92
 191.641 314.92 c 194.957 314.92 197.641 317.608 197.641 320.92 c 197.641
 348.991 l 197.641 350.385 198.777 351.518 200.168 351.518 c 201.562 351.518
 202.695 350.385 202.695 348.991 c 202.695 320.92 l 202.695 317.608 205.379
 314.92 208.695 314.92 c 212.008 314.92 214.695 317.608 214.695 320.92 c
 214.695 348.991 l 214.695 350.358 215.805 351.491 217.172 351.518 c 217.215
 351.518 l 217.984 351.518 218.547 351.127 218.883 350.795 c 219.434 350.256
 219.75 349.514 219.75 348.768 c 219.75 310.241 l 219.75 306.924 222.434
 304.241 225.75 304.241 c 229.062 304.241 231.75 306.924 231.75 310.241 
c 231.75 322.538 l 231.75 323.932 232.883 325.065 234.273 325.065 c 235.668
 325.065 236.801 323.932 236.801 322.538 c 236.801 301.725 l 236.801 293.362
 233.031 285.409 226.629 280.104 c 173.262 280.104 l 167.141 285.401 163.539
 293.205 163.539 301.346 c 163.539 348.991 l 163.539 350.385 164.672 351.518
 166.062 351.518 c 167.457 351.518 168.59 350.385 168.59 348.991 c 168.59
 320.92 l 168.59 317.608 171.277 314.92 174.59 314.92 c h
222.676 195.303 m 177.148 195.303 l 177.148 252.752 l 222.676 252.752 l
 h
228.094 264.752 m 171.73 264.752 l 170.805 264.752 170.055 265.502 170.055
 266.428 c 170.055 267.354 170.805 268.104 171.73 268.104 c 228.094 268.104
 l 229.016 268.104 229.77 267.35 229.77 266.428 c 229.77 265.502 229.016
 264.752 228.094 264.752 c h
259.672 55.018 m 239.859 190.069 l 239.461 192.764 237.316 194.815 234.676
 195.147 c 234.676 254.444 l 238.898 256.776 241.77 261.272 241.77 266.428
 c 241.77 269.721 240.598 272.745 238.652 275.108 c 240.223 276.877 241.629
 278.776 242.859 280.78 c 244.031 278.819 245.367 276.955 246.863 275.213
 c 244.863 272.834 243.652 269.772 243.652 266.428 c 243.652 261.272 246.523
 256.776 250.746 254.444 c 250.746 189.303 l 250.746 185.987 253.434 183.303
 256.746 183.303 c 272.5 183.303 l h
259.895 317.323 m 263.207 317.323 265.895 320.006 265.895 323.323 c 265.895
 347.135 l 266.086 347.721 266.191 348.342 266.191 348.991 c 266.191 350.385
 267.324 351.518 268.715 351.518 c 270.109 351.518 271.242 350.385 271.242
 348.991 c 271.242 348.393 271.332 347.819 271.492 347.276 c 271.492 323.323
 l 271.492 320.006 274.18 317.323 277.492 317.323 c 280.809 317.323 283.492
 320.006 283.492 323.323 c 283.492 350.073 l 283.898 350.924 284.762 351.518
 285.77 351.518 c 287.16 351.518 288.293 350.385 288.293 348.991 c 288.293
 320.92 l 288.293 317.608 290.98 314.92 294.293 314.92 c 297.609 314.92 
300.293 317.608 300.293 320.92 c 300.293 348.991 l 300.293 350.358 301.402
 351.491 302.77 351.518 c 302.812 351.518 l 303.582 351.518 304.145 351.127
 304.48 350.795 c 305.031 350.256 305.348 349.514 305.348 348.768 c 305.348
 310.241 l 305.348 306.924 308.031 304.241 311.348 304.241 c 314.66 304.241
 317.348 306.924 317.348 310.241 c 317.348 322.538 l 317.348 323.932 318.48
 325.065 319.871 325.065 c 321.266 325.065 322.398 323.932 322.398 322.538
 c 322.398 301.725 l 322.398 293.362 318.629 285.409 312.227 280.104 c 258.859
 280.104 l 252.738 285.401 249.137 293.205 249.137 301.346 c 249.137 348.991
 l 249.137 350.385 250.27 351.518 251.664 351.518 c 252.637 351.518 253.473
 350.959 253.895 350.151 c 253.895 323.323 l 253.895 320.006 256.582 317.323
 259.895 317.323 c h
308.273 195.303 m 262.75 195.303 l 262.75 252.752 l 308.273 252.752 l h
313.691 264.752 m 257.328 264.752 l 256.406 264.752 255.652 265.502 255.652
 266.428 c 255.652 267.354 256.406 268.104 257.328 268.104 c 313.691 268.104
 l 314.617 268.104 315.371 267.35 315.371 266.428 c 315.371 265.502 314.617
 264.752 313.691 264.752 c h
358.801 217.354 m 358.801 205.139 348.863 195.202 336.648 195.202 c 320.273
 195.202 l 320.273 254.444 l 324.5 256.776 327.371 261.272 327.371 266.428
 c 327.371 269.721 326.199 272.745 324.254 275.108 c 330.703 282.373 334.398
 291.842 334.398 301.725 c 334.398 322.538 l 334.398 330.549 327.883 337.065
 319.875 337.065 c 319.012 337.065 318.168 336.991 317.348 336.846 c 317.348
 348.768 l 317.348 352.717 315.723 356.577 312.887 359.358 c 310.086 362.112
 306.438 363.6 302.547 363.514 c 299.48 363.455 296.637 362.432 294.312 
360.733 c 291.91 362.483 288.961 363.518 285.77 363.518 c 282.586 363.518
 279.637 362.487 277.242 360.745 c 274.848 362.487 271.898 363.518 268.715
 363.518 c 265.535 363.518 262.586 362.487 260.191 360.745 c 257.793 362.487
 254.848 363.518 251.664 363.518 c 243.652 363.518 237.137 356.998 237.137
 348.991 c 237.137 336.78 l 236.211 336.963 235.254 337.065 234.273 337.065
 c 233.414 337.065 232.57 336.991 231.75 336.846 c 231.75 348.768 l 231.75
 352.717 230.125 356.577 227.289 359.358 c 224.484 362.112 220.84 363.6 
216.945 363.514 c 213.883 363.455 211.039 362.432 208.711 360.733 c 206.312
 362.483 203.359 363.518 200.168 363.518 c 196.988 363.518 194.039 362.487
 191.645 360.745 c 189.246 362.487 186.301 363.518 183.117 363.518 c 179.934
 363.518 176.988 362.487 174.59 360.745 c 172.195 362.487 169.246 363.518
 166.062 363.518 c 158.055 363.518 151.539 356.998 151.539 348.991 c 151.539
 336.78 l 150.609 336.963 149.656 337.065 148.676 337.065 c 147.812 337.065
 146.969 336.991 146.148 336.846 c 146.148 348.768 l 146.148 352.717 144.523
 356.577 141.688 359.358 c 138.883 362.112 135.203 363.604 131.348 363.514
 c 128.281 363.455 125.438 362.428 123.113 360.733 c 120.715 362.483 117.762
 363.514 114.57 363.514 c 111.387 363.514 108.438 362.487 106.043 360.745
 c 103.645 362.487 100.699 363.514 97.516 363.514 c 94.332 363.514 91.387
 362.487 88.992 360.745 c 86.594 362.487 83.648 363.514 80.465 363.514 c
 72.453 363.514 65.938 356.998 65.938 348.991 c 65.938 301.346 l 65.938 
291.713 69.48 282.42 75.664 275.209 c 73.664 272.834 72.457 269.768 72.457
 266.424 c 72.457 261.268 75.324 256.772 79.551 254.444 c 79.551 195.202
 l 72.957 195.202 l 60.738 195.202 50.801 205.139 50.801 217.354 c 50.801
 375.448 l 50.801 387.663 60.738 397.6 72.953 397.6 c 336.648 397.6 l 348.863
 397.6 358.801 387.663 358.801 375.448 c h
358.801 217.354 m f
Q Q
showpage
%%Trailer
end restore
%%EOF
