%!PS-Adobe-3.0 EPSF-3.0
%%Creator: cairo 1.14.2 (http://cairographics.org)
%%CreationDate: Mon Feb 19 09:15:05 2018
%%Pages: 1
%%DocumentData: Clean7Bit
%%LanguageLevel: 2
%%BoundingBox: 62 -1 347 410
%%EndComments
%%BeginProlog
save
50 dict begin
/q { gsave } bind def
/Q { grestore } bind def
/cm { 6 array astore concat } bind def
/w { setlinewidth } bind def
/J { setlinecap } bind def
/j { setlinejoin } bind def
/M { setmiterlimit } bind def
/d { setdash } bind def
/m { moveto } bind def
/l { lineto } bind def
/c { curveto } bind def
/h { closepath } bind def
/re { exch dup neg 3 1 roll 5 3 roll moveto 0 rlineto
      0 exch rlineto 0 rlineto closepath } bind def
/S { stroke } bind def
/f { fill } bind def
/f* { eofill } bind def
/n { newpath } bind def
/W { clip } bind def
/W* { eoclip } bind def
/BT { } bind def
/ET { } bind def
/pdfmark where { pop globaldict /?pdfmark /exec load put }
    { globaldict begin /?pdfmark /pop load def /pdfmark
    /cleartomark load def end } ifelse
/BDC { mark 3 1 roll /BDC pdfmark } bind def
/EMC { mark /EMC pdfmark } bind def
/cairo_store_point { /cairo_point_y exch def /cairo_point_x exch def } def
/Tj { show currentpoint cairo_store_point } bind def
/TJ {
  {
    dup
    type /stringtype eq
    { show } { -0.001 mul 0 cairo_font_matrix dtransform rmoveto } ifelse
  } forall
  currentpoint cairo_store_point
} bind def
/cairo_selectfont { cairo_font_matrix aload pop pop pop 0 0 6 array astore
    cairo_font exch selectfont cairo_point_x cairo_point_y moveto } bind def
/Tf { pop /cairo_font exch def /cairo_font_matrix where
      { pop cairo_selectfont } if } bind def
/Td { matrix translate cairo_font_matrix matrix concatmatrix dup
      /cairo_font_matrix exch def dup 4 get exch 5 get cairo_store_point
      /cairo_font where { pop cairo_selectfont } if } bind def
/Tm { 2 copy 8 2 roll 6 array astore /cairo_font_matrix exch def
      cairo_store_point /cairo_font where { pop cairo_selectfont } if } bind def
/g { setgray } bind def
/rg { setrgbcolor } bind def
/d1 { setcachedevice } bind def
%%EndProlog
%%BeginSetup
%%EndSetup
%%Page: 1 1
%%BeginPageSetup
%%PageBoundingBox: 62 -1 347 410
%%EndPageSetup
q 62 -1 285 411 rectclip q
1 0.313726 0.490196 rg
129.617 362.687 m 88.93 362.687 l 77.543 362.687 68.281 371.952 68.281 
383.339 c 68.281 394.726 77.543 403.988 88.93 403.988 c 151.074 403.988 
l 162.461 403.988 171.723 394.726 171.723 383.339 c 171.723 371.952 162.461
 362.687 151.074 362.687 c 140.559 362.687 l 135.09 352.999 l h
129.617 362.687 m f
0.247059 0.152941 0.145098 rg
314.684 256.206 m 313.508 280.323 303.438 303.054 286.336 320.21 c 267.895
 338.706 243.359 348.894 217.242 348.894 c 163.445 348.894 119.68 305.128
 119.68 251.331 c 119.68 210.148 l 119.645 170.347 l 119.645 114.706 l 119.645
 104.777 127.723 96.702 137.648 96.702 c 294.805 96.702 l 304.734 96.702
 312.809 104.777 312.809 114.706 c 312.809 159.249 l 314.676 220.995 l 314.676
 255.484 l 314.699 255.843 l h
314.684 256.206 m f
0.192157 0.823529 0.968627 rg
252.418 66.054 m 183.051 66.054 l 162.355 66.054 145.52 49.218 145.52 28.523
 c 145.52 14.366 l 145.52 9.538 149.445 5.613 154.273 5.613 c 281.195 5.613
 l 286.023 5.613 289.949 9.538 289.949 14.366 c 289.949 28.523 l 289.949
 49.218 273.113 66.054 252.418 66.054 c h
252.418 66.054 m f
0.0745098 0.67451 0.909804 rg
217.734 31.722 m 235.188 31.722 249.387 45.921 249.387 63.374 c 249.387
 66.054 l 186.086 66.054 l 186.086 63.374 l 186.086 45.921 200.281 31.722
 217.734 31.722 c h
217.734 31.722 m f
189.953 14.366 m 189.953 28.523 l 189.953 49.218 206.789 66.054 227.48 
66.054 c 183.051 66.054 l 162.355 66.054 145.52 49.218 145.52 28.523 c 145.52
 14.366 l 145.52 9.538 149.449 5.613 154.273 5.613 c 198.707 5.613 l 193.879
 5.613 189.953 9.542 189.953 14.366 c h
189.953 14.366 m f
0.858824 0.682353 0.431373 rg
134.715 166.023 m 129.766 166.023 125 167.515 120.934 170.339 c 120.273
 170.8 l 119.789 171.359 l 119.129 171.698 l 118.52 172.249 l 113.426 176.843
 110.5 183.398 110.5 190.238 c 110.5 203.589 121.363 214.452 134.715 214.452
 c 141.652 214.452 l 141.652 166.023 l h
134.715 166.023 m f
0.980392 0.827451 0.576471 rg
217.734 52.601 m 206.238 52.601 196.887 61.952 196.887 73.448 c 196.887
 111.511 l 204.422 110.175 l 208.793 109.402 213.27 109.007 217.734 109.007
 c 222.199 109.007 226.68 109.402 231.047 110.175 c 238.582 111.511 l 238.582
 73.448 l 238.582 61.952 229.23 52.601 217.734 52.601 c h
217.734 52.601 m f
0.929412 0.717647 0.411765 rg
235.809 103.394 m 236.734 103.394 237.656 103.421 238.582 103.456 c 238.582
 105.898 l 231.047 104.562 l 229.633 104.308 228.207 104.113 226.77 103.945
 c 229.766 103.589 232.789 103.394 235.809 103.394 c h
235.809 103.394 m f
214.961 73.448 m 214.961 109.07 l 211.422 109.195 207.887 109.562 204.422
 110.175 c 196.887 111.511 l 196.887 73.448 l 196.887 61.952 206.238 52.601
 217.734 52.601 c 220.969 52.601 224.039 53.339 226.773 54.663 c 219.789
 58.034 214.961 65.187 214.961 73.448 c h
214.961 73.448 m f
0.980392 0.827451 0.576471 rg
217.734 94.433 m 175.34 94.433 140.848 128.925 140.848 171.32 c 140.848
 255.468 l 140.848 259.78 146.094 261.905 149.094 258.804 c 151.875 255.933
 l 154.254 253.472 157.027 251.159 160.125 249.05 c 172.152 240.863 188.156
 236.355 205.176 236.355 c 232.508 236.355 257.441 248.726 265.809 266.437
 c 268.281 271.675 l 273.746 269.745 l 276.922 268.624 280.223 268.054 283.555
 268.054 c 284.812 268.054 286.102 268.14 287.383 268.304 c 289.207 268.538
 l 292.078 268.909 294.617 266.675 294.617 263.78 c 294.617 171.32 l 294.617
 136.331 270.969 105.734 237.109 96.909 c 233.387 96.038 l 228.262 94.972
 222.996 94.433 217.734 94.433 c h
217.734 94.433 m f
1 0.811765 0.34902 rg
293.539 158.448 m 294.621 221.796 l 309.645 221.796 l 327.109 221.796 341.32
 207.585 341.32 190.12 c 341.32 172.655 327.109 158.448 309.645 158.448 
c h
293.539 158.448 m f
0.878431 0.572549 0.168627 rg
316.062 203.757 m 316.062 201.542 314.27 199.745 312.055 199.745 c 309.84
 199.745 308.043 201.542 308.043 203.757 c 308.043 205.972 309.84 207.765
 312.055 207.765 c 314.27 207.765 316.062 205.972 316.062 203.757 c h
316.062 203.757 m f
316.465 190.527 m 316.465 188.312 314.668 186.519 312.457 186.519 c 310.242
 186.519 308.445 188.312 308.445 190.527 c 308.445 192.741 310.242 194.534
 312.457 194.534 c 314.668 194.534 316.465 192.741 316.465 190.527 c h
316.465 190.527 m f
316.867 177.296 m 316.867 175.081 315.07 173.284 312.855 173.284 c 310.641
 173.284 308.848 175.081 308.848 177.296 c 308.848 179.511 310.641 181.304
 312.855 181.304 c 315.07 181.304 316.867 179.511 316.867 177.296 c h
316.867 177.296 m f
0.207843 g
215.828 111.136 m 210.301 111.136 205.805 115.632 205.805 121.159 c 205.805
 126.687 210.301 131.183 215.828 131.183 c 227.055 131.183 l 232.578 131.183
 237.074 126.687 237.074 121.159 c 237.074 115.632 232.578 111.136 227.055
 111.136 c h
215.828 111.136 m f
0.858824 0.682353 0.431373 rg
134.715 166.023 m 129.766 166.023 125 167.515 120.934 170.339 c 120.273
 170.8 l 119.789 171.359 l 119.129 171.698 l 118.52 172.249 l 113.426 176.843
 110.5 183.398 110.5 190.238 c 110.5 203.589 121.363 214.452 134.715 214.452
 c 141.652 214.452 l 141.652 166.023 l h
134.715 166.023 m f
0.929412 0.717647 0.411765 rg
289.211 268.538 m 287.387 268.304 l 286.102 268.14 284.812 268.054 283.559
 268.054 c 280.223 268.054 276.922 268.624 273.746 269.745 c 268.285 271.675
 l 267.5 270.198 267.148 268.57 266.156 267.171 c 265.809 266.437 l 257.441
 248.722 232.512 236.351 205.18 236.351 c 188.156 236.351 172.156 240.863
 160.129 249.05 c 157.031 251.155 154.254 253.472 151.875 255.929 c 149.094
 258.804 l 146.098 261.902 140.852 259.78 140.852 255.468 c 140.852 171.316
 l 140.852 128.921 175.34 94.433 217.734 94.433 c 221.355 94.433 224.98 
94.695 228.562 95.198 c 200.25 108.409 180.574 137.144 180.574 170.394 c
 180.574 184.499 l 180.574 197.363 191.082 207.624 203.945 207.593 c 204.191
 207.593 l 233.676 207.593 260.566 220.937 269.594 240.042 c 271.109 243.249
 274.809 244.792 278.156 243.609 c 281.578 242.398 285.141 241.788 288.738
 241.788 c 290.094 241.788 291.484 241.878 292.867 242.058 c 294.621 242.28
 l 294.621 263.777 l 294.621 266.675 292.078 268.909 289.211 268.538 c h
289.211 268.538 m f
1 0.811765 0.34902 rg
293.539 158.448 m 294.621 221.796 l 309.645 221.796 l 327.109 221.796 341.32
 207.585 341.32 190.12 c 341.32 172.655 327.109 158.448 309.645 158.448 
c h
293.539 158.448 m f
0.207843 g
215.828 111.136 m 210.301 111.136 205.805 115.632 205.805 121.159 c 205.805
 126.687 210.301 131.183 215.828 131.183 c 227.055 131.183 l 232.578 131.183
 237.074 126.687 237.074 121.159 c 237.074 115.632 232.578 111.136 227.055
 111.136 c h
215.828 111.136 m f
0 g
128.988 345.366 m 129.746 342.882 132.02 341.167 134.621 341.113 c 134.66
 341.113 134.699 341.113 134.738 341.113 c 137.289 341.113 139.57 342.726
 140.414 345.14 c 144.59 357.073 l 151.074 357.073 l 165.555 357.073 177.336
 368.859 177.336 383.339 c 177.336 397.82 165.555 409.601 151.074 409.601
 c 88.93 409.601 l 74.449 409.601 62.668 397.82 62.668 383.339 c 62.668 
368.855 74.449 357.073 88.93 357.073 c 125.402 357.073 l h
74.695 383.339 m 74.695 391.187 81.082 397.573 88.93 397.573 c 151.074 
397.573 l 158.922 397.573 165.309 391.187 165.309 383.339 c 165.309 375.488
 158.922 369.105 151.074 369.105 c 140.324 369.105 l 138.129 369.105 136.141
 367.913 135.086 366.046 c 134.035 367.905 132.051 369.105 129.852 369.105
 c 88.93 369.105 l 81.082 369.105 74.695 375.488 74.695 383.339 c h
74.695 383.339 m f
320.309 225.847 m 320.414 251.011 l 320.5 278.632 309.809 304.613 290.309
 324.175 c 270.969 343.577 245.277 354.335 217.91 354.507 c 160.797 354.866
 114.066 307.355 114.066 250.238 c 114.066 214.238 l 114.066 213.488 114.211
 212.773 114.461 212.109 c 108.578 206.655 104.887 198.87 104.887 190.238
 c 104.887 181.816 108.398 174.202 114.031 168.777 c 114.031 114.706 l 114.031
 101.663 124.605 91.089 137.648 91.089 c 190.969 91.089 l 191.07 91.089 
191.172 91.101 191.273 91.105 c 191.273 74.109 l 191.273 73.288 191.316 
72.472 191.391 71.667 c 183.051 71.667 l 159.223 71.667 139.906 52.351 139.906
 28.523 c 139.906 14.366 l 139.906 6.433 146.34 -0.001 154.273 -0.001 c 
180.398 -0.001 l 183.723 -0.001 186.414 2.695 186.414 6.015 c 186.414 9.335
 183.723 12.03 180.398 12.03 c 154.273 12.03 l 152.98 12.03 151.934 13.077
 151.934 14.366 c 151.934 28.523 l 151.934 45.706 165.867 59.64 183.051 
59.64 c 195.598 59.64 l 200.328 52.425 208.48 47.648 217.734 47.648 c 226.988
 47.648 235.141 52.425 239.871 59.64 c 252.418 59.64 l 269.602 59.64 283.535
 45.706 283.535 28.523 c 283.535 14.366 l 283.535 13.073 282.488 12.03 281.195
 12.03 c 219.531 12.03 l 216.211 12.03 213.52 9.335 213.52 6.015 c 213.52
 2.695 216.211 -0.001 219.531 -0.001 c 281.195 -0.001 l 289.129 -0.001 295.562
 6.433 295.562 14.366 c 295.562 28.523 l 295.562 52.351 276.246 71.667 252.418
 71.667 c 244.078 71.667 l 244.152 72.472 244.195 73.288 244.195 74.109 
c 244.195 91.089 l 294.805 91.089 l 307.848 91.089 318.422 101.663 318.422
 114.706 c 318.422 153.886 l 334.762 157.843 346.934 172.581 346.934 190.12
 c 346.934 206.976 335.691 221.249 320.309 225.847 c h
126.094 251.335 m 126.094 301.593 166.98 342.48 217.242 342.48 c 241.641
 342.48 264.566 332.964 281.793 315.683 c 297.875 299.55 307.176 278.472
 308.277 255.894 c 308.27 255.761 308.262 255.624 308.262 255.488 c 308.262
 227.409 l 300.23 227.409 l 300.23 269.124 l 300.23 269.183 300.227 269.241
 300.223 269.296 c 300.266 270.113 300.148 270.948 299.836 271.761 c 298.645
 274.863 295.168 276.413 292.066 275.226 c 289.371 274.191 286.504 273.667
 283.555 273.667 c 280.105 273.667 276.727 274.409 273.672 275.812 c 272.863
 277.226 271.492 278.308 269.781 278.695 c 266.535 279.433 263.32 277.394
 262.59 274.155 c 262.5 273.753 262.398 273.355 262.285 272.948 c 257.34
 255.284 232.789 241.964 205.18 241.964 c 189.27 241.964 174.391 246.128
 163.285 253.687 c 152.992 260.695 147.277 269.761 147.164 279.245 c 147.16
 279.573 l 147.141 282.882 144.453 285.554 141.145 285.554 c 141.129 285.554
 l 137.812 285.542 135.133 282.855 135.133 279.538 c 135.133 279.405 135.133
 279.269 135.133 279.136 c 135.234 261.21 l 135.234 220.062 l 134.711 220.062
 l 131.715 220.062 128.824 219.613 126.094 218.788 c h
302.773 152.835 m 302.773 149.359 l 302.773 139.816 296.719 131.663 288.25
 128.538 c 292.766 135.956 296.145 144.136 298.145 152.835 c h
122.812 177.015 m 119.195 180.277 116.914 184.995 116.914 190.238 c 116.914
 200.05 124.898 208.034 134.715 208.034 c 135.238 208.034 l 135.238 172.437
 l 134.715 172.437 l 130.957 172.437 127.469 173.609 124.594 175.605 c 124.094
 176.183 123.492 176.663 122.812 177.015 c h
137.648 103.116 m 131.258 103.116 126.059 108.316 126.059 114.706 c 126.059
 161.695 l 128.801 160.863 131.703 160.409 134.715 160.409 c 135.961 160.409
 l 139.113 136.644 152.422 116.038 171.371 103.116 c h
232.168 74.109 m 232.168 66.152 225.691 59.679 217.734 59.679 c 209.777
 59.679 203.301 66.152 203.301 74.109 c 203.301 90.085 l 207.988 89.257 
212.812 88.82 217.734 88.82 c 222.656 88.82 227.48 89.257 232.168 90.085
 c h
235.496 103.116 m 235.074 103.116 l 233.984 103.116 232.969 102.823 232.086
 102.32 c 227.453 101.359 222.652 100.851 217.734 100.851 c 178.879 100.851
 147.266 132.464 147.266 171.32 c 147.266 251.472 l 149.938 248.71 153.031
 246.12 156.52 243.745 c 169.598 234.843 186.883 229.937 205.18 229.937 
c 235.555 229.937 262.219 243.816 271.609 263.695 c 275.414 262.355 279.457
 261.64 283.559 261.64 c 285.125 261.64 286.672 261.745 288.207 261.941 
c 288.207 171.32 l 288.207 154.62 282.363 139.265 272.621 127.175 c 241.484
 127.175 l 239.125 132.82 233.547 136.796 227.055 136.796 c 215.828 136.796
 l 207.207 136.796 200.191 129.78 200.191 121.159 c 200.191 112.538 207.207
 105.523 215.828 105.523 c 227.055 105.523 l 233.547 105.523 239.125 109.499
 241.484 115.144 c 260.234 115.144 l 252.957 109.628 244.582 105.488 235.496
 103.116 c h
230.66 121.159 m 230.66 119.171 229.043 117.55 227.051 117.55 c 215.824
 117.55 l 213.836 117.55 212.215 119.171 212.215 121.159 c 212.215 123.148
 213.836 124.769 215.824 124.769 c 227.051 124.769 l 229.043 124.769 230.66
 123.148 230.66 121.159 c h
306.395 114.706 m 306.395 108.316 301.195 103.116 294.805 103.116 c 264.102
 103.116 l 269.203 106.597 273.898 110.64 278.094 115.144 c 280.594 115.144
 l 290.883 115.144 300.117 119.718 306.395 126.933 c h
309.645 164.863 m 300.426 164.863 l 300.426 215.382 l 309.645 215.382 l
 323.574 215.382 334.906 204.05 334.906 190.12 c 334.906 176.195 323.574
 164.863 309.645 164.863 c h
309.645 164.863 m f
316.062 203.757 m 316.062 201.542 314.27 199.745 312.055 199.745 c 309.84
 199.745 308.043 201.542 308.043 203.757 c 308.043 205.972 309.84 207.765
 312.055 207.765 c 314.27 207.765 316.062 205.972 316.062 203.757 c h
316.062 203.757 m f
316.465 190.527 m 316.465 188.312 314.668 186.519 312.457 186.519 c 310.242
 186.519 308.445 188.312 308.445 190.527 c 308.445 192.741 310.242 194.534
 312.457 194.534 c 314.668 194.534 316.465 192.741 316.465 190.527 c h
316.465 190.527 m f
316.867 177.296 m 316.867 175.081 315.07 173.284 312.855 173.284 c 310.641
 173.284 308.848 175.081 308.848 177.296 c 308.848 179.511 310.641 181.304
 312.855 181.304 c 315.07 181.304 316.867 179.511 316.867 177.296 c h
316.867 177.296 m f
Q Q
showpage
%%Trailer
end restore
%%EOF
