%!PS-Adobe-3.0 EPSF-3.0
%%Creator: cairo 1.14.2 (http://cairographics.org)
%%CreationDate: Mon Feb 19 09:15:05 2018
%%Pages: 1
%%DocumentData: Clean7Bit
%%LanguageLevel: 2
%%BoundingBox: 0 40 410 369
%%EndComments
%%BeginProlog
save
50 dict begin
/q { gsave } bind def
/Q { grestore } bind def
/cm { 6 array astore concat } bind def
/w { setlinewidth } bind def
/J { setlinecap } bind def
/j { setlinejoin } bind def
/M { setmiterlimit } bind def
/d { setdash } bind def
/m { moveto } bind def
/l { lineto } bind def
/c { curveto } bind def
/h { closepath } bind def
/re { exch dup neg 3 1 roll 5 3 roll moveto 0 rlineto
      0 exch rlineto 0 rlineto closepath } bind def
/S { stroke } bind def
/f { fill } bind def
/f* { eofill } bind def
/n { newpath } bind def
/W { clip } bind def
/W* { eoclip } bind def
/BT { } bind def
/ET { } bind def
/pdfmark where { pop globaldict /?pdfmark /exec load put }
    { globaldict begin /?pdfmark /pop load def /pdfmark
    /cleartomark load def end } ifelse
/BDC { mark 3 1 roll /BDC pdfmark } bind def
/EMC { mark /EMC pdfmark } bind def
/cairo_store_point { /cairo_point_y exch def /cairo_point_x exch def } def
/Tj { show currentpoint cairo_store_point } bind def
/TJ {
  {
    dup
    type /stringtype eq
    { show } { -0.001 mul 0 cairo_font_matrix dtransform rmoveto } ifelse
  } forall
  currentpoint cairo_store_point
} bind def
/cairo_selectfont { cairo_font_matrix aload pop pop pop 0 0 6 array astore
    cairo_font exch selectfont cairo_point_x cairo_point_y moveto } bind def
/Tf { pop /cairo_font exch def /cairo_font_matrix where
      { pop cairo_selectfont } if } bind def
/Td { matrix translate cairo_font_matrix matrix concatmatrix dup
      /cairo_font_matrix exch def dup 4 get exch 5 get cairo_store_point
      /cairo_font where { pop cairo_selectfont } if } bind def
/Tm { 2 copy 8 2 roll 6 array astore /cairo_font_matrix exch def
      cairo_store_point /cairo_font where { pop cairo_selectfont } if } bind def
/g { setgray } bind def
/rg { setrgbcolor } bind def
/d1 { setcachedevice } bind def
%%EndProlog
%%BeginSetup
%%EndSetup
%%Page: 1 1
%%BeginPageSetup
%%PageBoundingBox: 0 40 410 369
%%EndPageSetup
q 0 40 410 329 rectclip q
1 0.313726 0.490196 rg
26.543 46.859 m 14.996 46.859 5.605 56.249 5.605 67.796 c 5.605 79.343 
14.996 88.734 26.543 88.734 c 70.988 88.734 l 76.543 99.257 l 82.094 88.734
 l 89.57 88.734 l 101.113 88.734 110.508 79.343 110.508 67.796 c 110.508
 56.249 101.117 46.859 89.57 46.859 c h
26.543 46.859 m f
0.317647 0.301961 0.290196 rg
348.578 344.48 39.566 -31.23 re f
0.407843 g
397.551 297.234 m 387.441 297.296 379.172 305.62 379.172 315.73 c 379.172
 341.999 l 379.172 352.109 387.441 360.433 397.551 360.495 c 401.355 360.519
 l 402.809 360.53 403.996 359.351 403.996 357.898 c 403.996 299.835 l 403.996
 298.378 402.809 297.202 401.355 297.21 c h
397.551 297.234 m f
0.34902 0.321569 0.317647 rg
391.582 329.769 m 391.582 356.038 l 391.582 357.245 391.703 358.425 391.93
 359.57 c 384.547 357.136 379.168 350.148 379.168 341.999 c 379.168 315.73
 l 379.168 305.62 387.441 297.296 397.547 297.234 c 401.355 297.21 l 402.809
 297.198 403.992 298.374 403.992 299.831 c 403.992 312.312 l 396.793 314.851
 391.582 321.745 391.582 329.769 c h
391.582 329.769 m f
1 0.811765 0.34902 rg
358.805 291.445 m 357.922 298.023 l 347.203 345.73 l 272.148 349.933 l 
265.77 350.523 l 245.77 352.374 225.414 353.312 205.27 353.312 c 159.977
 353.312 114.246 348.601 69.34 339.308 c 63.332 338.066 58.684 333.382 57.504
 327.378 c 44.715 262.249 44.695 196.503 57.449 131.96 c 58.641 125.925 
63.52 121.113 69.59 119.991 c 114.387 111.706 159.992 107.507 205.133 107.507
 c 250.336 107.507 295.918 111.718 340.617 120.023 c 346.656 121.144 351.398
 125.734 352.695 131.718 c 363.984 183.878 366.043 237.616 358.805 291.445
 c h
358.805 291.445 m f
0.976471 0.631373 0.254902 rg
214.59 119.991 m 208.52 121.113 203.637 125.925 202.445 131.96 c 189.695
 196.503 189.715 262.249 202.504 327.378 c 203.684 333.382 208.328 338.066
 214.34 339.312 c 235.945 343.78 257.75 347.183 279.602 349.515 c 272.145
 349.933 l 265.77 350.523 l 245.77 352.374 225.414 353.312 205.266 353.312
 c 159.977 353.312 114.242 348.601 69.34 339.308 c 63.332 338.066 58.684
 333.382 57.504 327.378 c 44.715 262.249 44.695 196.503 57.445 131.96 c 
58.641 125.925 63.52 121.113 69.59 119.991 c 114.387 111.706 159.992 107.507
 205.133 107.507 c 229.242 107.507 253.461 108.714 277.598 111.097 c 256.504
 113.171 235.461 116.132 214.59 119.991 c h
214.59 119.991 m f
0.909804 0.882353 0.839216 rg
334.059 288.718 m 333.262 294.605 l 270.238 325.859 l 264.859 326.374 l
 244.531 328.331 224.102 329.323 204.145 329.323 c 164.168 329.323 123.559
 325.441 83.449 317.792 c 79.102 316.964 l 78.336 312.605 l 68.691 257.425
 68.652 201.702 78.227 146.988 c 79.004 142.534 l 83.461 141.777 l 123.645
 134.941 164.293 131.472 204.273 131.472 c 244.367 131.472 285.059 134.96
 325.211 141.831 c 329.586 142.581 l 330.422 146.941 l 339.281 193.198 340.504
 240.902 334.059 288.718 c h
334.059 288.718 m f
0.407843 g
315.809 293.077 m 303.266 293.077 290.594 294.21 278.148 296.452 c 275.48
 296.933 273.402 299.038 272.965 301.714 c 269.441 323.124 269.336 340.859
 272.641 355.925 c 273.234 358.636 275.512 360.659 278.277 360.929 c 290.691
 362.132 303.32 362.741 315.82 362.741 c 327.918 362.741 340.137 362.171
 352.145 361.042 c 355.434 360.734 357.953 357.972 357.953 354.663 c 357.953
 302.613 l 357.953 299.503 355.719 296.843 352.656 296.304 c 340.477 294.163
 328.078 293.077 315.809 293.077 c h
315.809 293.077 m f
0.34902 0.321569 0.317647 rg
320 302.945 m 317.328 303.425 315.254 305.534 314.812 308.21 c 311.289 
329.62 311.184 347.351 314.488 362.417 c 314.512 362.527 314.555 362.628
 314.586 362.734 c 302.488 362.695 290.277 362.089 278.277 360.929 c 275.512
 360.659 273.234 358.636 272.637 355.925 c 269.336 340.859 269.441 323.124
 272.961 301.714 c 273.402 299.038 275.48 296.933 278.148 296.452 c 290.594
 294.21 303.266 293.077 315.809 293.077 c 328.078 293.077 340.473 294.163
 352.652 296.304 c 354.637 296.655 356.27 297.898 357.176 299.577 c 344.789
 299.605 332.285 300.734 320 302.945 c h
320 302.945 m f
0.247059 0.152941 0.145098 rg
261.133 246.409 m 261.133 271.113 l 261.145 271.378 l 261.129 271.644 l
 260.41 285.683 254.531 298.917 244.574 308.905 c 233.805 319.71 219.473
 325.659 204.215 325.659 c 172.793 325.659 147.227 300.093 147.227 268.671
 c 147.227 246.132 l 147.207 220.046 l 147.207 197.413 l 147.207 181.726
 155.016 167.198 168.094 158.546 c 171.016 156.613 l 237.988 156.613 l 240.914
 158.546 l 253.992 167.198 261.801 181.73 261.801 197.413 c 261.801 219.952
 l h
261.133 246.409 m f
0.858824 0.682353 0.431373 rg
154.805 218.816 m 146.938 218.816 140.539 225.218 140.539 233.085 c 140.539
 240.952 146.938 247.355 154.805 247.355 c 165.363 247.355 l 165.363 218.816
 l h
154.805 218.816 m f
243.84 218.816 m 243.84 247.355 l 254.395 247.355 l 262.262 247.355 268.664
 240.956 268.664 233.089 c 268.664 225.218 262.262 218.82 254.395 218.82
 c 243.84 218.82 l h
243.84 218.816 m f
0.192157 0.823529 0.968627 rg
224.703 160.925 m 184.301 160.925 l 172.156 160.925 162.273 152.855 162.273
 142.937 c 162.273 132.761 l 168.348 132.441 l 180.648 131.8 193.023 131.472
 205.133 131.472 c 216.773 131.472 228.723 131.777 240.648 132.382 c 246.73
 132.691 l 246.73 142.937 l 246.73 152.855 236.848 160.925 224.703 160.925
 c h
224.703 160.925 m f
0.0745098 0.67451 0.909804 rg
207.684 132.441 m 201.613 132.761 l 201.613 142.937 l 201.613 152.855 211.492
 160.925 223.637 160.925 c 184.301 160.925 l 172.156 160.925 162.277 152.855
 162.277 142.937 c 162.277 132.761 l 168.348 132.441 l 180.648 131.796 193.023
 131.472 205.133 131.472 c 211.586 131.472 218.137 131.573 224.723 131.761
 c 219.047 131.925 213.359 132.144 207.684 132.441 c h
207.684 132.441 m f
0.980392 0.827451 0.576471 rg
209.578 184.55 m 207.832 184.323 206.125 184.206 204.5 184.206 c 202.875
 184.206 201.168 184.323 199.43 184.55 c 192.195 185.495 l 192.195 162.964
 l 192.195 156.179 197.715 150.655 204.504 150.655 c 211.289 150.655 216.812
 156.179 216.812 162.964 c 216.812 185.495 l h
209.578 184.55 m f
0.929412 0.717647 0.411765 rg
204.504 162.964 m 204.504 184.206 l 204.5 184.206 l 202.875 184.206 201.168
 184.323 199.43 184.55 c 192.195 185.495 l 192.195 162.964 l 192.195 156.179
 197.715 150.655 204.504 150.655 c 206.746 150.655 208.844 151.269 210.66
 152.323 c 206.984 154.456 204.504 158.421 204.504 162.964 c h
204.504 162.964 m f
0.980392 0.827451 0.576471 rg
203.73 183.413 m 181.973 183.827 164.758 202.054 164.758 223.816 c 164.758
 259.851 l 164.758 264.257 169.703 266.859 173.332 264.355 c 174.801 263.343
 l 180.926 259.12 189.18 256.796 198.039 256.796 c 211.379 256.796 223.211
 262.175 228.188 270.503 c 228.84 271.597 l 229.867 273.316 231.883 274.183
 233.836 273.749 c 235.086 273.472 l 236.039 273.261 237.012 273.14 237.988
 273.116 c 238.902 273.097 l 241.871 273.027 244.242 270.597 244.242 267.628
 c 244.242 223.152 l 244.242 200.98 225.996 182.991 203.73 183.413 c h
203.73 183.413 m f
0.929412 0.717647 0.411765 rg
238.902 273.093 m 237.992 273.116 l 237.016 273.14 236.043 273.257 235.086
 273.472 c 233.84 273.745 l 231.887 274.183 229.867 273.316 228.84 271.593
 c 228.188 270.503 l 223.215 262.175 211.379 256.792 198.043 256.792 c 189.18
 256.792 180.926 259.12 174.801 263.343 c 173.332 264.355 l 169.703 266.855
 164.758 264.257 164.758 259.847 c 164.758 223.816 l 164.758 202.839 180.758
 184.968 201.68 183.503 c 207.656 183.085 213.371 184.015 218.574 185.991
 c 204.363 192.515 194.566 207.101 194.566 223.702 c 194.566 235.874 l 194.566
 237.683 196.047 239.116 197.859 239.113 c 197.895 239.113 l 211.543 239.113
 223.648 244.62 228.742 253.144 c 229.41 254.261 l 230.461 256.023 232.523
 256.909 234.527 256.464 c 235.793 256.183 l 236.77 255.964 237.77 255.843
 238.77 255.82 c 239.707 255.796 l 241.605 255.749 243.266 254.761 244.246
 253.28 c 244.246 267.628 l 244.242 270.597 241.871 273.023 238.902 273.093
 c h
238.902 273.093 m f
0.317647 0.301961 0.290196 rg
341.934 336.874 m 341.934 330.683 336.914 325.663 330.723 325.663 c 324.531
 325.663 319.512 330.683 319.512 336.874 c 319.512 343.066 324.531 348.085
 330.723 348.085 c 336.914 348.085 341.934 343.066 341.934 336.874 c h
341.934 336.874 m f
0 g
89.57 94.339 m 85.664 94.339 l 81.621 102.929 l 80.605 105.081 78.434 106.402
 76.039 106.374 c 73.66 106.316 71.539 104.859 70.633 102.655 c 67.207 94.335
 l 26.543 94.335 l 11.906 94.339 0 82.433 0 67.796 c 0 53.159 11.906 41.253
 26.543 41.253 c 89.57 41.253 l 104.207 41.253 116.113 53.159 116.113 67.796
 c 116.113 82.433 104.207 94.339 89.57 94.339 c h
89.57 53.265 m 26.543 53.265 l 18.531 53.265 12.012 59.784 12.012 67.796
 c 12.012 75.808 18.531 82.327 26.543 82.327 c 71.23 82.327 l 73.473 82.327
 75.508 83.573 76.539 85.527 c 77.574 83.566 79.617 82.327 81.852 82.327
 c 89.57 82.327 l 97.582 82.327 104.102 75.808 104.102 67.796 c 104.102 
59.78 97.582 53.265 89.57 53.265 c h
89.57 53.265 m f
113.309 295.234 m 113.309 290.589 109.547 286.823 104.902 286.823 c 100.258
 286.823 96.496 290.589 96.496 295.234 c 96.496 299.878 100.258 303.64 104.902
 303.64 c 109.547 303.64 113.309 299.878 113.309 295.234 c h
113.309 295.234 m f
399.023 366.101 m 397.668 366.101 l 387.211 366.101 378.297 359.409 374.965
 350.085 c 363.555 350.085 l 363.555 360.093 l 363.555 363.163 361.242 365.738
 358.195 366.066 c 330.07 369.109 301.551 369.109 273.43 366.066 c 270.973
 365.8 268.93 364.058 268.277 361.675 c 267.777 359.839 267.344 357.956 
266.945 356.042 c 200.973 362.214 134.129 358.441 68.203 344.8 c 59.977 
343.097 53.621 336.683 52.004 328.456 c 39.074 262.613 39.055 196.136 51.945
 130.874 c 53.605 122.476 60.133 116.042 68.57 114.48 c 113.918 106.093 
159.539 101.902 205.129 101.902 c 250.777 101.902 296.391 106.105 341.641
 114.511 c 349.91 116.046 356.398 122.335 358.172 130.53 c 370.012 185.226
 371.824 241.546 363.555 297.945 c 363.555 307.644 l 374.965 307.644 l 378.297
 298.32 387.215 291.628 397.668 291.628 c 399.027 291.628 l 404.855 291.628
 409.602 296.37 409.602 302.202 c 409.602 355.523 l 409.602 361.355 404.855
 366.101 399.023 366.101 c h
278.895 354.55 m 303.02 356.89 327.41 356.929 351.543 354.663 c 351.543
 302.613 l 327.543 298.394 303.277 298.437 279.281 302.757 c 275.902 323.296
 275.773 340.323 278.895 354.55 c h
268.164 296.562 m 268.602 294.14 270.48 292.23 272.895 291.741 c 287.133
 288.894 301.473 287.468 315.812 287.468 c 320.062 287.468 324.316 287.609
 328.566 287.859 c 334.922 240.718 333.723 193.749 324.988 148.144 c 300.875
 144.015 276.582 141.128 252.336 139.488 c 252.336 142.933 l 252.336 147.909
 250.52 152.527 247.43 156.335 c 259.922 166.132 267.406 181.206 267.406
 197.413 c 267.406 218.081 l 271.605 221.726 274.266 227.097 274.266 233.081
 c 274.266 239.374 271.324 244.991 266.746 248.632 c 266.809 268.472 l 266.863
 285.23 260.375 300.991 248.543 312.859 c 244.984 316.433 241.062 319.511
 236.871 322.085 c 246.281 321.601 255.707 320.898 265.105 319.995 c 265.645
 312.648 266.664 304.851 268.164 296.562 c h
254.727 271.093 m 254.727 252.952 l 254.617 252.956 254.504 252.964 254.395
 252.964 c 249.848 252.964 l 249.848 273.46 l 249.848 273.472 249.844 273.484
 249.844 273.495 c 249.875 274.277 249.75 275.081 249.449 275.859 c 248.266
 278.956 244.789 280.507 241.691 279.316 c 239.621 278.523 237.211 278.534
 235.121 279.296 c 234.312 280.23 233.215 280.925 231.922 281.222 c 228.691
 281.952 225.469 279.929 224.734 276.695 c 224.699 276.534 224.656 276.378
 224.609 276.21 c 222.406 268.335 210.984 262.398 198.043 262.398 c 183.512
 262.398 171.223 269.847 171.113 278.691 c 171.109 278.847 l 171.094 282.152
 168.41 284.82 165.105 284.82 c 165.09 284.82 l 161.777 284.812 159.098 
282.124 159.098 278.816 c 159.098 278.734 159.098 278.655 159.102 278.577
 c 159.152 269.386 l 159.152 252.96 l 154.805 252.96 l 154.41 252.96 154.02
 252.945 153.633 252.925 c 153.633 268.671 l 153.633 296.562 176.324 319.253
 204.215 319.253 c 217.758 319.253 230.48 313.972 240.039 304.382 c 248.938
 295.456 254.094 283.804 254.73 271.316 c 254.73 271.241 254.727 271.167
 254.727 271.093 c h
262.258 233.089 m 262.258 230.683 261.168 228.53 259.465 227.089 c 258.648
 226.812 257.914 226.363 257.301 225.788 c 256.398 225.429 255.422 225.226
 254.395 225.226 c 250.242 225.226 l 250.242 240.948 l 254.395 240.948 l
 258.73 240.948 262.258 237.421 262.258 233.089 c h
204.5 189.812 m 186.121 189.812 171.164 204.769 171.164 223.148 c 171.164
 258.07 l 178.102 253.284 187.523 250.39 198.039 250.39 c 213.934 250.39
 227.629 257.077 233.688 267.222 c 235.043 266.917 236.434 266.745 237.836
 266.714 c 237.836 223.152 l 237.836 204.769 222.879 189.812 204.5 189.812
 c h
210.406 178.198 m 210.406 166.253 l 210.406 162.999 207.758 160.351 204.504
 160.351 c 201.246 160.351 198.602 162.999 198.602 166.253 c 198.602 178.198
 l 200.531 177.945 202.5 177.804 204.5 177.804 c 206.504 177.8 208.473 177.945
 210.406 178.198 c h
154.805 240.948 m 158.957 240.948 l 158.957 225.222 l 154.805 225.222 l
 153.637 225.222 152.527 225.488 151.527 225.948 c 151.043 226.37 150.492
 226.714 149.887 226.96 c 148.094 228.402 146.941 230.613 146.941 233.085
 c 146.941 237.421 150.473 240.948 154.805 240.948 c h
153.613 213.249 m 154.008 213.226 154.406 213.21 154.805 213.21 c 160.262
 213.21 l 163.469 198.933 173.418 187.179 186.59 181.495 c 186.59 166.53
 l 184.301 166.53 l 179.734 166.53 175.426 165.573 171.629 163.894 c 160.438
 171.296 153.613 183.839 153.613 197.413 c h
168.684 142.937 m 168.684 146.027 170.418 148.874 173.184 150.976 c 174.328
 151.253 175.383 151.866 176.199 152.769 c 178.582 153.866 181.355 154.519
 184.301 154.519 c 190.98 154.519 l 194.27 150.738 199.109 148.335 204.504
 148.335 c 209.895 148.335 214.738 150.738 218.023 154.519 c 224.703 154.519
 l 227.648 154.519 230.426 153.866 232.805 152.765 c 233.621 151.866 234.676
 151.253 235.82 150.976 c 238.586 148.874 240.324 146.027 240.324 142.937
 c 240.324 138.78 l 228.562 138.183 216.824 137.878 205.133 137.878 c 193.031
 137.878 180.871 138.202 168.684 138.839 c h
237.379 163.894 m 233.578 165.573 229.27 166.53 224.703 166.53 c 222.418
 166.53 l 222.418 181.499 l 235.586 187.187 245.531 198.937 248.738 213.21
 c 254.395 213.21 l 254.727 213.21 255.062 213.222 255.395 213.238 c 255.395
 197.413 l 255.395 183.839 248.57 171.296 237.379 163.894 c h
346.434 133.073 m 345.684 129.62 342.945 126.972 339.445 126.323 c 250.453
 109.788 160.051 109.777 70.754 126.292 c 67.242 126.941 64.418 129.718 
63.73 133.202 c 51.141 196.925 51.164 261.839 63.789 326.144 c 64.473 329.609
 67.16 332.32 70.637 333.034 c 135.176 346.39 200.598 350.12 265.18 344.144
 c 264.824 340.284 264.645 336.273 264.641 332.109 c 244.734 333.968 224.691
 334.925 205 334.925 c 163.293 334.925 120.953 330.745 79.156 322.503 c 
76.742 322.027 74.855 320.12 74.41 317.702 c 63.656 259.089 63.625 199.905
 74.316 141.804 c 74.77 139.335 76.723 137.405 79.191 136.972 c 87.34 135.538
 95.504 134.241 103.684 133.081 c 107.262 132.573 110.465 135.351 110.453
 138.964 c 110.453 139.023 110.453 139.085 110.453 139.144 c 110.441 142.093
 108.262 144.573 105.344 144.988 c 98.684 145.929 92.031 146.96 85.391 148.089
 c 75.941 202.097 75.98 257.03 85.504 311.499 c 114.055 316.945 142.84 320.448
 171.473 321.995 c 153.578 310.964 141.617 291.191 141.617 268.671 c 141.617
 247.941 l 137.52 244.296 134.93 238.988 134.93 233.085 c 134.93 227.191
 137.512 221.894 141.598 218.249 c 141.598 197.413 l 141.598 181.21 149.082
 166.132 161.574 156.335 c 158.484 152.527 156.668 147.909 156.668 142.937
 c 156.668 139.577 l 152.375 139.874 148.082 140.214 143.785 140.589 c 140.402
 140.886 137.457 138.304 137.332 134.909 c 137.332 134.855 137.328 134.796
 137.328 134.738 c 137.211 131.577 139.594 128.894 142.742 128.62 c 163.605
 126.792 184.449 125.866 205.129 125.866 c 246.93 125.866 289.32 129.62 
331.133 137.023 c 333.562 137.452 335.484 139.327 335.973 141.749 c 345.648
 189.749 347.18 239.238 340.547 288.902 c 344.52 289.359 348.492 289.917
 352.457 290.593 c 359.594 237.499 357.574 184.538 346.434 133.073 c h
372.766 319.655 m 363.957 319.655 l 363.957 338.073 l 372.766 338.073 l
 h
397.59 303.64 m 390.957 303.683 385.574 309.089 385.574 315.73 c 385.574
 341.999 l 385.574 348.64 390.957 354.046 397.59 354.089 c h
397.59 303.64 m f
341.934 336.874 m 341.934 330.683 336.914 325.663 330.723 325.663 c 324.531
 325.663 319.512 330.683 319.512 336.874 c 319.512 343.066 324.531 348.085
 330.723 348.085 c 336.914 348.085 341.934 343.066 341.934 336.874 c h
341.934 336.874 m f
295.891 311.245 m 314.305 311.245 l 317.625 311.245 320.312 313.933 320.312
 317.253 c 320.312 320.57 317.625 323.257 314.305 323.257 c 295.891 323.257
 l 292.57 323.257 289.883 320.57 289.883 317.253 c 289.883 313.933 292.57
 311.245 295.891 311.245 c h
295.891 311.245 m f
Q Q
showpage
%%Trailer
end restore
%%EOF
