%!PS-Adobe-3.0 EPSF-3.0
%%Creator: cairo 1.14.2 (http://cairographics.org)
%%CreationDate: Mon Feb 19 09:15:05 2018
%%Pages: 1
%%DocumentData: Clean7Bit
%%LanguageLevel: 2
%%BoundingBox: 0 9 410 400
%%EndComments
%%BeginProlog
save
50 dict begin
/q { gsave } bind def
/Q { grestore } bind def
/cm { 6 array astore concat } bind def
/w { setlinewidth } bind def
/J { setlinecap } bind def
/j { setlinejoin } bind def
/M { setmiterlimit } bind def
/d { setdash } bind def
/m { moveto } bind def
/l { lineto } bind def
/c { curveto } bind def
/h { closepath } bind def
/re { exch dup neg 3 1 roll 5 3 roll moveto 0 rlineto
      0 exch rlineto 0 rlineto closepath } bind def
/S { stroke } bind def
/f { fill } bind def
/f* { eofill } bind def
/n { newpath } bind def
/W { clip } bind def
/W* { eoclip } bind def
/BT { } bind def
/ET { } bind def
/pdfmark where { pop globaldict /?pdfmark /exec load put }
    { globaldict begin /?pdfmark /pop load def /pdfmark
    /cleartomark load def end } ifelse
/BDC { mark 3 1 roll /BDC pdfmark } bind def
/EMC { mark /EMC pdfmark } bind def
/cairo_store_point { /cairo_point_y exch def /cairo_point_x exch def } def
/Tj { show currentpoint cairo_store_point } bind def
/TJ {
  {
    dup
    type /stringtype eq
    { show } { -0.001 mul 0 cairo_font_matrix dtransform rmoveto } ifelse
  } forall
  currentpoint cairo_store_point
} bind def
/cairo_selectfont { cairo_font_matrix aload pop pop pop 0 0 6 array astore
    cairo_font exch selectfont cairo_point_x cairo_point_y moveto } bind def
/Tf { pop /cairo_font exch def /cairo_font_matrix where
      { pop cairo_selectfont } if } bind def
/Td { matrix translate cairo_font_matrix matrix concatmatrix dup
      /cairo_font_matrix exch def dup 4 get exch 5 get cairo_store_point
      /cairo_font where { pop cairo_selectfont } if } bind def
/Tm { 2 copy 8 2 roll 6 array astore /cairo_font_matrix exch def
      cairo_store_point /cairo_font where { pop cairo_selectfont } if } bind def
/g { setgray } bind def
/rg { setrgbcolor } bind def
/d1 { setcachedevice } bind def
%%EndProlog
%%BeginSetup
%%EndSetup
%%Page: 1 1
%%BeginPageSetup
%%PageBoundingBox: 0 9 410 400
%%EndPageSetup
q 0 9 410 391 rectclip q
0.917647 0.231373 0.219608 rg
65.035 88.658 m 58.734 88.658 53.605 93.787 53.605 100.091 c 53.605 114.81
 l 53.605 121.111 58.734 126.24 65.035 126.24 c 75.992 126.24 l 75.992 88.658
 l h
65.035 88.658 m f
332.664 88.658 m 332.664 126.24 l 343.621 126.24 l 349.926 126.24 355.051
 121.111 355.051 114.806 c 355.051 100.087 l 355.051 93.787 349.926 88.658
 343.621 88.658 c h
332.664 88.658 m f
0.956863 0.67451 0.270588 rg
315.688 172.615 m 92.969 172.615 l 83.168 172.615 75.195 164.642 75.195
 154.841 c 75.195 33.673 l 75.195 23.869 83.168 15.896 92.969 15.896 c 315.688
 15.896 l 325.488 15.896 333.461 23.869 333.461 33.673 c 333.461 154.841
 l 333.461 164.642 325.488 172.615 315.688 172.615 c h
315.688 172.615 m f
0.968627 0.513726 0.0588235 rg
121.793 33.673 m 121.793 154.841 l 121.793 164.642 129.766 172.615 139.57
 172.615 c 92.969 172.615 l 83.168 172.615 75.195 164.642 75.195 154.841
 c 75.195 33.673 l 75.195 23.869 83.168 15.896 92.969 15.896 c 139.57 15.896
 l 129.766 15.896 121.793 23.869 121.793 33.673 c h
121.793 33.673 m f
0.909804 0.882353 0.839216 rg
108.777 143.271 m 108.777 322.08 l 108.777 326.087 112.027 329.337 116.031
 329.337 c 245.508 329.337 l 299.879 270.966 l 299.879 143.271 l 299.879
 140.49 297.625 138.232 294.84 138.232 c 113.812 138.232 l 111.031 138.232
 108.777 140.49 108.777 143.271 c h
108.777 143.271 m f
0.858824 0.835294 0.8 rg
191.906 161.423 m 169.621 161.423 151.555 179.486 151.555 201.771 c 151.555
 329.337 l 116.031 329.337 l 112.023 329.337 108.777 326.087 108.777 322.08
 c 108.777 143.271 l 108.777 140.49 111.031 138.232 113.812 138.232 c 294.844
 138.232 l 297.625 138.232 299.879 140.49 299.879 143.271 c 299.879 161.423
 l h
191.906 161.423 m f
0.74902 0.698039 0.631373 rg
299.879 270.966 m 245.508 329.337 l 244.707 329.337 l 244.707 273.345 l
 244.707 271.591 246.133 270.166 247.887 270.166 c 299.879 270.166 l h
299.879 270.966 m f
0.909804 0.882353 0.839216 rg
95.184 39.166 m 95.184 101.369 l 95.184 103.181 96.652 104.65 98.465 104.65
 c 310.191 104.65 l 312.004 104.65 313.473 103.181 313.473 101.369 c 313.473
 39.166 l 313.473 37.353 312.004 35.884 310.191 35.884 c 98.465 35.884 l
 96.652 35.884 95.184 37.357 95.184 39.166 c h
95.184 39.166 m f
0.858824 0.835294 0.8 rg
98.465 104.65 m 96.652 104.65 95.184 103.181 95.184 101.369 c 95.184 39.166
 l 95.184 37.353 96.652 35.884 98.465 35.884 c 121.793 35.884 l 121.793 
104.65 l h
98.465 104.65 m f
1 0.384314 0.654902 rg
335.832 353.33 m 323.547 353.33 l 312.254 353.33 302.715 362.572 302.906
 373.861 c 303.09 384.834 312.074 393.705 323.09 393.705 c 383.355 393.705
 l 394.648 393.705 404.191 384.462 404 373.17 c 403.812 362.197 394.832 
353.33 383.816 353.33 c 346.512 353.33 l 343.648 348.638 l 342.52 346.787
 339.828 346.787 338.699 348.638 c h
335.832 353.33 m f
0.988235 0.329412 0.47451 rg
323.07 358.107 m 323.258 369.08 332.238 377.947 343.254 377.947 c 403.484
 377.947 l 401.367 386.955 393.004 393.705 383.355 393.705 c 323.09 393.705
 l 312.074 393.705 303.09 384.834 302.906 373.861 c 302.715 362.572 312.258
 353.33 323.547 353.33 c 323.59 353.33 l 323.227 354.865 323.043 356.462
 323.07 358.107 c h
323.07 358.107 m f
0.764706 0.854902 0.25098 rg
123.473 363.201 m 95.211 363.201 l 87.242 363.201 80.758 369.685 80.758
 377.654 c 80.758 385.623 87.242 392.103 95.211 392.103 c 138.336 392.103
 l 146.305 392.103 152.789 385.623 152.789 377.654 c 152.789 369.685 146.305
 363.201 138.336 363.201 c 131.012 363.201 l 127.242 360.33 l h
123.473 363.201 m f
0.678431 0.737255 0.0823529 rg
96.75 364.572 m 96.75 372.541 103.234 379.025 111.203 379.025 c 152.719
 379.025 l 152.023 386.353 145.84 392.103 138.336 392.103 c 95.211 392.103
 l 87.242 392.103 80.758 385.623 80.758 377.654 c 80.758 369.685 87.242 
363.201 95.211 363.201 c 96.82 363.201 l 96.777 363.654 96.75 364.111 96.75
 364.572 c h
96.75 364.572 m f
0.192157 0.823529 0.968627 rg
48.309 242.462 m 20.047 242.462 l 12.078 242.462 5.598 248.947 5.598 256.916
 c 5.598 264.884 12.078 271.365 20.047 271.365 c 63.172 271.365 l 71.141
 271.365 77.625 264.884 77.625 256.916 c 77.625 248.947 71.141 242.462 63.172
 242.462 c 55.848 242.462 l 52.078 239.591 l h
48.309 242.462 m f
0.0745098 0.67451 0.909804 rg
32.043 256.607 m 75.168 256.607 l 75.996 256.607 76.805 256.521 77.598 
256.384 c 77.605 256.564 77.625 256.736 77.625 256.916 c 77.625 264.884 
71.145 271.365 63.176 271.365 c 20.047 271.365 l 12.078 271.365 5.598 264.884
 5.598 256.916 c 5.598 249.775 10.805 243.845 17.617 242.685 c 17.898 250.408
 24.254 256.607 32.043 256.607 c h
32.043 256.607 m f
0 g
383.816 399.302 m 323.09 399.302 l 308.871 399.302 297.305 387.732 297.305
 373.517 c 297.305 359.298 308.871 347.732 323.09 347.732 c 331.621 347.732
 l 335.098 336.377 l 335.855 333.896 338.121 332.189 340.711 332.134 c 340.75
 332.134 340.793 332.134 340.832 332.134 c 343.375 332.134 345.645 333.74
 346.488 336.15 c 350.543 347.732 l 383.816 347.732 l 398.031 347.732 409.598
 359.298 409.598 373.513 c 409.602 387.732 398.031 399.302 383.816 399.302
 c h
383.816 359.728 m 346.289 359.728 l 344.168 359.728 342.242 358.615 341.172
 356.857 c 340.102 358.607 338.176 359.728 336.055 359.728 c 323.09 359.728
 l 315.484 359.728 309.301 365.912 309.301 373.517 c 309.301 381.119 315.484
 387.306 323.09 387.306 c 383.816 387.306 l 391.418 387.306 397.605 381.119
 397.605 373.517 c 397.605 365.912 391.422 359.728 383.816 359.728 c h
383.816 359.728 m f
51.836 225.791 m 54.383 225.791 56.652 227.396 57.496 229.802 c 59.969 
236.865 l 63.172 236.865 l 74.227 236.865 83.223 245.857 83.223 256.912 
c 83.223 267.966 74.227 276.962 63.172 276.962 c 20.047 276.962 l 8.992 
276.962 0 267.97 0 256.916 c 0 245.861 8.992 236.865 20.047 236.865 c 44.008
 236.865 l 46.102 230.029 l 46.863 227.552 49.129 225.841 51.719 225.791
 c 51.758 225.791 51.797 225.791 51.836 225.791 c h
20.047 248.861 m 15.605 248.861 11.992 252.474 11.992 256.916 c 11.992 
261.357 15.605 264.97 20.047 264.97 c 63.172 264.97 l 67.613 264.97 71.227
 261.357 71.227 256.916 c 71.227 252.474 67.613 248.861 63.172 248.861 c
 55.715 248.861 l 54.367 248.861 53.102 248.412 52.078 247.634 c 51.059 
248.412 49.793 248.861 48.445 248.861 c h
20.047 248.861 m f
95.211 357.603 m 119.172 357.603 l 121.266 350.767 l 122.023 348.291 124.289
 346.58 126.879 346.529 c 126.922 346.529 126.961 346.529 127 346.529 c 
129.543 346.529 131.816 348.134 132.66 350.545 c 135.129 357.603 l 138.336
 357.603 l 149.391 357.603 158.383 366.599 158.383 377.654 c 158.383 388.709
 149.391 397.701 138.336 397.701 c 95.207 397.701 l 84.156 397.701 75.16
 388.709 75.16 377.654 c 75.16 366.599 84.156 357.603 95.211 357.603 c h
95.211 385.709 m 138.336 385.709 l 142.777 385.709 146.391 382.095 146.391
 377.654 c 146.391 373.212 142.777 369.599 138.336 369.599 c 130.875 369.599
 l 129.531 369.599 128.262 369.15 127.242 368.373 c 126.223 369.15 124.957
 369.599 123.605 369.599 c 95.211 369.599 l 90.77 369.599 87.156 373.212
 87.156 377.654 c 87.156 382.095 90.77 385.709 95.211 385.709 c h
95.211 385.709 m f
313.074 110.248 m 95.582 110.248 l 92.27 110.248 89.586 107.564 89.586 
104.252 c 89.586 36.287 l 89.586 32.974 92.27 30.291 95.582 30.291 c 313.074
 30.291 l 316.387 30.291 319.07 32.974 319.07 36.287 c 319.07 104.252 l 
319.07 107.564 316.387 110.248 313.074 110.248 c h
307.074 42.283 m 101.578 42.283 l 101.578 98.255 l 307.074 98.255 l h
307.074 42.283 m f
343.621 131.837 m 339.059 131.837 l 339.059 154.841 l 339.059 167.728 328.574
 178.212 315.688 178.212 c 305.477 178.212 l 305.477 270.568 l 305.477 270.599
 305.473 270.63 305.473 270.662 c 305.473 270.724 305.465 270.787 305.465
 270.853 c 305.453 271.06 305.434 271.267 305.402 271.474 c 305.395 271.529
 305.387 271.587 305.375 271.642 c 305.328 271.9 305.27 272.154 305.191 
272.4 c 305.184 272.42 305.176 272.435 305.172 272.455 c 305.094 272.685
 305 272.912 304.898 273.13 c 304.875 273.177 304.852 273.228 304.828 273.275
 c 304.707 273.509 304.578 273.736 304.434 273.951 c 304.418 273.97 304.402
 273.99 304.387 274.013 c 304.246 274.209 304.098 274.396 303.938 274.572
 c 303.914 274.599 303.895 274.63 303.871 274.658 c 249.5 333.029 l 249.48
 333.045 249.461 333.06 249.441 333.076 c 249.262 333.267 249.066 333.447
 248.863 333.611 c 248.824 333.646 248.781 333.673 248.738 333.705 c 248.555
 333.845 248.363 333.974 248.164 334.091 c 248.125 334.119 248.082 334.142
 248.039 334.17 c 247.812 334.295 247.574 334.408 247.332 334.505 c 247.285
 334.525 247.234 334.541 247.188 334.556 c 246.973 334.638 246.75 334.705
 246.523 334.759 c 246.48 334.771 246.438 334.783 246.395 334.795 c 246.145
 334.849 245.887 334.888 245.625 334.912 c 245.559 334.916 245.496 334.916
 245.43 334.92 c 245.324 334.927 245.215 334.935 245.105 334.935 c 116.031
 334.935 l 108.945 334.935 103.18 329.17 103.18 322.084 c 103.18 178.216
 l 92.969 178.216 l 80.082 178.216 69.598 167.732 69.598 154.841 c 69.598
 131.841 l 65.035 131.841 l 55.645 131.841 48.008 124.201 48.008 114.81 
c 48.008 100.091 l 48.008 90.705 55.645 83.064 65.035 83.064 c 69.598 83.064
 l 69.598 33.673 l 69.598 20.787 80.082 10.302 92.969 10.302 c 315.688 10.302
 l 328.574 10.302 339.059 20.787 339.059 33.673 c 339.059 83.064 l 343.621
 83.064 l 353.008 83.064 360.648 90.705 360.648 100.091 c 360.648 114.81
 l 360.648 124.197 353.008 131.837 343.621 131.837 c h
69.598 95.056 m 65.035 95.056 l 62.262 95.056 60 97.314 60 100.091 c 60
 114.81 l 60 117.584 62.262 119.841 65.035 119.841 c 69.598 119.841 l h
251.105 313.701 m 285.699 276.564 l 251.105 276.564 l h
327.066 33.673 m 327.066 27.388 321.969 22.295 315.688 22.295 c 92.969 
22.295 l 86.684 22.295 81.59 27.388 81.59 33.673 c 81.59 154.841 l 81.59
 161.127 86.688 166.22 92.969 166.22 c 103.18 166.22 l 103.18 144.63 l 95.836
 144.63 l 92.551 144.63 89.688 142.099 89.59 138.818 c 89.488 135.423 92.211
 132.638 95.586 132.638 c 213.609 132.638 l 216.922 132.638 219.605 135.322
 219.605 138.634 c 219.605 141.947 216.922 144.63 213.609 144.63 c 115.172
 144.63 l 115.172 322.08 l 115.172 322.556 115.559 322.939 116.031 322.939
 c 239.109 322.939 l 239.109 270.564 l 239.109 267.255 241.797 264.568 245.105
 264.568 c 293.48 264.568 l 293.48 144.63 l 252.633 144.63 l 249.32 144.63
 246.637 141.943 246.637 138.634 c 246.637 135.322 249.32 132.634 252.633
 132.634 c 311.223 132.634 l 314.508 132.634 317.371 135.166 317.469 138.447
 c 317.57 141.845 314.848 144.63 311.473 144.63 c 305.477 144.63 l 305.477
 166.22 l 315.688 166.22 l 321.973 166.22 327.066 161.123 327.066 154.837
 c h
348.656 100.091 m 348.656 97.314 346.398 95.056 343.621 95.056 c 339.059
 95.056 l 339.059 119.841 l 343.621 119.841 l 346.398 119.841 348.656 117.584
 348.656 114.806 c h
348.656 100.091 m f
133.965 282.959 m 223.52 282.959 l 226.832 282.959 229.516 285.642 229.516
 288.959 c 229.516 292.271 226.832 294.955 223.52 294.955 c 133.965 294.955
 l 130.652 294.955 127.969 292.271 127.969 288.959 c 127.969 285.642 130.652
 282.959 133.965 282.959 c h
133.965 282.959 m f
133.965 245.38 m 223.52 245.38 l 226.832 245.38 229.516 248.064 229.516
 251.377 c 229.516 254.689 226.832 257.373 223.52 257.373 c 133.965 257.373
 l 130.652 257.373 127.969 254.689 127.969 251.377 c 127.969 248.064 130.652
 245.38 133.965 245.38 c h
133.965 245.38 m f
253.102 245.38 m 272.293 245.38 l 275.605 245.38 278.289 248.064 278.289
 251.377 c 278.289 254.689 275.605 257.373 272.293 257.373 c 253.102 257.373
 l 249.789 257.373 247.105 254.689 247.105 251.377 c 247.105 248.064 249.789
 245.38 253.102 245.38 c h
253.102 245.38 m f
177.141 222.591 m 177.141 219.279 179.828 216.595 183.141 216.595 c 270.695
 216.595 l 274.008 216.595 276.691 219.279 276.691 222.591 c 276.691 225.904
 274.008 228.587 270.695 228.587 c 183.141 228.587 l 179.828 228.587 177.141
 225.904 177.141 222.591 c h
177.141 222.591 m f
233.914 187.009 m 237.227 187.009 239.91 189.693 239.91 193.005 c 239.91
 196.318 237.227 199.002 233.914 199.002 c 146.359 199.002 l 143.043 199.002
 140.359 196.318 140.359 193.005 c 140.359 189.693 143.043 187.009 146.359
 187.009 c h
233.914 187.009 m f
272.293 171.818 m 184.738 171.818 l 181.426 171.818 178.742 169.13 178.742
 165.818 c 178.742 162.505 181.426 159.822 184.738 159.822 c 272.293 159.822
 l 275.605 159.822 278.289 162.505 278.289 165.818 c 278.289 169.13 275.605
 171.818 272.293 171.818 c h
272.293 171.818 m f
133.562 216.533 m 133.574 216.533 l 152.762 216.56 l 156.074 216.564 158.754
 219.252 158.75 222.564 c 158.746 225.877 156.062 228.552 152.754 228.552
 c 152.746 228.552 l 133.555 228.529 l 130.242 228.521 127.562 225.834 127.566
 222.521 c 127.57 219.212 130.254 216.533 133.562 216.533 c h
133.562 216.533 m f
153.152 171.841 m 153.145 171.841 l 133.957 171.818 l 130.645 171.81 127.961
 169.123 127.969 165.81 c 127.973 162.502 130.656 159.822 133.965 159.822
 c 133.973 159.822 l 153.164 159.849 l 156.473 159.853 159.156 162.541 159.152
 165.853 c 159.145 169.166 156.461 171.841 153.152 171.841 c h
153.152 171.841 m f
139.961 81.462 m 139.961 77.49 136.738 74.267 132.766 74.267 c 128.789 
74.267 125.57 77.49 125.57 81.462 c 125.57 85.435 128.789 88.658 132.766
 88.658 c 136.738 88.658 139.961 85.435 139.961 81.462 c h
139.961 81.462 m f
175.941 81.462 m 175.941 77.49 172.719 74.267 168.746 74.267 c 164.773 
74.267 161.551 77.49 161.551 81.462 c 161.551 85.435 164.773 88.658 168.746
 88.658 c 172.719 88.658 175.941 85.435 175.941 81.462 c h
175.941 81.462 m f
211.926 81.462 m 211.926 77.49 208.703 74.267 204.727 74.267 c 200.754 
74.267 197.531 77.49 197.531 81.462 c 197.531 85.435 200.754 88.658 204.727
 88.658 c 208.703 88.658 211.926 85.435 211.926 81.462 c h
211.926 81.462 m f
247.906 81.462 m 247.906 77.49 244.684 74.267 240.711 74.267 c 236.734 
74.267 233.512 77.49 233.512 81.462 c 233.512 85.435 236.734 88.658 240.711
 88.658 c 244.684 88.658 247.906 85.435 247.906 81.462 c h
247.906 81.462 m f
283.887 81.462 m 283.887 77.49 280.664 74.267 276.691 74.267 c 272.719 
74.267 269.496 77.49 269.496 81.462 c 269.496 85.435 272.719 88.658 276.691
 88.658 c 280.664 88.658 283.887 85.435 283.887 81.462 c h
283.887 81.462 m f
159.152 58.275 m 159.152 54.298 155.93 51.08 151.957 51.08 c 147.98 51.08
 144.758 54.298 144.758 58.275 c 144.758 62.248 147.98 65.47 151.957 65.47
 c 155.93 65.47 159.152 62.248 159.152 58.275 c h
159.152 58.275 m f
195.133 58.275 m 195.133 54.298 191.91 51.08 187.938 51.08 c 183.961 51.08
 180.742 54.298 180.742 58.275 c 180.742 62.248 183.961 65.47 187.938 65.47
 c 191.91 65.47 195.133 62.248 195.133 58.275 c h
195.133 58.275 m f
231.113 58.275 m 231.113 54.298 227.895 51.08 223.918 51.08 c 219.945 51.08
 216.723 54.298 216.723 58.275 c 216.723 62.248 219.945 65.47 223.918 65.47
 c 227.895 65.47 231.113 62.248 231.113 58.275 c h
231.113 58.275 m f
267.098 58.275 m 267.098 54.298 263.875 51.08 259.898 51.08 c 255.926 51.08
 252.703 54.298 252.703 58.275 c 252.703 62.248 255.926 65.47 259.898 65.47
 c 263.875 65.47 267.098 62.248 267.098 58.275 c h
267.098 58.275 m f
Q Q
showpage
%%Trailer
end restore
%%EOF
