%!PS-Adobe-3.0 EPSF-3.0
%%Creator: cairo 1.14.2 (http://cairographics.org)
%%CreationDate: Mon Feb 19 09:15:05 2018
%%Pages: 1
%%DocumentData: Clean7Bit
%%LanguageLevel: 2
%%BoundingBox: 56 -1 353 410
%%EndComments
%%BeginProlog
save
50 dict begin
/q { gsave } bind def
/Q { grestore } bind def
/cm { 6 array astore concat } bind def
/w { setlinewidth } bind def
/J { setlinecap } bind def
/j { setlinejoin } bind def
/M { setmiterlimit } bind def
/d { setdash } bind def
/m { moveto } bind def
/l { lineto } bind def
/c { curveto } bind def
/h { closepath } bind def
/re { exch dup neg 3 1 roll 5 3 roll moveto 0 rlineto
      0 exch rlineto 0 rlineto closepath } bind def
/S { stroke } bind def
/f { fill } bind def
/f* { eofill } bind def
/n { newpath } bind def
/W { clip } bind def
/W* { eoclip } bind def
/BT { } bind def
/ET { } bind def
/pdfmark where { pop globaldict /?pdfmark /exec load put }
    { globaldict begin /?pdfmark /pop load def /pdfmark
    /cleartomark load def end } ifelse
/BDC { mark 3 1 roll /BDC pdfmark } bind def
/EMC { mark /EMC pdfmark } bind def
/cairo_store_point { /cairo_point_y exch def /cairo_point_x exch def } def
/Tj { show currentpoint cairo_store_point } bind def
/TJ {
  {
    dup
    type /stringtype eq
    { show } { -0.001 mul 0 cairo_font_matrix dtransform rmoveto } ifelse
  } forall
  currentpoint cairo_store_point
} bind def
/cairo_selectfont { cairo_font_matrix aload pop pop pop 0 0 6 array astore
    cairo_font exch selectfont cairo_point_x cairo_point_y moveto } bind def
/Tf { pop /cairo_font exch def /cairo_font_matrix where
      { pop cairo_selectfont } if } bind def
/Td { matrix translate cairo_font_matrix matrix concatmatrix dup
      /cairo_font_matrix exch def dup 4 get exch 5 get cairo_store_point
      /cairo_font where { pop cairo_selectfont } if } bind def
/Tm { 2 copy 8 2 roll 6 array astore /cairo_font_matrix exch def
      cairo_store_point /cairo_font where { pop cairo_selectfont } if } bind def
/g { setgray } bind def
/rg { setrgbcolor } bind def
/d1 { setcachedevice } bind def
%%EndProlog
%%BeginSetup
%%EndSetup
%%Page: 1 1
%%BeginPageSetup
%%PageBoundingBox: 56 -1 353 410
%%EndPageSetup
q 56 -1 297 411 rectclip q
0.764706 0.854902 0.25098 rg
131.199 301.455 m 131.199 395.901 l 131.199 400.373 134.828 403.998 139.301
 403.998 c 263.102 403.998 l 267.574 403.998 271.199 400.373 271.199 395.901
 c 271.199 301.455 l h
131.199 301.455 m f
0.678431 0.737255 0.0823529 rg
182.277 403.998 m 139.297 403.998 l 134.824 403.998 131.199 400.373 131.199
 395.901 c 131.199 301.455 l 174.18 301.455 l 174.18 395.901 l 174.18 400.373
 177.805 403.998 182.277 403.998 c h
182.277 403.998 m f
0.192157 0.823529 0.968627 rg
152 327.104 m 152 340.096 l 152 341.811 153.391 343.202 155.102 343.202
 c 200.898 343.202 l 202.609 343.202 204 341.811 204 340.096 c 204 327.104
 l 204 325.389 202.609 323.998 200.898 323.998 c 155.102 323.998 l 153.391
 323.998 152 325.389 152 327.104 c h
152 327.104 m f
200.801 365.502 m 200.801 378.498 l 200.801 380.209 202.188 381.6 203.902
 381.6 c 249.699 381.6 l 251.41 381.6 252.801 380.209 252.801 378.498 c 
252.801 365.502 l 252.801 363.788 251.41 362.401 249.699 362.401 c 203.902
 362.401 l 202.188 362.401 200.801 363.788 200.801 365.502 c h
200.801 365.502 m f
0.917647 0.231373 0.219608 rg
150.301 252.799 m 139.77 252.799 131.199 261.37 131.199 271.901 c 131.199
 302.256 l 271.199 302.256 l 271.199 271.901 l 271.199 261.37 262.629 252.799
 252.098 252.799 c h
150.301 252.799 m f
131.199 107.342 m 131.199 137.698 l 131.199 148.229 139.77 156.799 150.301
 156.799 c 252.098 156.799 l 262.629 156.799 271.199 148.229 271.199 137.698
 c 271.199 107.342 l h
131.199 107.342 m f
0.764706 0.854902 0.25098 rg
131.199 11.1 m 131.199 108.143 l 271.199 108.143 l 271.199 11.1 l 271.199
 8.065 268.738 5.6 265.699 5.6 c 136.703 5.6 l 133.664 5.6 131.199 8.065
 131.199 11.1 c h
131.199 11.1 m f
0.894118 0.00392157 0.211765 rg
174.18 271.901 m 174.18 302.256 l 131.199 302.256 l 131.199 271.901 l 131.199
 261.37 139.77 252.799 150.301 252.799 c 193.281 252.799 l 182.75 252.799
 174.18 261.37 174.18 271.901 c h
174.18 271.901 m f
193.281 156.799 m 150.301 156.799 l 139.77 156.799 131.199 148.229 131.199
 137.698 c 131.199 107.342 l 174.18 107.342 l 174.18 137.698 l 174.18 148.229
 182.75 156.799 193.281 156.799 c h
193.281 156.799 m f
0.678431 0.737255 0.0823529 rg
174.18 11.1 m 174.18 108.143 l 131.199 108.143 l 131.199 11.1 l 131.199
 8.065 133.664 5.6 136.703 5.6 c 179.684 5.6 l 176.645 5.6 174.18 8.065 
174.18 11.1 c h
174.18 11.1 m f
0.192157 0.823529 0.968627 rg
152 68.901 m 152 83.1 l 152 84.479 153.121 85.6 154.5 85.6 c 201.5 85.6
 l 202.879 85.6 204 84.479 204 83.1 c 204 68.901 l 204 67.518 202.879 66.401
 201.5 66.401 c 154.5 66.401 l 153.121 66.401 152 67.518 152 68.901 c h
152 68.901 m f
200.801 30.498 m 200.801 44.702 l 200.801 46.08 201.918 47.202 203.301 
47.202 c 250.301 47.202 l 251.68 47.202 252.801 46.08 252.801 44.702 c 252.801
 30.498 l 252.801 29.12 251.68 27.998 250.301 27.998 c 203.301 27.998 l 
201.918 27.998 200.801 29.12 200.801 30.498 c h
200.801 30.498 m f
1 0.811765 0.34902 rg
80.801 186.401 m 70.418 186.401 62.02 195.041 62.414 205.51 c 62.789 215.467
 71.289 223.202 81.254 223.202 c 148.461 223.202 l 155.078 234.881 l 155.656
 235.901 157.129 235.881 157.68 234.846 c 163.895 223.202 l 169.949 223.202
 l 179.91 223.202 188.41 215.467 188.785 205.51 c 189.184 195.041 180.781
 186.401 170.398 186.401 c h
80.801 186.401 m f
1 0.709804 0.360784 rg
93.555 193.077 m 93.93 203.034 102.43 210.768 112.391 210.768 c 179.602
 210.768 l 183.469 217.596 l 180.008 221.065 175.18 223.202 169.949 223.202
 c 163.895 223.202 l 157.68 234.846 l 157.129 235.881 155.656 235.901 155.078
 234.881 c 148.461 223.202 l 81.254 223.202 l 71.289 223.202 62.789 215.467
 62.414 205.51 c 62.02 195.041 70.418 186.401 80.801 186.401 c 94.535 186.401
 l 93.82 188.483 93.465 190.733 93.555 193.077 c h
93.555 193.077 m f
1 0.384314 0.654902 rg
245.707 186.401 m 239.652 186.401 l 229.688 186.401 221.191 194.131 220.812
 204.088 c 220.418 214.557 228.82 223.202 239.199 223.202 c 328.348 223.202
 l 338.312 223.202 346.809 215.467 347.188 205.51 c 347.582 195.041 339.18
 186.401 328.801 186.401 c 261.141 186.401 l 254.523 174.721 l 253.945 173.702
 252.469 173.721 251.918 174.752 c h
245.707 186.401 m f
0.988235 0.329412 0.47451 rg
240.078 186.705 m 239.68 197.174 248.082 205.819 258.465 205.819 c 347.168
 205.819 l 346.629 215.623 338.211 223.202 328.348 223.202 c 239.199 223.202
 l 228.82 223.202 220.418 214.557 220.812 204.088 c 221.191 194.131 229.688
 186.401 239.652 186.401 c 240.098 186.401 l 240.09 186.502 240.082 186.604
 240.078 186.705 c h
240.078 186.705 m f
0 g
298.398 11.998 m 276.801 11.998 l 276.801 137.698 l 276.801 151.319 265.719
 162.401 252.098 162.401 c 150.301 162.401 l 136.68 162.401 125.602 151.319
 125.602 137.698 c 125.602 11.998 l 104 11.998 l 100.688 11.998 98 9.315
 98 5.998 c 98 2.686 100.688 -0.002 104 -0.002 c 298.398 -0.002 l 301.715
 -0.002 304.398 2.686 304.398 5.998 c 304.398 9.315 301.715 11.998 298.398
 11.998 c h
264.801 113.745 m 245.742 113.745 l 242.527 113.745 239.934 111.159 239.875
 107.944 c 239.875 107.893 239.871 107.842 239.871 107.791 c 239.797 104.479
 242.426 101.745 245.738 101.745 c 264.801 101.745 l 264.801 11.998 l 137.602
 11.998 l 137.602 101.745 l 208.473 101.745 l 211.867 101.745 214.586 104.588
 214.387 107.975 c 214.387 108.026 214.383 108.077 214.379 108.127 c 214.207
 111.276 211.617 113.745 208.465 113.745 c 137.598 113.745 l 137.598 137.698
 l 137.598 144.713 143.285 150.401 150.301 150.401 c 252.098 150.401 l 259.113
 150.401 264.801 144.713 264.801 137.698 c h
264.801 113.745 m f
167.602 127.202 m 208.801 127.202 l 212.113 127.202 214.801 129.885 214.801
 133.202 c 214.801 136.514 212.113 139.202 208.801 139.202 c 167.602 139.202
 l 164.285 139.202 161.602 136.514 161.602 133.202 c 161.602 129.885 164.285
 127.202 167.602 127.202 c h
167.602 127.202 m f
226.801 127.202 m 235.602 127.202 l 238.914 127.202 241.602 129.885 241.602
 133.202 c 241.602 136.514 238.914 139.202 235.602 139.202 c 226.801 139.202
 l 223.484 139.202 220.801 136.514 220.801 133.202 c 220.801 129.885 223.484
 127.202 226.801 127.202 c h
226.801 127.202 m f
209.602 66.799 m 209.602 85.202 l 209.602 88.514 206.914 91.202 203.602
 91.202 c 152.398 91.202 l 149.086 91.202 146.398 88.514 146.398 85.202 
c 146.398 66.799 l 146.398 63.487 149.086 60.799 152.398 60.799 c 203.602
 60.799 l 206.914 60.799 209.602 63.487 209.602 66.799 c h
197.602 72.799 m 158.398 72.799 l 158.398 79.202 l 197.602 79.202 l h
197.602 72.799 m f
252.398 52.799 m 201.199 52.799 l 197.887 52.799 195.199 50.112 195.199
 46.799 c 195.199 28.401 l 195.199 25.088 197.887 22.401 201.199 22.401 
c 252.398 22.401 l 255.715 22.401 258.398 25.088 258.398 28.401 c 258.398
 46.799 l 258.398 50.112 255.715 52.799 252.398 52.799 c h
246.398 34.401 m 207.199 34.401 l 207.199 40.799 l 246.398 40.799 l h
246.398 34.401 m f
328.801 228.799 m 239.199 228.799 l 225.965 228.799 215.199 218.034 215.199
 204.799 c 215.199 191.565 225.965 180.799 239.199 180.799 c 242.348 180.799
 l 247.906 170.377 l 248.938 168.444 250.934 167.229 253.125 167.202 c 253.199
 167.202 l 255.359 167.202 257.355 168.362 258.422 170.245 c 264.402 180.799
 l 328.801 180.799 l 342.035 180.799 352.801 191.565 352.801 204.799 c 352.801
 218.034 342.035 228.799 328.801 228.799 c h
328.801 192.799 m 260.906 192.799 l 258.746 192.799 256.754 191.639 255.688
 189.756 c 253.359 185.651 l 251.242 189.623 l 250.199 191.577 248.164 192.799
 245.949 192.799 c 239.199 192.799 l 232.582 192.799 227.199 198.182 227.199
 204.799 c 227.199 211.416 232.582 216.799 239.199 216.799 c 328.801 216.799
 l 335.418 216.799 340.801 211.416 340.801 204.799 c 340.801 198.182 335.418
 192.799 328.801 192.799 c h
328.801 192.799 m f
104 397.6 m 125.602 397.6 l 125.602 271.901 l 125.602 258.28 136.68 247.202
 150.301 247.202 c 252.098 247.202 l 265.719 247.202 276.801 258.28 276.801
 271.901 c 276.801 397.6 l 298.398 397.6 l 301.715 397.6 304.398 400.288
 304.398 403.6 c 304.398 406.913 301.715 409.6 298.398 409.6 c 104 409.6
 l 100.688 409.6 98 406.913 98 403.6 c 98 400.288 100.688 397.6 104 397.6
 c h
252.098 259.202 m 150.301 259.202 l 143.297 259.202 137.602 264.897 137.602
 271.901 c 137.602 295.858 l 264.801 295.858 l 264.801 271.901 l 264.801
 264.897 259.102 259.202 252.098 259.202 c h
264.801 397.6 m 264.801 307.858 l 137.602 307.858 l 137.602 397.6 l h
264.801 397.6 m f
208.801 282.401 m 167.602 282.401 l 164.285 282.401 161.602 279.713 161.602
 276.401 c 161.602 273.088 164.285 270.401 167.602 270.401 c 208.801 270.401
 l 212.113 270.401 214.801 273.088 214.801 276.401 c 214.801 279.713 212.113
 282.401 208.801 282.401 c h
208.801 282.401 m f
235.602 282.401 m 226.801 282.401 l 223.484 282.401 220.801 279.713 220.801
 276.401 c 220.801 273.088 223.484 270.401 226.801 270.401 c 235.602 270.401
 l 238.914 270.401 241.602 273.088 241.602 276.401 c 241.602 279.713 238.914
 282.401 235.602 282.401 c h
235.602 282.401 m f
152.398 318.401 m 203.602 318.401 l 206.914 318.401 209.602 321.088 209.602
 324.401 c 209.602 342.799 l 209.602 346.112 206.914 348.799 203.602 348.799
 c 152.398 348.799 l 149.086 348.799 146.398 346.112 146.398 342.799 c 146.398
 324.401 l 146.398 321.088 149.086 318.401 152.398 318.401 c h
158.398 336.799 m 197.602 336.799 l 197.602 330.401 l 158.398 330.401 l
 h
158.398 336.799 m f
201.199 356.799 m 252.398 356.799 l 255.715 356.799 258.398 359.487 258.398
 362.799 c 258.398 381.202 l 258.398 384.514 255.715 387.202 252.398 387.202
 c 201.199 387.202 l 197.887 387.202 195.199 384.514 195.199 381.202 c 195.199
 362.799 l 195.199 359.487 197.887 356.799 201.199 356.799 c h
207.199 375.202 m 246.398 375.202 l 246.398 368.799 l 207.199 368.799 l
 h
207.199 375.202 m f
194.398 204.799 m 194.398 218.034 183.633 228.799 170.398 228.799 c 167.254
 228.799 l 161.695 239.225 l 160.664 241.155 158.664 242.37 156.477 242.401
 c 154.32 242.432 152.258 241.26 151.18 239.358 c 145.195 228.799 l 80.801
 228.799 l 67.566 228.799 56.801 218.034 56.801 204.799 c 56.801 191.565
 67.566 180.799 80.801 180.799 c 170.398 180.799 l 183.633 180.799 194.398
 191.565 194.398 204.799 c h
68.801 204.799 m 68.801 211.416 74.184 216.799 80.801 216.799 c 148.695
 216.799 l 150.855 216.799 152.848 217.963 153.914 219.842 c 156.242 223.948
 l 158.359 219.975 l 159.402 218.022 161.438 216.799 163.652 216.799 c 170.398
 216.799 l 177.016 216.799 182.398 211.416 182.398 204.799 c 182.398 198.182
 177.016 192.799 170.398 192.799 c 80.801 192.799 l 74.184 192.799 68.801
 198.182 68.801 204.799 c h
68.801 204.799 m f
Q Q
showpage
%%Trailer
end restore
%%EOF
