%!PS-Adobe-3.0 EPSF-3.0
%%Creator: cairo 1.14.2 (http://cairographics.org)
%%CreationDate: Mon Feb 19 09:15:05 2018
%%Pages: 1
%%DocumentData: Clean7Bit
%%LanguageLevel: 2
%%BoundingBox: 0 14 410 395
%%EndComments
%%BeginProlog
save
50 dict begin
/q { gsave } bind def
/Q { grestore } bind def
/cm { 6 array astore concat } bind def
/w { setlinewidth } bind def
/J { setlinecap } bind def
/j { setlinejoin } bind def
/M { setmiterlimit } bind def
/d { setdash } bind def
/m { moveto } bind def
/l { lineto } bind def
/c { curveto } bind def
/h { closepath } bind def
/re { exch dup neg 3 1 roll 5 3 roll moveto 0 rlineto
      0 exch rlineto 0 rlineto closepath } bind def
/S { stroke } bind def
/f { fill } bind def
/f* { eofill } bind def
/n { newpath } bind def
/W { clip } bind def
/W* { eoclip } bind def
/BT { } bind def
/ET { } bind def
/pdfmark where { pop globaldict /?pdfmark /exec load put }
    { globaldict begin /?pdfmark /pop load def /pdfmark
    /cleartomark load def end } ifelse
/BDC { mark 3 1 roll /BDC pdfmark } bind def
/EMC { mark /EMC pdfmark } bind def
/cairo_store_point { /cairo_point_y exch def /cairo_point_x exch def } def
/Tj { show currentpoint cairo_store_point } bind def
/TJ {
  {
    dup
    type /stringtype eq
    { show } { -0.001 mul 0 cairo_font_matrix dtransform rmoveto } ifelse
  } forall
  currentpoint cairo_store_point
} bind def
/cairo_selectfont { cairo_font_matrix aload pop pop pop 0 0 6 array astore
    cairo_font exch selectfont cairo_point_x cairo_point_y moveto } bind def
/Tf { pop /cairo_font exch def /cairo_font_matrix where
      { pop cairo_selectfont } if } bind def
/Td { matrix translate cairo_font_matrix matrix concatmatrix dup
      /cairo_font_matrix exch def dup 4 get exch 5 get cairo_store_point
      /cairo_font where { pop cairo_selectfont } if } bind def
/Tm { 2 copy 8 2 roll 6 array astore /cairo_font_matrix exch def
      cairo_store_point /cairo_font where { pop cairo_selectfont } if } bind def
/g { setgray } bind def
/rg { setrgbcolor } bind def
/d1 { setcachedevice } bind def
%%EndProlog
%%BeginSetup
%%EndSetup
%%Page: 1 1
%%BeginPageSetup
%%PageBoundingBox: 0 14 410 395
%%EndPageSetup
q 0 14 410 381 rectclip q
0.192157 0.823529 0.968627 rg
362.809 296.705 m 304.961 296.705 l 304.82 275.834 l 304.82 151.959 l 385.18
 151.959 l 385.18 296.705 l h
362.809 296.705 m f
0.0745098 0.67451 0.909804 rg
352.965 183.064 m 345.32 183.064 339.117 189.263 339.117 196.912 c 339.117
 275.834 l 339.258 296.705 l 304.961 296.705 l 304.82 275.834 l 304.82 151.962
 l 385.18 151.962 l 385.18 183.064 l h
352.965 183.064 m f
1 0.811765 0.34902 rg
94.898 366.619 179.883 -80.359 re f
1 0.709804 0.360784 rg
242.508 366.619 m 94.898 366.619 l 94.898 331.537 l 227.824 331.537 l 235.934
 331.537 242.508 324.962 242.508 316.853 c 242.508 286.259 l 274.781 286.259
 l 274.781 366.619 l h
242.508 366.619 m f
0.980392 0.827451 0.576471 rg
352.734 339.877 m 391.555 339.877 l 396.953 339.877 401.348 344.267 401.348
 349.67 c 401.348 355.068 396.953 359.462 391.555 359.462 c 352.734 359.462
 l 351.629 359.462 350.734 360.361 350.734 361.462 c 350.734 362.564 351.629
 363.459 352.734 363.459 c 391.555 363.459 l 396.953 363.459 401.348 367.853
 401.348 373.252 c 401.348 378.654 396.953 383.045 391.555 383.045 c 325.66
 383.045 l 312.383 383.045 299.387 376.935 290.898 366.693 c 289.98 365.584
 l 281.891 365.584 l 281.891 286.259 l 290.848 286.185 l 299.34 275.502 
312.547 269.123 326.184 269.123 c 354.969 269.123 l 360.371 269.123 364.762
 273.513 364.762 278.916 c 364.762 284.314 360.371 288.709 354.969 288.709
 c 337.961 288.709 l 336.859 288.709 335.961 289.607 335.961 290.709 c 335.961
 291.81 336.859 292.705 337.961 292.705 c 391.246 292.705 l 393.961 292.705
 396.621 293.83 398.547 295.791 c 400.398 297.677 401.395 300.13 401.348
 302.689 c 401.246 307.986 396.855 312.295 391.555 312.295 c 352.734 312.295
 l 351.633 312.295 350.734 313.189 350.734 314.291 c 350.734 315.392 351.633
 316.291 352.734 316.291 c 391.555 316.291 l 396.957 316.291 401.348 320.685
 401.348 326.084 c 401.348 331.482 396.957 335.877 391.555 335.877 c 352.734
 335.877 l 351.633 335.877 350.734 336.775 350.734 337.877 c 350.738 338.978
 351.633 339.877 352.734 339.877 c h
352.734 339.877 m f
0.929412 0.717647 0.411765 rg
391.297 383.048 m 351.668 383.048 l 351.668 382.658 l 351.668 377.334 355.984
 373.021 361.309 373.021 c 391.555 373.021 l 395.121 373.021 398.238 371.095
 399.953 368.24 c 401.043 370.064 401.574 372.259 401.258 374.599 c 400.586
 379.494 396.234 383.048 391.297 383.048 c h
391.297 383.048 m f
391.254 359.462 m 352.73 359.462 l 352.34 359.462 351.977 359.58 351.668
 359.775 c 351.668 354.451 355.984 350.138 361.309 350.138 c 392.352 350.138
 l 395.766 350.138 398.754 348.369 400.504 345.712 c 401.199 347.275 401.504
 349.045 401.27 350.912 c 400.645 355.857 396.242 359.462 391.254 359.462
 c h
391.254 359.462 m f
391.328 335.877 m 352.734 335.877 l 352.34 335.877 351.977 335.998 351.668
 336.193 c 351.668 335.927 l 351.668 330.603 355.984 326.291 361.309 326.291
 c 392.355 326.291 l 395.719 326.291 398.668 324.568 400.43 321.974 c 401.258
 323.752 401.586 325.806 401.164 327.974 c 400.266 332.615 396.055 335.877
 391.328 335.877 c h
391.328 335.877 m f
391.113 312.295 m 352.734 312.295 l 352.34 312.295 351.977 312.412 351.668
 312.607 c 351.668 312.244 l 351.668 306.923 355.984 302.607 361.309 302.607
 c 392.355 302.607 l 395.68 302.607 398.605 300.923 400.375 298.377 c 401.328
 300.318 401.617 302.525 401.078 304.74 c 399.977 309.244 395.754 312.295
 391.113 312.295 c h
391.113 312.295 m f
354.738 288.709 m 337.961 288.709 l 337.406 288.709 336.902 288.939 336.543
 289.302 c 336.543 288.939 l 336.543 283.615 340.855 279.302 346.18 279.302
 c 355.609 279.302 l 359.066 279.302 362.09 277.486 363.832 274.775 c 364.668
 276.552 365 278.611 364.586 280.779 c 363.691 285.435 359.477 288.709 354.738
 288.709 c h
354.738 288.709 m f
0.827451 0.6 0.0941176 rg
274.668 276.447 m 270.082 276.447 266.352 280.177 266.352 284.763 c 266.352
 368.119 l 266.352 372.701 270.082 376.431 274.668 376.431 c 280.066 376.431
 l 284.652 376.431 288.383 372.701 288.383 368.119 c 288.383 284.763 l 288.383
 280.177 284.652 276.447 280.066 276.447 c h
274.668 276.447 m f
0.776471 0.537255 0.0627451 rg
280.066 376.431 m 274.668 376.431 l 270.082 376.431 266.352 372.701 266.352
 368.115 c 266.352 327.935 l 266.352 332.521 270.082 336.252 274.668 336.252
 c 280.066 336.252 l 284.652 336.252 288.383 332.521 288.383 327.935 c 288.383
 368.119 l 288.383 372.701 284.652 376.431 280.066 376.431 c h
280.066 376.431 m f
0.764706 0.854902 0.25098 rg
24.418 257.638 80.359 -147.887 re f
0.678431 0.737255 0.0823529 rg
104.777 257.638 m 24.418 257.638 l 24.418 109.752 l 64.598 109.752 l 64.598
 214.572 l 64.598 227.009 74.684 237.091 87.121 237.091 c 104.777 237.091
 l h
104.777 257.638 m f
0.980392 0.827451 0.576471 rg
119.621 122.322 m 118.754 123.412 l 110.262 134.095 97.055 140.474 83.418
 140.474 c 54.629 140.474 l 49.23 140.474 44.836 136.08 44.836 130.681 c
 44.836 125.283 49.23 120.888 54.629 120.888 c 71.641 120.888 l 72.742 120.888
 73.637 119.99 73.637 118.888 c 73.637 117.787 72.742 116.892 71.641 116.892
 c 18.355 116.892 l 15.641 116.892 12.98 115.767 11.055 113.806 c 9.199 
111.92 8.207 109.466 8.254 106.908 c 8.355 101.611 12.746 97.302 18.047 
97.302 c 56.867 97.302 l 57.969 97.302 58.863 96.408 58.863 95.306 c 58.863
 94.205 57.969 93.306 56.867 93.306 c 18.047 93.306 l 12.645 93.306 8.254
 88.912 8.254 83.513 c 8.254 78.115 12.645 73.72 18.047 73.72 c 56.867 73.72
 l 57.969 73.72 58.863 72.822 58.863 71.72 c 58.863 70.619 57.969 69.724
 56.867 69.724 c 18.047 69.724 l 12.645 69.724 8.254 65.33 8.254 59.931 
c 8.254 54.529 12.645 50.134 18.047 50.134 c 56.867 50.134 l 57.969 50.134
 58.863 49.24 58.863 48.138 c 58.863 47.037 57.969 46.138 56.867 46.138 
c 18.047 46.138 l 12.645 46.138 8.254 41.744 8.254 36.345 c 8.254 30.947
 12.645 26.552 18.047 26.552 c 83.938 26.552 l 97.219 26.552 110.211 32.666
 118.699 42.904 c 119.617 44.013 l 125.285 44.154 l 125.285 122.322 l h
119.621 122.322 m f
0.929412 0.717647 0.411765 rg
57.246 27.435 m 57.246 32.423 53.199 36.466 48.215 36.466 c 18.047 36.466
 l 14.457 36.466 11.32 38.412 9.613 41.302 c 8.547 39.494 8.031 37.322 8.34
 35.013 c 9.004 30.115 13.355 26.552 18.297 26.552 c 57.242 26.552 l 57.242
 27.435 l h
57.246 27.435 m f
18.324 50.134 m 56.867 50.134 l 56.996 50.134 57.125 50.123 57.246 50.099
 c 57.246 50.353 l 57.246 55.341 53.203 59.384 48.215 59.384 c 17.246 59.384
 l 13.824 59.384 10.816 61.158 9.066 63.826 c 8.383 62.259 8.094 60.486 
8.34 58.619 c 8.988 53.705 13.363 50.134 18.324 50.134 c h
18.324 50.134 m f
18.352 73.72 m 56.867 73.72 l 56.996 73.72 57.121 73.705 57.246 73.681 
c 57.246 78.67 53.203 82.712 48.215 82.712 c 17.246 82.712 l 13.781 82.712
 10.738 84.533 9 87.259 c 8.434 85.892 8.16 84.377 8.277 82.787 c 8.66 77.619
 13.168 73.72 18.352 73.72 c h
18.352 73.72 m f
18.512 97.302 m 56.867 97.302 l 56.996 97.302 57.125 97.291 57.246 97.267
 c 57.246 97.4 l 57.246 102.388 53.203 106.431 48.215 106.431 c 17.246 106.431
 l 13.824 106.431 10.816 108.205 9.066 110.873 c 8.219 108.959 8 106.814
 8.578 104.666 c 9.762 100.252 13.941 97.302 18.512 97.302 c h
18.512 97.302 m f
54.934 120.888 m 71.641 120.888 l 72.219 120.888 72.734 120.638 73.098 
120.248 c 73.098 120.728 l 73.098 125.716 69.055 129.759 64.066 129.759 
c 53.793 129.759 l 50.324 129.759 47.281 131.584 45.543 134.314 c 44.922
 132.771 44.672 131.041 44.945 129.224 c 45.672 124.373 50.027 120.888 54.934
 120.888 c h
54.934 120.888 m f
0.627451 0.458824 0.188235 rg
112.121 349.658 m 106.723 349.658 102.328 345.263 102.328 339.861 c 102.328
 322.853 l 102.328 321.752 101.434 320.853 100.332 320.853 c 99.227 320.853
 98.332 321.752 98.332 322.853 c 98.332 376.138 l 98.332 378.853 97.207 
381.513 95.246 383.435 c 93.406 385.244 91.012 386.24 88.5 386.24 c 88.352
 386.24 l 83.055 386.138 78.746 381.748 78.746 376.447 c 78.746 337.627 
l 78.746 336.525 77.848 335.627 76.746 335.627 c 75.645 335.627 74.746 336.525
 74.746 337.627 c 74.746 376.447 l 74.746 381.845 70.355 386.24 64.953 386.24
 c 59.555 386.24 55.16 381.845 55.16 376.447 c 55.16 337.627 l 55.16 336.525
 54.266 335.627 53.164 335.627 c 52.059 335.627 51.164 336.525 51.164 337.627
 c 51.164 376.447 l 51.164 381.845 46.77 386.24 41.371 386.24 c 35.969 386.24
 31.578 381.845 31.578 376.447 c 31.578 337.627 l 31.578 336.525 30.68 335.627
 29.578 335.627 c 28.477 335.627 27.578 336.525 27.578 337.627 c 27.578 
376.447 l 27.578 381.845 23.188 386.24 17.785 386.24 c 12.387 386.24 7.992
 381.845 7.992 376.447 c 7.992 310.552 l 7.992 297.275 14.105 284.279 24.348
 275.795 c 25.457 274.873 l 25.457 269.123 l 103.832 269.123 l 103.762 274.873
 l 104.852 275.744 l 115.535 284.255 121.914 297.462 121.914 311.076 c 121.914
 339.861 l 121.914 345.263 117.523 349.658 112.121 349.658 c h
112.121 349.658 m f
0.509804 0.321569 0.0666667 rg
8.77 337.431 m 14.367 337.431 18.906 341.97 18.906 347.568 c 18.906 376.447
 l 18.906 379.83 20.629 382.814 23.242 384.576 c 21.574 385.697 19.543 386.322
 17.363 386.232 c 12.074 386.005 7.992 381.451 7.992 376.154 c 7.992 337.431
 l h
8.77 337.431 m f
31.559 337.431 m 37.156 337.431 41.691 341.97 41.691 347.568 c 41.691 377.244
 l 41.691 380.513 43.309 383.4 45.777 385.181 c 43.984 386.087 41.883 386.478
 39.664 386.091 c 34.938 385.267 31.574 381.013 31.574 376.22 c 31.574 337.623
 l 31.578 337.556 31.562 337.498 31.559 337.431 c h
31.559 337.431 m f
55.145 337.431 m 60.742 337.431 65.281 341.97 65.281 347.568 c 65.281 377.244
 l 65.281 380.513 66.898 383.4 69.363 385.177 c 67.57 386.087 65.469 386.478
 63.25 386.091 c 58.523 385.267 55.164 381.017 55.164 376.22 c 55.164 337.627
 l 55.164 337.56 55.148 337.494 55.145 337.431 c 55.141 337.431 55.145 337.431
 55.145 337.431 c h
55.145 337.431 m f
78.734 337.431 m 84.332 337.431 88.867 341.97 88.867 347.568 c 88.867 377.244
 l 88.867 380.494 90.469 383.365 92.906 385.146 c 91.551 385.857 90.047 
386.24 88.5 386.24 c 88.352 386.24 l 83.055 386.138 78.746 381.748 78.746
 376.447 c 78.746 337.627 l 78.746 337.56 78.73 337.498 78.727 337.431 c
 h
78.734 337.431 m f
112.457 340.576 m 112.457 343.873 114.102 346.787 116.605 348.56 c 114.801
 349.494 112.684 349.896 110.445 349.513 c 105.707 348.709 102.328 344.455
 102.328 339.646 c 102.328 322.853 l 102.328 322.357 102.141 321.912 101.844
 321.56 c 102.32 321.56 l 107.918 321.56 112.457 326.099 112.457 331.697
 c h
112.457 340.576 m f
0.603922 0.658824 0.0666667 rg
22.922 251.244 m 18.34 251.244 14.609 254.974 14.609 259.56 c 14.609 264.959
 l 14.609 269.545 18.34 273.275 22.922 273.275 c 106.277 273.275 l 110.859
 273.275 114.59 269.545 114.59 264.959 c 114.59 259.56 l 114.59 254.974 
110.859 251.244 106.277 251.244 c h
22.922 251.244 m f
0.443137 0.466667 0 rg
54.789 259.56 m 54.789 264.959 l 54.789 269.545 58.52 273.275 63.102 273.275
 c 22.922 273.275 l 18.34 273.275 14.609 269.545 14.609 264.959 c 14.609
 259.56 l 14.609 254.974 18.34 251.244 22.922 251.244 c 63.102 251.244 l
 58.52 251.244 54.789 254.974 54.789 259.56 c h
54.789 259.56 m f
1 0.384314 0.654902 rg
290.68 123.337 m 132.234 123.337 l 132.234 42.978 l 318.262 42.978 l 318.262
 123.337 l h
290.68 123.337 m f
0.988235 0.329412 0.47451 rg
309.168 76.568 m 188.824 76.568 l 176.02 76.568 165.641 86.947 165.641 
99.755 c 165.641 123.337 l 132.234 123.337 l 132.234 42.978 l 318.262 42.978
 l 318.262 76.568 l h
309.168 76.568 m f
0.94902 0.12549 0.360784 rg
129.531 33.166 m 124.949 33.166 121.219 36.896 121.219 41.482 c 121.219
 124.834 l 121.219 129.42 124.949 133.15 129.531 133.15 c 134.934 133.15
 l 139.52 133.15 143.25 129.42 143.25 124.834 c 143.25 41.482 l 143.25 36.896
 139.52 33.166 134.934 33.166 c h
129.531 33.166 m f
0.8 0.0352941 0.329412 rg
134.934 76.111 m 129.531 76.111 l 124.945 76.111 121.219 79.841 121.219
 84.427 c 121.219 41.482 l 121.219 36.896 124.945 33.166 129.531 33.166 
c 134.934 33.166 l 139.52 33.166 143.246 36.896 143.246 41.482 c 143.246
 84.427 l 143.25 79.841 139.52 76.111 134.934 76.111 c h
134.934 76.111 m f
0.980392 0.827451 0.576471 rg
385.254 133.806 m 384.145 134.724 l 383.992 142.634 l 305.84 142.634 l 
305.84 134.724 l 304.746 133.857 l 294.062 125.345 287.684 112.134 287.684
 98.525 c 287.684 69.736 l 287.684 64.337 292.078 59.943 297.477 59.943 
c 302.879 59.943 307.27 64.337 307.27 69.736 c 307.27 86.748 l 307.27 87.849
 308.168 88.744 309.27 88.744 c 310.371 88.744 311.27 87.849 311.27 86.748
 c 311.27 33.462 l 311.27 30.744 312.391 28.084 314.352 26.162 c 316.195
 24.353 318.594 23.361 321.109 23.361 c 321.25 23.361 l 326.547 23.459 330.855
 27.853 330.855 33.154 c 330.855 71.974 l 330.855 73.076 331.754 73.97 332.855
 73.97 c 333.957 73.97 334.852 73.076 334.852 71.974 c 334.852 33.154 l 
334.852 27.752 339.246 23.357 344.645 23.357 c 350.047 23.357 354.441 27.752
 354.441 33.154 c 354.441 71.974 l 354.441 73.076 355.336 73.97 356.438 
73.97 c 357.539 73.97 358.438 73.076 358.438 71.974 c 358.438 33.154 l 358.438
 27.752 362.832 23.357 368.23 23.357 c 373.629 23.357 378.023 27.752 378.023
 33.154 c 378.023 71.974 l 378.023 73.076 378.922 73.97 380.023 73.97 c 
381.125 73.97 382.02 73.076 382.02 71.974 c 382.02 33.154 l 382.02 27.752
 386.414 23.357 391.812 23.357 c 397.215 23.357 401.609 27.752 401.609 33.154
 c 401.609 99.045 l 401.605 112.326 395.492 125.318 385.254 133.806 c h
385.254 133.806 m f
385.254 133.806 m 384.145 134.724 l 383.992 142.634 l 305.84 142.634 l 
305.84 134.724 l 304.746 133.857 l 294.062 125.345 287.684 112.134 287.684
 98.525 c 287.684 69.736 l 287.684 64.337 292.078 59.943 297.477 59.943 
c 302.879 59.943 307.27 64.337 307.27 69.736 c 307.27 86.748 l 307.27 87.849
 308.168 88.744 309.27 88.744 c 310.371 88.744 311.27 87.849 311.27 86.748
 c 311.27 33.462 l 311.27 30.744 312.391 28.084 314.352 26.162 c 316.195
 24.353 318.594 23.361 321.109 23.361 c 321.25 23.361 l 326.547 23.459 330.855
 27.853 330.855 33.154 c 330.855 71.974 l 330.855 73.076 331.754 73.97 332.855
 73.97 c 333.957 73.97 334.852 73.076 334.852 71.974 c 334.852 33.154 l 
334.852 27.752 339.246 23.357 344.645 23.357 c 350.047 23.357 354.441 27.752
 354.441 33.154 c 354.441 71.974 l 354.441 73.076 355.336 73.97 356.438 
73.97 c 357.539 73.97 358.438 73.076 358.438 71.974 c 358.438 33.154 l 358.438
 27.752 362.832 23.357 368.23 23.357 c 373.629 23.357 378.023 27.752 378.023
 33.154 c 378.023 71.974 l 378.023 73.076 378.922 73.97 380.023 73.97 c 
381.125 73.97 382.02 73.076 382.02 71.974 c 382.02 33.154 l 382.02 27.752
 386.414 23.357 391.812 23.357 c 397.215 23.357 401.609 27.752 401.609 33.154
 c 401.609 99.045 l 401.605 112.326 395.492 125.318 385.254 133.806 c h
385.254 133.806 m f
0.929412 0.717647 0.411765 rg
400.578 72.291 m 396.227 72.291 392.703 68.763 392.703 64.412 c 392.703
 33.154 l 392.703 29.357 390.527 26.064 387.363 24.443 c 389.16 23.517 391.273
 23.123 393.504 23.505 c 398.234 24.318 401.609 28.572 401.609 33.373 c 
401.609 72.295 l 400.578 72.295 l h
400.578 72.291 m f
377.73 72.291 m 373.379 72.291 369.855 68.763 369.855 64.412 c 369.855 
32.353 l 369.855 28.759 367.902 25.619 365.004 23.916 c 366.699 23.322 368.594
 23.154 370.582 23.65 c 375.02 24.759 378.023 28.908 378.023 33.478 c 378.023
 71.974 l 378.023 72.084 378.039 72.189 378.055 72.291 c h
377.73 72.291 m f
354.473 72.291 m 350.121 72.291 346.594 68.763 346.594 64.412 c 346.594
 32.353 l 346.594 28.705 344.582 25.529 341.617 23.845 c 343.082 23.365 
344.691 23.212 346.375 23.513 c 351.105 24.357 354.438 28.666 354.438 33.474
 c 354.438 71.974 l 354.438 72.08 354.453 72.185 354.473 72.291 c h
354.473 72.291 m f
330.242 72.291 m 325.891 72.291 322.363 68.763 322.363 64.412 c 322.363
 32.353 l 322.363 28.826 320.484 25.736 317.676 24.009 c 318.766 23.587 
319.926 23.361 321.109 23.361 c 321.25 23.361 l 326.547 23.459 330.855 27.853
 330.855 33.154 c 330.855 71.974 l 330.855 72.08 330.871 72.185 330.887 
72.291 c h
330.242 72.291 m f
306.984 88.185 m 302.633 88.185 299.105 84.658 299.105 80.306 c 299.105
 68.795 l 299.105 65.259 297.219 62.166 294.406 60.443 c 296.094 59.884 
297.977 59.752 299.945 60.259 c 304.316 61.388 307.273 65.478 307.273 69.99
 c 307.273 86.748 l 307.273 87.314 307.512 87.822 307.891 88.185 c h
306.984 88.185 m f
0.0352941 0.52549 0.698039 rg
303.324 136.322 m 298.738 136.322 295.008 140.052 295.008 144.638 c 295.008
 150.041 l 295.008 154.623 298.738 158.353 303.324 158.353 c 386.676 158.353
 l 391.262 158.353 394.992 154.623 394.992 150.041 c 394.992 144.638 l 394.992
 140.052 391.262 136.322 386.676 136.322 c h
303.324 136.322 m f
0.0313726 0.470588 0.588235 rg
335.191 144.638 m 335.191 150.041 l 335.191 154.623 338.922 158.353 343.504
 158.353 c 303.324 158.353 l 298.738 158.353 295.008 154.623 295.008 150.041
 c 295.008 144.638 l 295.008 140.052 298.738 136.322 303.324 136.322 c 343.504
 136.322 l 338.922 136.322 335.191 140.052 335.191 144.638 c h
335.191 144.638 m f
0 g
396.082 134.42 m 398.844 136.962 400.586 140.595 400.586 144.638 c 400.586
 150.041 l 400.586 156.283 396.453 161.576 390.777 163.33 c 390.777 284.712
 l 391.246 284.712 l 396.094 284.712 400.832 286.709 404.25 290.193 c 407.621
 293.623 409.426 298.115 409.34 302.837 c 409.258 307.209 407.566 311.209
 404.844 314.271 c 407.641 317.416 409.34 321.556 409.34 326.084 c 409.34
 330.603 407.648 334.736 404.859 337.877 c 407.648 341.017 409.34 345.15
 409.34 349.67 c 409.34 354.189 407.648 358.318 404.859 361.459 c 407.648
 364.603 409.34 368.732 409.34 373.252 c 409.34 383.06 401.363 391.041 391.555
 391.041 c 325.66 391.041 l 312.57 391.041 299.938 386.111 290.285 377.521
 c 287.742 380.283 284.109 382.025 280.07 382.025 c 274.668 382.025 l 268.422
 382.025 263.129 377.892 261.375 372.216 c 106.324 372.216 l 106.324 376.138
 l 106.324 380.986 104.328 385.724 100.848 389.142 c 97.414 392.509 92.941
 394.33 88.199 394.232 c 83.828 394.146 79.828 392.459 76.766 389.736 c 
73.621 392.533 69.484 394.232 64.953 394.232 c 60.434 394.232 56.305 392.537
 53.164 389.752 c 50.02 392.537 45.891 394.232 41.371 394.232 c 36.852 394.232
 32.719 392.537 29.578 389.752 c 26.438 392.537 22.305 394.232 17.785 394.232
 c 7.977 394.232 0 386.255 0 376.447 c 0 310.552 l 0 297.459 4.93 284.83
 13.516 275.177 c 10.758 272.634 9.012 269.002 9.012 264.959 c 9.012 259.56
 l 9.012 253.314 13.148 248.021 18.824 246.267 c 18.824 124.884 l 18.355
 124.884 l 13.508 124.884 8.766 122.888 5.348 119.408 c 1.98 115.974 0.172
 111.482 0.262 106.759 c 0.344 102.392 2.035 98.392 4.758 95.326 c 1.961
 92.181 0.258 88.045 0.258 83.513 c 0.258 78.994 1.953 74.865 4.738 71.724
 c 1.953 68.58 0.258 64.451 0.258 59.931 c 0.258 55.412 1.953 51.279 4.738
 48.138 c 1.953 44.998 0.258 40.865 0.258 36.345 c 0.258 26.537 8.238 18.56
 18.047 18.56 c 83.938 18.56 l 97.031 18.56 109.664 23.49 119.312 32.076
 c 121.859 29.318 125.492 27.572 129.531 27.572 c 134.934 27.572 l 141.176
 27.572 146.473 31.709 148.227 37.384 c 303.273 37.384 l 303.273 33.462 
l 303.273 28.615 305.27 23.873 308.754 20.459 c 312.105 17.166 316.469 15.365
 321.07 15.365 c 321.18 15.365 321.289 15.365 321.398 15.369 c 325.77 15.451
 329.77 17.142 332.832 19.865 c 335.977 17.068 340.117 15.365 344.645 15.365
 c 349.164 15.365 353.297 17.06 356.438 19.845 c 359.578 17.06 363.711 15.365
 368.23 15.365 c 372.746 15.365 376.879 17.06 380.02 19.849 c 383.164 17.06
 387.293 15.365 391.812 15.365 c 401.621 15.365 409.602 23.345 409.602 33.154
 c 409.602 99.045 l 409.602 112.138 404.672 124.771 396.082 134.42 c h
293.977 364.142 m 301.742 373.509 313.445 379.048 325.66 379.048 c 391.555
 379.048 l 394.75 379.048 397.352 376.451 397.352 373.252 c 397.352 370.056
 394.75 367.455 391.555 367.455 c 352.734 367.455 l 349.422 367.455 346.738
 364.771 346.738 361.459 c 346.738 358.15 349.422 355.466 352.734 355.466
 c 391.555 355.466 l 394.75 355.466 397.352 352.865 397.352 349.67 c 397.352
 346.47 394.75 343.869 391.555 343.869 c 352.734 343.869 l 349.422 343.869
 346.738 341.185 346.738 337.877 c 346.738 334.564 349.422 331.88 352.734
 331.88 c 391.555 331.88 l 394.75 331.88 397.352 329.283 397.352 326.084
 c 397.352 322.888 394.75 320.287 391.555 320.287 c 352.734 320.287 l 349.422
 320.287 346.738 317.603 346.738 314.291 c 346.738 310.982 349.422 308.298
 352.734 308.298 c 391.555 308.298 l 394.691 308.298 397.293 305.748 397.352
 302.615 c 397.379 301.138 396.789 299.709 395.695 298.591 c 394.516 297.392
 392.895 296.705 391.246 296.705 c 337.961 296.705 l 334.652 296.705 331.969
 294.021 331.969 290.709 c 331.969 287.4 334.652 284.712 337.961 284.712
 c 354.969 284.712 l 358.168 284.712 360.77 282.115 360.77 278.916 c 360.77
 275.72 358.168 273.119 354.969 273.119 c 326.184 273.119 l 313.645 273.119
 301.742 278.9 293.977 288.673 c h
388.598 150.041 m 388.598 144.638 l 388.598 143.58 387.734 142.72 386.676
 142.72 c 303.324 142.72 l 302.266 142.72 301.402 143.58 301.402 144.638
 c 301.402 150.041 l 301.402 151.099 302.266 151.962 303.324 151.962 c 386.676
 151.962 l 387.734 151.959 388.598 151.099 388.598 150.041 c h
272.746 368.119 m 272.746 369.177 273.605 370.037 274.664 370.037 c 280.066
 370.037 l 281.125 370.037 281.988 369.177 281.988 368.119 c 281.988 284.763
 l 281.988 283.705 281.125 282.841 280.066 282.841 c 274.664 282.841 l 273.605
 282.841 272.746 283.705 272.746 284.763 c h
106.324 360.224 m 260.758 360.224 l 260.758 292.654 l 126.598 292.654 l
 128.758 298.486 129.91 304.716 129.91 311.076 c 129.91 339.861 l 129.91
 349.67 121.93 357.65 112.121 357.65 c 110.094 357.65 108.141 357.306 106.324
 356.681 c h
11.988 310.552 m 11.988 376.447 l 11.988 379.642 14.59 382.244 17.789 382.244
 c 20.984 382.244 23.586 379.642 23.586 376.447 c 23.586 337.627 l 23.586
 334.314 26.27 331.63 29.578 331.63 c 32.891 331.63 35.574 334.314 35.574
 337.627 c 35.574 376.447 l 35.574 379.642 38.176 382.244 41.371 382.244
 c 44.566 382.244 47.168 379.642 47.168 376.447 c 47.168 337.627 l 47.168
 334.314 49.852 331.63 53.164 331.63 c 56.473 331.63 59.156 334.314 59.156
 337.627 c 59.156 376.447 l 59.156 379.642 61.758 382.244 64.957 382.244
 c 68.152 382.244 70.754 379.642 70.754 376.447 c 70.754 337.627 l 70.754
 334.314 73.438 331.63 76.746 331.63 c 80.059 331.63 82.742 334.314 82.742
 337.627 c 82.742 376.447 l 82.742 379.584 85.293 382.185 88.426 382.244
 c 89.914 382.263 91.332 381.681 92.449 380.587 c 93.648 379.408 94.336 
377.787 94.336 376.138 c 94.336 322.853 l 94.336 319.541 97.02 316.857 100.332
 316.857 c 103.641 316.857 106.324 319.541 106.324 322.853 c 106.324 339.861
 l 106.324 343.06 108.926 345.662 112.121 345.662 c 115.32 345.662 117.922
 343.06 117.922 339.861 c 117.922 311.076 l 117.922 298.56 112.156 286.673
 102.363 278.869 c 26.898 278.869 l 17.527 286.634 11.988 298.334 11.988
 310.552 c h
37.812 124.884 m 30.812 124.884 l 30.812 245.646 l 98.387 245.646 l 98.387
 146.298 l 93.574 147.716 88.535 148.47 83.418 148.47 c 54.629 148.47 l 
44.824 148.47 36.844 140.49 36.844 130.681 c 36.844 128.654 37.184 126.701
 37.812 124.884 c h
22.922 257.638 m 21.863 257.638 21.004 258.498 21.004 259.56 c 21.004 264.959
 l 21.004 266.017 21.863 266.88 22.922 266.88 c 106.277 266.88 l 107.336
 266.88 108.195 266.017 108.195 264.959 c 108.195 259.56 l 108.195 258.498
 107.336 257.638 106.277 257.638 c h
115.621 45.455 m 107.859 36.087 96.156 30.548 83.938 30.548 c 18.047 30.548
 l 14.848 30.548 12.246 33.146 12.246 36.345 c 12.246 39.545 14.848 42.142
 18.047 42.142 c 56.867 42.142 l 60.176 42.142 62.859 44.826 62.859 48.138
 c 62.859 51.447 60.176 54.13 56.867 54.13 c 18.047 54.13 l 14.848 54.13
 12.246 56.732 12.246 59.931 c 12.246 63.127 14.848 65.728 18.047 65.728
 c 56.867 65.728 l 60.176 65.728 62.859 68.412 62.859 71.72 c 62.859 75.033
 60.176 77.716 56.867 77.716 c 18.047 77.716 l 14.848 77.716 12.246 80.318
 12.246 83.513 c 12.246 86.712 14.848 89.31 18.047 89.31 c 56.867 89.31 
l 60.176 89.31 62.859 91.994 62.859 95.306 c 62.859 98.615 60.176 101.298
 56.867 101.298 c 18.047 101.298 l 14.906 101.298 12.309 103.849 12.25 106.986
 c 12.223 108.462 12.809 109.892 13.906 111.009 c 15.086 112.209 16.703 
112.896 18.355 112.896 c 71.637 112.896 l 74.949 112.896 77.633 115.58 77.633
 118.888 c 77.633 122.201 74.949 124.884 71.637 124.884 c 54.629 124.884
 l 51.434 124.884 48.832 127.482 48.832 130.681 c 48.832 133.877 51.434 
136.478 54.629 136.478 c 83.414 136.478 l 95.953 136.478 107.859 130.697
 115.621 120.927 c h
136.855 41.482 m 136.855 40.423 135.992 39.56 134.934 39.56 c 129.531 39.56
 l 128.473 39.56 127.613 40.423 127.613 41.482 c 127.613 124.834 l 127.613
 125.892 128.473 126.755 129.531 126.755 c 134.934 126.755 l 135.992 126.755
 136.855 125.892 136.855 124.834 c h
134.934 138.744 m 129.531 138.744 l 125.555 138.744 121.973 137.056 119.434
 134.373 c 116.652 136.935 113.613 139.189 110.375 141.099 c 110.375 246.267
 l 116.051 248.021 120.188 253.314 120.188 259.56 c 120.188 264.959 l 120.188
 268.935 118.5 272.521 115.812 275.056 c 117.445 276.826 118.949 278.701
 120.316 280.666 c 261.375 280.666 l 263.129 274.99 268.422 270.853 274.664
 270.853 c 280.066 270.853 l 284.043 270.853 287.625 272.541 290.164 275.224
 c 292.945 272.662 295.984 270.408 299.223 268.502 c 299.223 225.029 l 299.223
 221.72 301.906 219.037 305.219 219.037 c 308.527 219.037 311.211 221.72
 311.211 225.029 c 311.211 263.298 l 316.027 261.88 321.062 261.13 326.18
 261.13 c 354.531 261.13 l 364.145 261.13 372.355 268.58 372.738 278.189
 c 372.832 280.478 372.488 282.677 371.785 284.712 c 378.785 284.712 l 378.785
 163.947 l 311.215 163.947 l 311.215 186.021 l 311.215 189.334 308.531 192.017
 305.219 192.017 c 301.91 192.017 299.227 189.334 299.227 186.021 c 299.227
 163.33 l 293.547 161.576 289.414 156.283 289.414 150.041 c 289.414 144.638
 l 289.414 140.662 291.102 137.08 293.785 134.541 c 292.156 132.771 290.652
 130.896 289.281 128.931 c 148.227 128.931 l 146.473 134.607 141.176 138.744
 134.934 138.744 c h
303.273 49.373 m 148.844 49.373 l 148.844 116.943 l 283.004 116.943 l 280.844
 111.111 279.691 104.88 279.691 98.521 c 279.691 69.736 l 279.691 59.927
 287.668 51.947 297.477 51.947 c 299.508 51.947 301.457 52.291 303.273 52.92
 c h
397.609 33.154 m 397.609 29.955 395.008 27.353 391.812 27.353 c 388.617
 27.353 386.016 29.955 386.016 33.154 c 386.016 71.974 l 386.016 75.283 
383.332 77.966 380.02 77.966 c 376.711 77.966 374.027 75.283 374.027 71.974
 c 374.027 33.154 l 374.027 29.955 371.426 27.353 368.23 27.353 c 365.031
 27.353 362.43 29.955 362.43 33.154 c 362.43 71.974 l 362.43 75.283 359.746
 77.966 356.438 77.966 c 353.125 77.966 350.441 75.283 350.441 71.974 c 
350.441 33.154 l 350.441 29.955 347.84 27.353 344.645 27.353 c 341.449 27.353
 338.848 29.955 338.848 33.154 c 338.848 71.974 l 338.848 75.283 336.164
 77.966 332.852 77.966 c 329.543 77.966 326.859 75.283 326.859 71.974 c 
326.859 33.154 l 326.859 30.013 324.309 27.416 321.176 27.357 c 319.707 
27.337 318.266 27.916 317.152 29.013 c 315.953 30.189 315.266 31.81 315.266
 33.462 c 315.266 86.744 l 315.266 90.056 312.582 92.74 309.27 92.74 c 305.957
 92.74 303.273 90.056 303.273 86.744 c 303.273 69.736 l 303.273 66.541 300.676
 63.939 297.477 63.939 c 294.281 63.939 291.68 66.537 291.68 69.736 c 291.68
 98.521 l 291.68 111.041 297.441 122.927 307.238 130.728 c 382.703 130.728
 l 392.07 122.966 397.609 111.263 397.609 99.045 c h
397.609 33.154 m f
Q Q
showpage
%%Trailer
end restore
%%EOF
