%!PS-Adobe-3.0 EPSF-3.0
%%Creator: cairo 1.14.2 (http://cairographics.org)
%%CreationDate: Mon Feb 19 09:15:05 2018
%%Pages: 1
%%DocumentData: Clean7Bit
%%LanguageLevel: 2
%%BoundingBox: 60 -1 350 410
%%EndComments
%%BeginProlog
save
50 dict begin
/q { gsave } bind def
/Q { grestore } bind def
/cm { 6 array astore concat } bind def
/w { setlinewidth } bind def
/J { setlinecap } bind def
/j { setlinejoin } bind def
/M { setmiterlimit } bind def
/d { setdash } bind def
/m { moveto } bind def
/l { lineto } bind def
/c { curveto } bind def
/h { closepath } bind def
/re { exch dup neg 3 1 roll 5 3 roll moveto 0 rlineto
      0 exch rlineto 0 rlineto closepath } bind def
/S { stroke } bind def
/f { fill } bind def
/f* { eofill } bind def
/n { newpath } bind def
/W { clip } bind def
/W* { eoclip } bind def
/BT { } bind def
/ET { } bind def
/pdfmark where { pop globaldict /?pdfmark /exec load put }
    { globaldict begin /?pdfmark /pop load def /pdfmark
    /cleartomark load def end } ifelse
/BDC { mark 3 1 roll /BDC pdfmark } bind def
/EMC { mark /EMC pdfmark } bind def
/cairo_store_point { /cairo_point_y exch def /cairo_point_x exch def } def
/Tj { show currentpoint cairo_store_point } bind def
/TJ {
  {
    dup
    type /stringtype eq
    { show } { -0.001 mul 0 cairo_font_matrix dtransform rmoveto } ifelse
  } forall
  currentpoint cairo_store_point
} bind def
/cairo_selectfont { cairo_font_matrix aload pop pop pop 0 0 6 array astore
    cairo_font exch selectfont cairo_point_x cairo_point_y moveto } bind def
/Tf { pop /cairo_font exch def /cairo_font_matrix where
      { pop cairo_selectfont } if } bind def
/Td { matrix translate cairo_font_matrix matrix concatmatrix dup
      /cairo_font_matrix exch def dup 4 get exch 5 get cairo_store_point
      /cairo_font where { pop cairo_selectfont } if } bind def
/Tm { 2 copy 8 2 roll 6 array astore /cairo_font_matrix exch def
      cairo_store_point /cairo_font where { pop cairo_selectfont } if } bind def
/g { setgray } bind def
/rg { setrgbcolor } bind def
/d1 { setcachedevice } bind def
%%EndProlog
%%BeginSetup
%%EndSetup
%%Page: 1 1
%%BeginPageSetup
%%PageBoundingBox: 60 -1 350 410
%%EndPageSetup
q 60 -1 290 411 rectclip q
0.705882 0.792157 0.819608 rg
340.488 362.172 m 302.094 400.566 l 299.883 402.777 296.945 403.996 293.82
 403.996 c 290.695 403.996 287.754 402.777 285.547 400.566 c 218.832 333.852
 l 216.621 331.645 215.406 328.703 215.406 325.578 c 215.406 322.449 216.621
 319.512 218.832 317.305 c 225.918 310.215 l 250.34 286.352 l 250.137 285.996
 l 257.227 278.906 l 259.434 276.699 262.371 275.484 265.5 275.484 c 268.625
 275.484 271.566 276.699 273.773 278.91 c 340.488 345.625 l 342.699 347.836
 343.918 350.773 343.918 353.898 c 343.914 357.023 342.699 359.965 340.488
 362.172 c h
340.488 362.172 m f
0.568627 0.690196 0.717647 rg
340.488 362.172 m 302.094 400.566 l 302.094 400.57 l 318.344 384.316 l 
320.555 382.105 321.773 379.168 321.773 376.043 c 321.773 372.918 320.555
 369.977 318.344 367.77 c 309.629 359.051 l 251.629 301.051 l 249.422 298.844
 246.48 297.629 243.355 297.629 c 240.887 297.629 238.543 298.395 236.574
 299.801 c 250.34 286.352 l 250.137 285.996 l 257.223 278.906 l 259.434 
276.699 262.371 275.484 265.496 275.484 c 268.625 275.484 271.562 276.699
 273.77 278.91 c 306.844 311.984 l 321.574 326.711 l 340.488 345.625 l 342.699
 347.836 343.914 350.773 343.914 353.898 c 343.914 357.023 342.699 359.965
 340.488 362.172 c h
340.488 362.172 m f
0.345098 0.435294 0.458824 rg
295.52 351.633 m 294.008 353.145 293.172 355.156 293.172 357.297 c 293.172
 359.438 294.008 361.449 295.52 362.961 c 297.035 364.473 299.047 365.305
 301.184 365.305 c 303.32 365.305 305.332 364.473 306.844 362.965 c 332.336
 337.473 l 321.008 326.145 l h
295.52 351.633 m f
270.598 326.711 m 269.086 328.223 268.25 330.234 268.25 332.375 c 268.25
 334.516 269.086 336.527 270.598 338.039 c 272.113 339.555 274.121 340.383
 276.262 340.383 c 278.398 340.383 280.41 339.555 281.922 338.043 c 307.414
 312.551 l 296.086 301.223 l h
270.598 326.711 m f
0.705882 0.792157 0.819608 rg
169.422 104.137 m 169.422 241.914 l 169.422 245.234 170.711 248.348 173.051
 250.688 c 225.332 302.965 l 241.91 284.43 l 194.254 236.773 l 194.254 104.137
 l h
169.422 104.137 m f
0.568627 0.690196 0.717647 rg
233.402 293.941 m 186.07 246.609 l 183.73 244.27 182.441 241.156 182.441
 237.84 c 182.441 104.137 l 194.254 104.137 l 194.254 236.773 l 241.91 284.43
 l h
233.402 293.941 m f
0.345098 0.435294 0.458824 rg
238.309 281.168 m 233.711 281.168 229.387 282.957 226.133 286.211 c 222.879
 289.465 221.09 293.789 221.09 298.391 c 221.09 302.988 222.879 307.313 
226.133 310.566 c 229.387 313.82 233.711 315.613 238.309 315.613 c 242.91
 315.613 247.234 313.82 250.488 310.566 c 253.742 307.316 255.531 302.992
 255.531 298.391 c 255.531 293.789 253.742 289.465 250.488 286.211 c 247.234
 282.957 242.91 281.168 238.309 281.168 c h
238.309 281.168 m f
0.705882 0.792157 0.819608 rg
92.922 14.926 m 92.922 88.332 l 92.922 97.504 100.355 104.938 109.527 104.938
 c 253.344 104.938 l 262.516 104.938 269.953 97.504 269.953 88.332 c 269.953
 14.926 l 269.953 9.781 265.781 5.609 260.637 5.609 c 102.238 5.609 l 97.094
 5.609 92.922 9.781 92.922 14.926 c h
92.922 14.926 m f
0.568627 0.690196 0.717647 rg
201.352 28.969 m 178.188 28.969 159.406 47.746 159.406 70.914 c 159.406
 104.938 l 109.527 104.938 l 100.355 104.938 92.922 97.504 92.922 88.332
 c 92.922 14.926 l 92.922 9.777 97.094 5.609 102.238 5.609 c 260.637 5.609
 l 265.781 5.609 269.953 9.777 269.953 14.926 c 269.953 28.969 l h
201.352 28.969 m f
0 g
344.453 366.137 m 306.34 404.254 l 303.27 407.324 299.219 409.313 294.887
 409.57 c 289.867 409.867 285.102 408.051 281.578 404.531 c 214.867 337.816
 l 208.105 331.059 208.105 320.098 214.867 313.34 c 218.488 309.719 l 216.961
 307.059 215.992 304.117 215.637 301.039 c 169.094 254.66 l 165.688 251.254
 163.812 246.73 163.812 241.914 c 163.812 110.543 l 109.527 110.543 l 97.262
 110.543 87.312 100.598 87.312 88.332 c 87.312 12.016 l 66.34 12.016 l 63.047
 12.016 60.18 9.48 60.082 6.195 c 59.98 2.793 62.707 0 66.086 0 c 297.336
 0 l 300.625 0 303.496 2.535 303.594 5.824 c 303.695 9.227 300.969 12.016
 297.586 12.016 c 275.559 12.016 l 275.559 88.328 l 275.559 100.598 265.613
 110.543 253.344 110.543 c 199.859 110.543 l 199.859 149.543 l 199.859 152.863
 197.172 155.551 193.852 155.551 c 190.535 155.551 187.844 152.863 187.844
 149.543 c 187.844 110.543 l 175.828 110.543 l 175.828 241.914 l 175.828
 243.52 176.453 245.027 177.578 246.156 c 218.539 286.965 l 219.527 285.262
 220.738 283.672 222.164 282.242 c 223.621 280.789 225.242 279.559 226.98
 278.563 c 187.844 239.426 l 187.844 188.637 l 187.844 185.32 190.531 182.629
 193.852 182.629 c 197.168 182.629 199.859 185.32 199.859 188.637 c 199.859
 234.449 l 241.148 275.738 l 244.16 276.109 247.035 277.07 249.637 278.563
 c 253.258 274.941 l 256.633 271.57 261.066 269.883 265.496 269.883 c 269.93
 269.883 274.363 271.57 277.738 274.941 c 344.172 341.379 l 347.242 344.449
 349.23 348.496 349.492 352.828 c 349.789 357.848 347.973 362.617 344.453
 366.137 c h
253.344 98.531 m 258.969 98.531 263.543 93.957 263.543 88.332 c 263.543
 12.016 l 99.328 12.016 l 99.328 88.332 l 99.328 93.953 103.902 98.531 109.527
 98.531 c h
245.957 290.742 m 243.914 288.699 241.199 287.574 238.312 287.574 c 235.422
 287.574 232.707 288.699 230.664 290.742 c 228.621 292.785 227.496 295.5
 227.496 298.391 c 227.496 301.277 228.621 303.992 230.664 306.035 c 232.707
 308.078 235.422 309.203 238.312 309.203 c 241.199 309.203 243.914 308.078
 245.957 306.035 c 248 303.992 249.125 301.277 249.125 298.391 c 249.125
 295.5 248 292.785 245.957 290.742 c h
296.086 310.285 m 275.129 331.242 l 274.504 331.867 274.504 332.883 275.129
 333.508 c 275.441 333.82 275.852 333.977 276.262 333.977 c 276.672 333.977
 277.082 333.82 277.395 333.508 c 298.352 312.551 l h
321.008 335.207 m 300.051 356.164 l 299.426 356.789 299.426 357.805 300.051
 358.43 c 300.363 358.742 300.773 358.898 301.184 358.898 c 301.594 358.898
 302.004 358.742 302.316 358.43 c 323.273 337.473 l h
335.957 350.156 m 331.77 345.969 l 310.812 366.926 l 305.504 372.238 296.863
 372.238 291.555 366.926 c 286.246 361.617 286.246 352.977 291.555 347.668
 c 312.512 326.711 l 306.848 321.047 l 285.891 342.004 l 280.582 347.313
 271.941 347.313 266.633 342.004 c 261.324 336.695 261.324 328.055 266.633
 322.746 c 287.59 301.789 l 269.242 283.441 l 267.18 281.375 263.82 281.379
 261.758 283.441 c 258.137 287.063 l 260.094 290.473 261.141 294.352 261.141
 298.391 c 261.141 304.488 258.766 310.223 254.453 314.531 c 250.141 318.844
 244.41 321.219 238.312 321.219 c 234.27 321.219 230.395 320.172 226.984
 318.215 c 223.363 321.836 l 221.297 323.898 221.297 327.258 223.363 329.32
 c 290.078 396.035 l 291.078 397.035 292.406 397.586 293.82 397.586 c 295.234
 397.586 296.562 397.035 297.562 396.035 c 335.957 357.641 l 336.957 356.641
 337.508 355.313 337.508 353.898 c 337.508 352.484 336.957 351.156 335.957
 350.156 c h
335.957 350.156 m f
Q Q
showpage
%%Trailer
end restore
%%EOF
