<?xml version="1.0" encoding="iso-8859-1"?>
<!-- Generator: Adobe Illustrator 19.0.0, SVG Export Plug-In . SVG Version: 6.00 Build 0)  -->
<svg version="1.1" id="Capa_1" xmlns="http://www.w3.org/2000/svg" xmlns:xlink="http://www.w3.org/1999/xlink" x="0px" y="0px"
	 viewBox="0 0 512 512" style="enable-background:new 0 0 512 512;" xml:space="preserve">
<path style="fill:#31D2F7;" d="M364.865,141.213H147.134l-12.699,179.539l1.721,9.02c2.796,14.658,15.612,25.261,30.533,25.261
	h116.479l12.893,25.785c1.623,3.246,6.241,3.285,7.919,0.068l13.489-25.854h27.843c14.921,0,27.739-10.603,30.533-25.261l1.721-9.02
	L364.865,141.213z"/>
<path style="fill:#13ACE8;" d="M369.62,343.308c3.065-3.841,5.254-8.442,6.224-13.531l1.722-9.024l-12.699-179.539h-29.748
	c-14.27,18.006-22.167,40.332-22.167,63.802v9.825l-11.517,15.213c-7.012,9.264-8.423,21.61-3.68,32.22
	c3.113,6.961,8.553,12.448,15.197,15.665v8.223C312.951,317.514,338.328,343.042,369.62,343.308z"/>
<path style="fill:#FAD393;" d="M414.021,382.242h70.981c5.024,0,9.095-4.073,9.095-9.095v-77.232
	c7.137-10.126,10.908-22.028,10.908-34.429v-67.918c0-38.424-31.148-69.571-69.571-69.571h-19.482
	c-17.827,0-34.759,5.712-48.964,16.518l-1.871,1.472c-19.183,15.5-30.185,38.474-30.185,63.03v17.208l-15.972,21.096
	c-2.265,2.992-2.654,6.848-1.014,10.251c1.546,3.209,4.79,5.262,8.34,5.554l8.646,0.711v26.325c0,19.428,15.75,35.177,35.177,35.177
	h34.816v51.807C404.926,378.169,408.998,382.242,414.021,382.242z"/>
<path style="fill:#EDB769;" d="M365.129,302.484v-26.325v-37.614v-17.208c0-24.556,11.002-47.53,30.185-63.03l1.871-1.472
	c14.205-10.806,31.137-16.518,48.964-16.518h19.482c5.841,0,11.511,0.729,16.933,2.085c-12.395-11.423-28.944-18.408-47.129-18.408
	h-19.482c-17.827,0-34.759,5.712-48.964,16.518l-1.871,1.472c-19.183,15.5-30.185,38.474-30.185,63.03v17.208l-15.972,21.096
	c-2.265,2.993-2.654,6.848-1.014,10.251c1.546,3.209,4.79,5.263,8.34,5.554l8.646,0.711v26.325c0,19.428,15.75,35.177,35.177,35.177
	h0.506C367.147,315.888,365.129,309.423,365.129,302.484z"/>
<path style="fill:#13ACE8;" d="M134.435,320.752l1.722,9.024c0.97,5.089,3.158,9.69,6.224,13.531
	c31.292-0.266,56.668-25.793,56.668-57.147v-8.223c6.645-3.218,12.084-8.704,15.198-15.669c4.742-10.606,3.331-22.952-3.683-32.218
	l-11.515-15.211v-9.825c0-24.076-8.305-46.246-22.198-63.802h-29.716L134.435,320.752z"/>
<path style="fill:#FAD393;" d="M26.997,382.242h70.981c5.024,0,9.095-4.073,9.095-9.095v-51.807h34.815
	c19.429,0,35.178-15.75,35.178-35.178v-26.324l8.645-0.711c3.55-0.292,6.793-2.343,8.34-5.551c1.642-3.404,1.254-7.261-1.012-10.254
	l-15.972-21.096v-17.208c0-44.746-36.273-81.02-81.02-81.02H76.566c-38.424,0-69.571,31.148-69.571,69.57v67.918
	c0,12.401,3.77,24.301,10.908,34.429v77.232C17.902,378.169,21.975,382.242,26.997,382.242z"/>
<path style="fill:#EDB769;" d="M51.311,312.236c-7.138-10.128-10.908-22.028-10.908-34.429v-67.918
	c0-38.423,31.148-69.571,69.571-69.571h19.483c6.16,0,12.15,0.71,17.915,2.012c-13.974-11.455-31.845-18.335-51.325-18.335H76.566
	c-38.424,0.001-69.571,31.149-69.571,69.571v67.918c0,12.401,3.77,24.301,10.908,34.429v77.232c0,5.024,4.073,9.095,9.095,9.095
	h24.314V312.236z"/>
<path d="M435.434,117.002h-19.482c-19.54,0-37.608,6.404-52.228,17.216h-215.45c-14.62-10.814-32.689-17.216-52.228-17.216H76.566
	C34.279,117.002,0,151.281,0,193.567v67.918c0,13.093,3.764,25.686,10.908,36.579v83.678c0,4.138,3.355,7.494,7.494,7.494h88.173
	c4.139,0,7.494-3.355,7.494-7.494v-53.409h14.8c2.184,18.939,18.308,33.695,37.821,33.695h28.18c4.139,0,7.494-3.355,7.494-7.494
	l0,0c0-4.139-3.355-7.494-7.494-7.494H166.69c-11.253,0-20.647-8.091-22.681-18.76c22.273-1.108,40.053-19.575,40.053-42.118
	v-19.882l2.109-0.173c5.085-0.418,9.851-2.93,12.779-7.107c4.296-6.129,4.028-14.139-0.335-19.901l-14.554-19.223v-14.859
	c0-21.166-7.512-40.611-20.008-55.809h183.892c-12.496,15.199-20.008,34.643-20.008,55.809v14.859l-14.316,18.909
	c-3.078,4.067-4.388,9.291-3.232,14.258c1.697,7.294,7.848,12.441,15.053,13.032l2.495,0.205v19.882
	c0,22.543,17.78,41.009,40.053,42.118c-2.035,10.669-11.428,18.76-22.681,18.76h-28.145c-2.792,0-5.352,1.552-6.642,4.027
	l-10.417,19.966l-9.926-19.851c-1.269-2.539-3.864-4.143-6.702-4.143h-39.846c-4.139,0-7.494,3.355-7.494,7.494l0,0
	c0,4.139,3.355,7.494,7.494,7.494h35.215l14.415,28.83c1.269,2.539,3.864,4.143,6.702,4.143h0.001c2.79,0,5.352-1.551,6.643-4.028
	l15.101-28.945h23.602c19.514,0,35.638-14.756,37.821-33.695h14.8v53.409c0,4.139,3.355,7.494,7.494,7.494h88.173
	c4.139,0,7.494-3.355,7.494-7.494v-83.678C508.236,287.17,512,274.575,512,261.483v-67.918
	C512,151.281,477.72,117.002,435.434,117.002z M169.074,205.016v17.375c0,1.634,0.534,3.221,1.52,4.523l16.072,21.23
	c0.552,0.728,0.422,1.432,0.216,1.892c-0.206,0.461-0.642,1.025-1.555,1.101l-9.374,0.77c-3.888,0.319-6.879,3.567-6.879,7.469
	v26.785c0,14.989-12.196,27.184-27.185,27.184h-27.821v-6.141c0-4.14-3.355-7.494-7.494-7.494c-4.139,0-7.494,3.354-7.494,7.494
	v67.045H25.895v-78.494c0-1.553-0.482-3.066-1.38-4.332c-6.234-8.799-9.528-19.151-9.528-29.94v-67.918
	c0-33.953,27.624-61.578,61.578-61.578h19.482C136.314,131.989,169.074,164.749,169.074,205.016z M497.013,261.484
	c0,10.789-3.294,21.141-9.528,29.938c-0.897,1.266-1.38,2.78-1.38,4.332v78.494h-73.185v-67.045c0-4.14-3.355-7.494-7.494-7.494
	s-7.494,3.354-7.494,7.494v6.141h-27.821c-14.989,0-27.185-12.195-27.185-27.184v-26.785c0-3.901-2.992-7.149-6.879-7.469
	l-9.375-0.77c-0.911-0.075-1.348-0.64-1.554-1.101c-0.206-0.461-0.336-1.163,0.216-1.892l16.072-21.23
	c0.986-1.303,1.52-2.891,1.52-4.523v-17.375c0-22.93,10.632-43.414,27.215-56.812c0.625-0.361,1.193-0.808,1.688-1.327
	c12.267-9.332,27.557-14.887,44.124-14.887h19.482c33.954,0,61.578,27.624,61.578,61.578L497.013,261.484L497.013,261.484z"/>
<path d="M251.004,191.171c4.139,0,7.494-3.354,7.494-7.494c0-4.14-3.355-7.494-7.494-7.494h-45.961
	c-4.139,0-7.494,3.354-7.494,7.494c0,4.14,3.355,7.494,7.494,7.494H251.004z"/>
<path d="M278.98,231.137h-45.961c-4.139,0-7.494,3.354-7.494,7.494s3.355,7.494,7.494,7.494h45.961c4.139,0,7.494-3.354,7.494-7.494
	S283.119,231.137,278.98,231.137z"/>
<path d="M263.493,286.091h-65.445c-4.139,0-7.494,3.354-7.494,7.494c0,4.139,3.355,7.494,7.494,7.494h65.445
	c4.139,0,7.494-3.354,7.494-7.494C270.987,289.445,267.632,286.091,263.493,286.091z"/>
<path d="M305.458,286.091h-13.489c-4.139,0-7.494,3.354-7.494,7.494c0,4.139,3.355,7.494,7.494,7.494h13.489
	c4.139,0,7.494-3.354,7.494-7.494C312.952,289.445,309.596,286.091,305.458,286.091z"/>
<path d="M280.479,191.171h22.481c4.138,0,7.494-3.354,7.494-7.494c0-4.14-3.355-7.494-7.494-7.494h-22.481
	c-4.139,0-7.494,3.354-7.494,7.494C272.985,187.816,276.34,191.171,280.479,191.171z"/>
<g>
</g>
<g>
</g>
<g>
</g>
<g>
</g>
<g>
</g>
<g>
</g>
<g>
</g>
<g>
</g>
<g>
</g>
<g>
</g>
<g>
</g>
<g>
</g>
<g>
</g>
<g>
</g>
<g>
</g>
</svg>
