%!PS-Adobe-3.0 EPSF-3.0
%%Creator: cairo 1.14.2 (http://cairographics.org)
%%CreationDate: Mon Feb 19 09:15:05 2018
%%Pages: 1
%%DocumentData: Clean7Bit
%%LanguageLevel: 2
%%BoundingBox: 0 23 410 386
%%EndComments
%%BeginProlog
save
50 dict begin
/q { gsave } bind def
/Q { grestore } bind def
/cm { 6 array astore concat } bind def
/w { setlinewidth } bind def
/J { setlinecap } bind def
/j { setlinejoin } bind def
/M { setmiterlimit } bind def
/d { setdash } bind def
/m { moveto } bind def
/l { lineto } bind def
/c { curveto } bind def
/h { closepath } bind def
/re { exch dup neg 3 1 roll 5 3 roll moveto 0 rlineto
      0 exch rlineto 0 rlineto closepath } bind def
/S { stroke } bind def
/f { fill } bind def
/f* { eofill } bind def
/n { newpath } bind def
/W { clip } bind def
/W* { eoclip } bind def
/BT { } bind def
/ET { } bind def
/pdfmark where { pop globaldict /?pdfmark /exec load put }
    { globaldict begin /?pdfmark /pop load def /pdfmark
    /cleartomark load def end } ifelse
/BDC { mark 3 1 roll /BDC pdfmark } bind def
/EMC { mark /EMC pdfmark } bind def
/cairo_store_point { /cairo_point_y exch def /cairo_point_x exch def } def
/Tj { show currentpoint cairo_store_point } bind def
/TJ {
  {
    dup
    type /stringtype eq
    { show } { -0.001 mul 0 cairo_font_matrix dtransform rmoveto } ifelse
  } forall
  currentpoint cairo_store_point
} bind def
/cairo_selectfont { cairo_font_matrix aload pop pop pop 0 0 6 array astore
    cairo_font exch selectfont cairo_point_x cairo_point_y moveto } bind def
/Tf { pop /cairo_font exch def /cairo_font_matrix where
      { pop cairo_selectfont } if } bind def
/Td { matrix translate cairo_font_matrix matrix concatmatrix dup
      /cairo_font_matrix exch def dup 4 get exch 5 get cairo_store_point
      /cairo_font where { pop cairo_selectfont } if } bind def
/Tm { 2 copy 8 2 roll 6 array astore /cairo_font_matrix exch def
      cairo_store_point /cairo_font where { pop cairo_selectfont } if } bind def
/g { setgray } bind def
/rg { setrgbcolor } bind def
/d1 { setcachedevice } bind def
%%EndProlog
%%BeginSetup
%%EndSetup
%%Page: 1 1
%%BeginPageSetup
%%PageBoundingBox: 0 23 410 386
%%EndPageSetup
q 0 23 410 363 rectclip q
1 0.811765 0.34902 rg
223.703 321.995 m 186.191 322.612 l 171.367 291.6 l 238.234 291.6 l h
223.703 321.995 m f
1 0.709804 0.360784 rg
186.191 322.612 m 171.367 291.6 l 193.766 291.6 l 208.418 322.245 l h
186.191 322.612 m f
0.917647 0.231373 0.219608 rg
205.199 312.799 m 193.07 312.799 183.199 322.67 183.199 334.799 c 183.199
 346.932 193.07 356.799 205.199 356.799 c 217.332 356.799 227.199 346.932
 227.199 334.799 c 227.199 322.67 217.332 312.799 205.199 312.799 c h
205.199 312.799 m f
0.894118 0.00392157 0.211765 rg
204.801 332.639 m 204.801 341.604 210.191 349.327 217.895 352.752 c 214.305
 355.295 209.926 356.799 205.199 356.799 c 193.07 356.799 183.199 346.932
 183.199 334.799 c 183.199 322.67 193.07 312.799 205.199 312.799 c 208.367
 312.799 211.379 313.479 214.105 314.69 c 208.48 318.678 204.801 325.237
 204.801 332.639 c h
204.801 332.639 m f
0.407843 g
342.457 291.998 m 67.941 291.998 l 61.359 291.998 56 286.643 56 280.057
 c 56 134.401 l 354.398 134.401 l 354.398 280.057 l 354.398 286.643 349.043
 291.998 342.457 291.998 c h
342.457 291.998 m f
0.356863 0.341176 0.321569 rg
133.543 291.998 m 67.941 291.998 l 61.359 291.998 56 286.643 56 280.057
 c 56 134.401 l 121.602 134.401 l 121.602 280.057 l 121.602 286.643 126.957
 291.998 133.543 291.998 c h
133.543 291.998 m f
0.764706 0.854902 0.25098 rg
74.398 267.502 m 74.398 157.295 l 74.398 153.928 77.129 151.202 80.496 
151.202 c 329.102 151.202 l 332.469 151.202 335.199 153.928 335.199 157.295
 c 335.199 267.502 l 335.199 270.87 332.469 273.6 329.102 273.6 c 80.496
 273.6 l 77.129 273.6 74.398 270.87 74.398 267.502 c h
74.398 267.502 m f
0.980392 0.827451 0.576471 rg
128 222.401 18.398 -40.801 re f
0.929412 0.717647 0.411765 rg
128 222.401 9.199 -40.801 re f
0.192157 0.823529 0.968627 rg
112 151.202 m 112 174.455 l 112 185.452 120.949 194.401 131.945 194.401
 c 142.453 194.401 l 153.453 194.401 162.398 185.452 162.398 174.455 c 162.398
 151.202 l h
112 151.202 m f
0.0745098 0.67451 0.909804 rg
146.531 193.979 m 145.215 194.252 143.852 194.401 142.453 194.401 c 131.945
 194.401 l 120.949 194.401 112 185.452 112 174.455 c 112 151.202 l 130.664
 151.202 l 130.664 174.455 l 130.664 184.053 137.48 192.092 146.531 193.979
 c h
146.531 193.979 m f
0.980392 0.827451 0.576471 rg
132.133 209.6 m 122.797 209.6 115.199 217.198 115.199 226.534 c 115.199
 239.069 l 115.199 248.405 122.797 255.998 132.133 255.998 c 142.27 255.998
 l 151.605 255.998 159.199 248.405 159.199 239.069 c 159.199 226.534 l 159.199
 217.198 151.605 209.6 142.27 209.6 c h
132.133 209.6 m f
0.929412 0.717647 0.411765 rg
133.051 226.534 m 133.051 239.069 l 133.051 247.077 138.645 253.788 146.125
 255.538 c 144.883 255.83 143.598 255.998 142.27 255.998 c 132.133 255.998
 l 122.797 255.998 115.199 248.405 115.199 239.069 c 115.199 226.534 l 115.199
 217.198 122.797 209.6 132.133 209.6 c 142.27 209.6 l 143.598 209.6 144.883
 209.768 146.125 210.061 c 138.645 211.811 133.051 218.526 133.051 226.534
 c h
133.051 226.534 m f
1 0.384314 0.654902 rg
204.801 151.202 m 329.102 151.202 l 332.469 151.202 335.199 153.928 335.199
 157.295 c 335.199 212.799 l 204.801 212.799 l h
204.801 151.202 m f
0.192157 0.823529 0.968627 rg
329.102 273.6 m 204.801 273.6 l 204.801 211.998 l 335.199 211.998 l 335.199
 267.502 l 335.199 270.87 332.469 273.6 329.102 273.6 c h
329.102 273.6 m f
0.764706 0.854902 0.25098 rg
288.395 236.842 m 284.09 241.034 l 257.508 241.034 l 253.207 236.838 l 
248.371 232.123 245.602 225.549 245.602 218.799 c 245.602 211.998 l 296 
211.998 l 296 218.799 l 296 225.659 293.297 232.065 288.395 236.842 c h
288.395 236.842 m f
0.678431 0.737255 0.0823529 rg
271.73 236.838 m 276.031 241.034 l 257.508 241.034 l 253.207 236.838 l 
248.371 232.123 245.602 225.549 245.602 218.799 c 245.602 211.998 l 264.125
 211.998 l 264.125 218.799 l 264.125 225.549 266.895 232.123 271.73 236.838
 c h
271.73 236.838 m f
0.980392 0.827451 0.576471 rg
270.801 232.799 m 263.082 232.799 256.801 239.08 256.801 246.799 c 256.801
 254.518 263.082 260.799 270.801 260.799 c 278.52 260.799 284.801 254.518
 284.801 246.799 c 284.801 239.08 278.52 232.799 270.801 232.799 c h
270.801 232.799 m f
0.929412 0.717647 0.411765 rg
268 246.799 m 268 252.53 271.461 257.459 276.398 259.623 c 274.684 260.377
 272.793 260.799 270.801 260.799 c 263.082 260.799 256.801 254.518 256.801
 246.799 c 256.801 239.08 263.082 232.799 270.801 232.799 c 272.793 232.799
 274.684 233.225 276.398 233.975 c 271.461 236.143 268 241.073 268 246.799
 c h
268 246.799 m f
0.192157 0.823529 0.968627 rg
288.395 176.041 m 284.09 180.233 l 257.508 180.233 l 253.207 176.038 l 
248.371 171.323 245.602 164.748 245.602 157.998 c 245.602 151.202 l 296 
151.202 l 296 157.998 l 296 164.858 293.297 171.264 288.395 176.041 c h
288.395 176.041 m f
0.0745098 0.67451 0.909804 rg
276.34 176.038 m 280.641 180.233 l 257.508 180.233 l 253.207 176.038 l 
248.371 171.323 245.602 164.748 245.602 157.998 c 245.602 151.202 l 268.734
 151.202 l 268.734 157.998 l 268.734 164.748 271.508 171.323 276.34 176.038
 c h
276.34 176.038 m f
0.980392 0.827451 0.576471 rg
270.801 171.998 m 263.082 171.998 256.801 178.28 256.801 185.998 c 256.801
 193.721 263.082 199.998 270.801 199.998 c 278.52 199.998 284.801 193.721
 284.801 185.998 c 284.801 178.28 278.52 171.998 270.801 171.998 c h
270.801 171.998 m f
1 0.811765 0.34902 rg
339.602 231.202 m 333.203 231.202 328 236.405 328 242.799 c 328 243.717
 l 318.738 254.401 l 392.398 254.401 l 398.797 254.401 404 249.198 404 242.799
 c 404 236.405 398.797 231.202 392.398 231.202 c h
339.602 231.202 m f
1 0.709804 0.360784 rg
351.234 241.998 m 344.84 241.998 339.637 247.205 339.637 253.6 c 339.637
 254.401 l 318.738 254.401 l 328 243.717 l 328 242.799 l 328 236.405 333.203
 231.202 339.602 231.202 c 392.398 231.202 l 398.527 231.202 403.547 235.979
 403.961 241.998 c h
351.234 241.998 m f
1 0.811765 0.34902 rg
339.602 168.635 m 333.203 168.635 328 173.838 328 180.233 c 328 181.151
 l 318.738 191.834 l 392.398 191.834 l 398.797 191.834 404 186.631 404 180.233
 c 404 173.838 398.797 168.635 392.398 168.635 c h
339.602 168.635 m f
1 0.709804 0.360784 rg
351.234 179.432 m 344.84 179.432 339.637 184.639 339.637 191.034 c 339.637
 191.834 l 318.738 191.834 l 328 181.151 l 328 180.233 l 328 173.838 333.203
 168.635 339.602 168.635 c 392.398 168.635 l 398.527 168.635 403.547 173.413
 403.961 179.432 c h
351.234 179.432 m f
0.309804 0.294118 0.294118 rg
159.164 37.889 m 168 55.694 l 168 88.799 l 242.398 88.799 l 242.398 55.694
 l 251.234 37.889 l 253.129 34.073 250.355 29.6 246.098 29.6 c 164.305 29.6
 l 160.047 29.6 157.273 34.073 159.164 37.889 c h
159.164 37.889 m f
0.266667 0.231373 0.231373 rg
242.398 88.799 m 168 88.799 l 168 55.694 l 159.164 37.889 l 157.27 34.073
 160.047 29.6 164.305 29.6 c 194.062 29.6 l 189.805 29.6 187.031 34.073 
188.922 37.889 c 197.758 55.694 l 197.758 60.534 l 197.758 65.729 201.973
 69.944 207.168 69.944 c 242.398 69.944 l h
242.398 88.799 m f
0.317647 0.309804 0.309804 rg
67.941 87.998 m 61.359 87.998 56 93.358 56 99.944 c 56 135.202 l 354.398
 135.202 l 354.398 99.944 l 354.398 93.358 349.043 87.998 342.457 87.998
 c h
67.941 87.998 m f
0.309804 0.294118 0.294118 rg
121.602 99.944 m 121.602 135.202 l 56 135.202 l 56 99.944 l 56 93.358 61.359
 87.998 67.941 87.998 c 133.543 87.998 l 126.957 87.998 121.602 93.358 121.602
 99.944 c h
121.602 99.944 m f
1 0.811765 0.34902 rg
135.883 379.998 m 31.602 379.998 l 17.414 379.998 5.844 368.58 5.605 354.448
 c 5.355 339.905 17.57 327.998 32.117 327.998 c 104.621 327.998 l 110.688
 311.827 l 111.281 310.245 113.52 310.245 114.113 311.827 c 120.176 327.998
 l 136.398 327.998 l 150.586 327.998 162.156 339.42 162.395 353.553 c 162.645
 368.096 150.43 379.998 135.883 379.998 c h
135.883 379.998 m f
1 0.709804 0.360784 rg
28.266 333.928 m 28.508 348.057 40.074 359.479 54.262 359.479 c 158.543
 359.479 l 159.656 359.479 160.754 359.401 161.836 359.268 c 159.301 371.088
 148.469 379.998 135.883 379.998 c 31.602 379.998 l 17.414 379.998 5.844
 368.58 5.605 354.448 c 5.375 341.018 15.777 329.846 28.828 328.213 c 28.434
 330.057 28.23 331.967 28.266 333.928 c h
28.266 333.928 m f
0 g
216.801 113.202 m 216.801 106.795 211.605 101.6 205.199 101.6 c 198.793
 101.6 193.602 106.795 193.602 113.202 c 193.602 119.608 198.793 124.799
 205.199 124.799 c 211.605 124.799 216.801 119.608 216.801 113.202 c h
216.801 113.202 m f
106.781 306.295 m 107.66 303.952 109.898 302.401 112.398 302.401 c 114.902
 302.401 117.141 303.952 118.02 306.295 c 124.059 322.401 l 136.398 322.401
 l 153.824 322.401 168 336.577 168 353.998 c 168 371.424 153.824 385.6 136.398
 385.6 c 31.602 385.6 l 14.176 385.6 0 371.424 0 353.998 c 0 336.577 14.176
 322.401 31.602 322.401 c 100.742 322.401 l h
12 353.998 m 12 364.807 20.793 373.6 31.602 373.6 c 136.398 373.6 l 147.207
 373.6 156 364.807 156 353.998 c 156 343.194 147.207 334.401 136.398 334.401
 c 119.898 334.401 l 117.398 334.401 115.16 332.85 114.281 330.506 c 112.398
 325.487 l 110.52 330.506 l 109.641 332.85 107.402 334.401 104.898 334.401
 c 31.602 334.401 l 20.793 334.401 12 343.194 12 353.998 c h
12 353.998 m f
392.398 198.401 m 360 198.401 l 360 225.6 l 392.398 225.6 l 401.883 225.6
 409.602 233.315 409.602 242.799 c 409.602 252.284 401.883 259.998 392.398
 259.998 c 360 259.998 l 360 280.057 l 360 289.729 352.129 297.6 342.457
 297.6 c 241.574 297.6 l 229.777 322.268 l 231.707 326.034 232.801 330.291
 232.801 334.799 c 232.801 350.018 220.418 362.401 205.199 362.401 c 189.98
 362.401 177.602 350.018 177.602 334.799 c 177.602 330.616 178.539 326.647
 180.215 323.092 c 168.027 297.6 l 67.941 297.6 l 58.27 297.6 50.398 289.729
 50.398 280.057 c 50.398 99.944 l 50.398 90.268 58.27 82.401 67.941 82.401
 c 162.398 82.401 l 162.398 57.006 l 150.32 32.666 l 149.398 30.807 149.504
 28.604 150.598 26.838 c 151.691 25.073 153.621 23.998 155.695 23.998 c 
254.703 23.998 l 256.777 23.998 258.707 25.073 259.801 26.838 c 260.898 
28.6 261 30.807 260.078 32.666 c 248 57.006 l 248 82.401 l 342.457 82.401
 l 352.129 82.401 360 90.268 360 99.944 c 360 163.998 l 392.398 163.998 
l 401.883 163.998 409.602 171.717 409.602 181.202 c 409.602 190.686 401.883
 198.401 392.398 198.401 c h
392.398 247.998 m 395.266 247.998 397.602 245.666 397.602 242.799 c 397.602
 239.932 395.266 237.6 392.398 237.6 c 339.602 237.6 l 336.734 237.6 334.398
 239.932 334.398 242.799 c 334.398 243.866 l 334.398 245.311 333.879 246.709
 332.93 247.799 c 332.758 247.998 l h
348 225.6 m 348 198.401 l 340.801 198.401 l 340.801 225.6 l h
205.199 350.401 m 213.801 350.401 220.801 343.401 220.801 334.799 c 220.801
 326.198 213.801 319.202 205.199 319.202 c 196.598 319.202 189.602 326.198
 189.602 334.799 c 189.602 343.401 196.598 350.401 205.199 350.401 c h
188.586 312.78 m 193.211 309.28 198.965 307.202 205.199 307.202 c 211.172
 307.202 216.699 309.112 221.223 312.346 c 228.082 297.998 l 181.52 297.998
 l h
165.371 35.998 m 172.121 49.6 l 207.602 49.6 l 210.914 49.6 213.602 52.288
 213.602 55.6 c 213.602 58.913 210.914 61.6 207.602 61.6 c 174.398 61.6 
l 174.398 82.401 l 236 82.401 l 236 55.6 l 236 54.674 236.215 53.76 236.625
 52.932 c 245.027 35.998 l h
348 140.799 m 287.781 140.799 l 283.73 140.799 280.883 136.827 282.168 
132.987 c 282.219 132.838 l 283.016 130.42 285.289 128.799 287.832 128.799
 c 348 128.799 l 348 99.944 l 348 96.881 345.52 94.401 342.457 94.401 c 
67.941 94.401 l 64.883 94.401 62.398 96.881 62.398 99.944 c 62.398 128.799
 l 251.777 128.799 l 254.355 128.799 256.641 130.459 257.418 132.913 c 257.434
 132.963 257.449 133.014 257.469 133.065 c 258.695 136.889 255.844 140.799
 251.828 140.799 c 62.398 140.799 l 62.398 280.057 l 62.398 283.12 64.883
 285.6 67.941 285.6 c 342.457 285.6 l 345.52 285.6 348 283.12 348 280.057
 c 348 259.998 l 340.801 259.998 l 340.801 273.202 l 340.801 276.514 338.113
 279.202 334.801 279.202 c 74.801 279.202 l 71.488 279.202 68.801 276.514
 68.801 273.202 c 68.801 151.6 l 68.801 148.288 71.488 145.6 74.801 145.6
 c 334.801 145.6 l 338.113 145.6 340.801 148.288 340.801 151.6 c 340.801
 163.998 l 348 163.998 l h
315.07 250.065 m 322.441 241.577 l 322.789 236.678 325.199 232.354 328.801
 229.44 c 328.801 218.401 l 301.598 218.401 l 301.598 218.799 l 301.598 
228.245 297.305 237.041 290.004 242.866 c 290.262 244.135 290.398 245.452
 290.398 246.799 c 290.398 257.608 281.605 266.401 270.801 266.401 c 259.992
 266.401 251.199 257.608 251.199 246.799 c 251.199 245.455 251.336 244.139
 251.598 242.866 c 244.297 237.041 240 228.221 240 218.799 c 240 218.401
 l 211.199 218.401 l 211.199 267.202 l 328.801 267.202 l 328.801 259.998
 l 319.602 259.998 l 317.25 259.998 315.117 258.627 314.141 256.491 c 313.164
 254.35 313.527 251.838 315.07 250.065 c h
315.07 188.467 m 322.441 179.975 l 322.789 175.08 325.199 170.752 328.801
 167.838 c 328.801 157.6 l 301.598 157.6 l 301.598 157.998 l 301.598 167.448
 297.305 176.241 290.004 182.065 c 290.262 183.334 290.398 184.651 290.398
 185.998 c 290.398 196.807 281.605 205.6 270.801 205.6 c 259.992 205.6 251.199
 196.807 251.199 185.998 c 251.199 184.655 251.336 183.338 251.598 182.069
 c 244.297 176.241 240 167.42 240 157.998 c 240 157.6 l 211.199 157.6 l 
211.199 206.401 l 328.801 206.401 l 328.801 198.401 l 319.602 198.401 l 
317.25 198.401 315.117 197.03 314.141 194.889 c 313.164 192.752 313.527 
190.241 315.07 188.467 c h
270.801 166.401 m 275.844 166.401 280.449 168.319 283.926 171.459 c 287.527
 167.952 289.602 163.131 289.602 157.998 c 289.602 157.6 l 252 157.6 l 252
 157.998 l 252 163.12 254.078 167.948 257.676 171.459 c 261.152 168.315 
265.758 166.401 270.801 166.401 c h
263.199 185.998 m 263.199 190.19 266.609 193.6 270.801 193.6 c 274.992 
193.6 278.398 190.19 278.398 185.998 c 278.398 181.811 274.992 178.401 270.801
 178.401 c 266.609 178.401 263.199 181.811 263.199 185.998 c h
270.801 227.202 m 275.844 227.202 280.449 229.116 283.926 232.26 c 287.527
 228.752 289.602 223.932 289.602 218.799 c 289.602 218.401 l 252 218.401
 l 252 218.799 l 252 223.916 254.078 228.748 257.676 232.256 c 261.152 229.116
 265.758 227.202 270.801 227.202 c h
263.199 246.799 m 263.199 250.991 266.609 254.401 270.801 254.401 c 274.992
 254.401 278.398 250.991 278.398 246.799 c 278.398 242.608 274.992 239.202
 270.801 239.202 c 266.609 239.202 263.199 242.608 263.199 246.799 c h
152 198.143 m 152 206.213 l 159.566 209.85 164.801 217.592 164.801 226.534
 c 164.801 239.069 l 164.801 251.491 154.691 261.6 142.27 261.6 c 132.133
 261.6 l 119.707 261.6 109.602 251.491 109.602 239.069 c 109.602 226.534
 l 109.602 217.592 114.836 209.85 122.398 206.213 c 122.398 198.143 l 113.031
 194.354 106.398 185.166 106.398 174.455 c 106.398 157.6 l 80.801 157.6 
l 80.801 267.202 l 199.199 267.202 l 199.199 157.6 l 168 157.6 l 168 174.455
 l 168 185.166 161.371 194.354 152 198.143 c h
132.133 215.998 m 126.324 215.998 121.602 220.725 121.602 226.534 c 121.602
 239.069 l 121.602 244.873 126.324 249.6 132.133 249.6 c 142.27 249.6 l 
148.074 249.6 152.801 244.873 152.801 239.069 c 152.801 226.534 l 152.801
 220.725 148.074 215.998 142.27 215.998 c h
140 203.998 m 140 199.998 l 134.398 199.998 l 134.398 203.998 l h
131.945 187.998 m 142.453 187.998 l 149.922 187.998 156 181.924 156 174.455
 c 156 157.6 l 118.398 157.6 l 118.398 174.455 l 118.398 181.924 124.477
 187.998 131.945 187.998 c h
392.398 175.998 m 339.602 175.998 l 336.734 175.998 334.398 178.334 334.398
 181.202 c 334.398 182.268 l 334.398 183.713 333.879 185.108 332.93 186.202
 c 332.758 186.401 l 392.398 186.401 l 395.266 186.401 397.602 184.069 397.602
 181.202 c 397.602 178.334 395.266 175.998 392.398 175.998 c h
392.398 175.998 m f
212.398 334.799 m 212.398 330.823 209.176 327.6 205.199 327.6 c 201.223
 327.6 198 330.823 198 334.799 c 198 338.776 201.223 341.998 205.199 341.998
 c 209.176 341.998 212.398 338.776 212.398 334.799 c h
212.398 334.799 m f
Q Q
showpage
%%Trailer
end restore
%%EOF
