%!PS-Adobe-3.0 EPSF-3.0
%%Creator: cairo 1.14.2 (http://cairographics.org)
%%CreationDate: Mon Feb 19 09:15:05 2018
%%Pages: 1
%%DocumentData: Clean7Bit
%%LanguageLevel: 2
%%BoundingBox: 0 17 410 392
%%EndComments
%%BeginProlog
save
50 dict begin
/q { gsave } bind def
/Q { grestore } bind def
/cm { 6 array astore concat } bind def
/w { setlinewidth } bind def
/J { setlinecap } bind def
/j { setlinejoin } bind def
/M { setmiterlimit } bind def
/d { setdash } bind def
/m { moveto } bind def
/l { lineto } bind def
/c { curveto } bind def
/h { closepath } bind def
/re { exch dup neg 3 1 roll 5 3 roll moveto 0 rlineto
      0 exch rlineto 0 rlineto closepath } bind def
/S { stroke } bind def
/f { fill } bind def
/f* { eofill } bind def
/n { newpath } bind def
/W { clip } bind def
/W* { eoclip } bind def
/BT { } bind def
/ET { } bind def
/pdfmark where { pop globaldict /?pdfmark /exec load put }
    { globaldict begin /?pdfmark /pop load def /pdfmark
    /cleartomark load def end } ifelse
/BDC { mark 3 1 roll /BDC pdfmark } bind def
/EMC { mark /EMC pdfmark } bind def
/cairo_store_point { /cairo_point_y exch def /cairo_point_x exch def } def
/Tj { show currentpoint cairo_store_point } bind def
/TJ {
  {
    dup
    type /stringtype eq
    { show } { -0.001 mul 0 cairo_font_matrix dtransform rmoveto } ifelse
  } forall
  currentpoint cairo_store_point
} bind def
/cairo_selectfont { cairo_font_matrix aload pop pop pop 0 0 6 array astore
    cairo_font exch selectfont cairo_point_x cairo_point_y moveto } bind def
/Tf { pop /cairo_font exch def /cairo_font_matrix where
      { pop cairo_selectfont } if } bind def
/Td { matrix translate cairo_font_matrix matrix concatmatrix dup
      /cairo_font_matrix exch def dup 4 get exch 5 get cairo_store_point
      /cairo_font where { pop cairo_selectfont } if } bind def
/Tm { 2 copy 8 2 roll 6 array astore /cairo_font_matrix exch def
      cairo_store_point /cairo_font where { pop cairo_selectfont } if } bind def
/g { setgray } bind def
/rg { setrgbcolor } bind def
/d1 { setcachedevice } bind def
%%EndProlog
%%BeginSetup
%%EndSetup
%%Page: 1 1
%%BeginPageSetup
%%PageBoundingBox: 0 17 410 392
%%EndPageSetup
q 0 17 410 375 rectclip q
0.917647 0.231373 0.219608 rg
197.301 385.553 m 24.73 385.553 l 14.188 385.553 5.609 376.975 5.609 366.432
 c 5.609 43.166 l 5.609 32.623 14.188 24.045 24.73 24.045 c 197.301 24.045
 l 207.844 24.045 216.422 32.623 216.422 43.166 c 216.422 366.432 l 216.422
 376.975 207.844 385.553 197.301 385.553 c h
197.301 385.553 m f
0.894118 0.00392157 0.211765 rg
56.91 43.166 m 56.91 366.432 l 56.91 376.975 65.488 385.553 76.031 385.553
 c 24.73 385.553 l 14.188 385.553 5.609 376.975 5.609 366.432 c 5.609 43.17
 l 5.609 32.623 14.188 24.045 24.73 24.045 c 76.031 24.045 l 65.488 24.045
 56.91 32.623 56.91 43.166 c h
56.91 43.166 m f
0.909804 0.882353 0.839216 rg
67.258 76.147 m 35.129 76.147 l 29.895 76.147 25.652 80.393 25.652 85.627
 c 25.652 290.166 l 403.988 290.166 l 403.988 85.627 l 403.988 80.393 399.746
 76.147 394.512 76.147 c 99.219 76.147 l 89.934 60.67 l 87.414 56.475 81.414
 56.241 78.578 60.229 c h
67.258 76.147 m f
0.886275 0.8 0.686275 rg
77.719 85.627 m 77.719 290.166 l 25.652 290.166 l 25.652 85.627 l 25.652
 80.393 29.895 76.147 35.129 76.147 c 67.258 76.147 l 78.578 60.229 l 81.414
 56.241 87.414 56.471 89.934 60.67 c 99.223 76.147 l 87.195 76.147 l 81.961
 76.147 77.719 80.393 77.719 85.627 c h
77.719 85.627 m f
0.972549 0.807843 0.160784 rg
329.625 235.659 m 325.988 235.659 323.031 238.62 323.031 242.256 c 323.031
 258.725 l 323.031 262.362 325.988 265.319 329.625 265.319 c 371.746 265.319
 l 375.383 265.319 378.34 262.362 378.34 258.725 c 378.34 242.256 l 378.34
 238.62 375.383 235.659 371.746 235.659 c h
329.625 235.659 m f
301.789 103.401 m 293.613 103.401 286.961 110.053 286.961 118.229 c 286.961
 126.409 293.613 133.061 301.789 133.061 c 309.965 133.061 316.617 126.409
 316.617 118.229 c 316.617 110.053 309.965 103.401 301.789 103.401 c h
301.789 103.401 m f
56.289 141.077 m 52.656 141.077 49.695 144.034 49.695 147.67 c 49.695 164.139
 l 49.695 167.776 52.656 170.733 56.289 170.733 c 98.41 170.733 l 102.047
 170.733 105.004 167.776 105.004 164.139 c 105.004 147.67 l 105.004 144.034
 102.047 141.077 98.41 141.077 c h
56.289 141.077 m f
0.878431 0.67451 0.027451 rg
77.719 170.733 m 56.289 170.733 l 52.656 170.733 49.695 167.776 49.695 
164.139 c 49.695 147.67 l 49.695 144.034 52.656 141.077 56.289 141.077 c
 77.719 141.077 l h
77.719 170.733 m f
0.764706 0.854902 0.25098 rg
215.219 125.846 m 178.312 125.846 148.289 155.87 148.289 192.776 c 148.289
 229.682 178.312 259.705 215.219 259.705 c 252.125 259.705 282.152 229.682
 282.152 192.776 c 282.152 155.87 252.125 125.846 215.219 125.846 c h
215.219 125.846 m f
0.192157 0.823529 0.968627 rg
168.625 240.76 m 156.098 228.588 148.289 211.58 148.289 192.776 c 148.289
 173.971 156.098 156.967 168.625 144.795 c 216.609 192.776 l h
168.625 240.76 m f
1 0.313726 0.490196 rg
167.238 146.178 m 179.41 133.651 196.414 125.846 215.219 125.846 c 252.125
 125.846 282.152 155.87 282.152 192.776 c 282.152 193.123 282.129 193.463
 282.125 193.807 c 215.578 193.807 l h
167.238 146.178 m f
1 0.811765 0.34902 rg
25.652 289.366 m 25.652 323.975 l 25.652 329.202 29.902 333.452 35.129 
333.452 c 394.512 333.452 l 399.738 333.452 403.988 329.202 403.988 323.975
 c 403.988 289.366 l h
25.652 289.366 m f
1 0.709804 0.360784 rg
87.195 333.452 m 35.129 333.452 l 29.902 333.452 25.652 329.202 25.652 
323.975 c 25.652 289.366 l 77.719 289.366 l 77.719 323.975 l 77.719 329.202
 81.969 333.452 87.195 333.452 c h
87.195 333.452 m f
0.894118 0.00392157 0.211765 rg
68.535 354.291 m 122.238 354.291 l 125.559 354.291 128.25 356.983 128.25
 360.303 c 128.25 363.623 125.559 366.315 122.238 366.315 c 68.535 366.315
 l 65.215 366.315 62.523 363.623 62.523 360.303 c 62.523 356.983 65.215 
354.291 68.535 354.291 c h
68.535 354.291 m f
143.879 354.291 m 161.113 354.291 l 164.434 354.291 167.125 356.983 167.125
 360.303 c 167.125 363.623 164.434 366.315 161.113 366.315 c 143.879 366.315
 l 140.562 366.315 137.867 363.623 137.867 360.303 c 137.867 356.983 140.562
 354.291 143.879 354.291 c h
143.879 354.291 m f
0 g
394.512 339.061 m 222.035 339.061 l 222.035 366.432 l 222.035 380.069 210.938
 391.163 197.301 391.163 c 24.73 391.163 l 11.094 391.163 0 380.069 0 366.432
 c 0 43.17 l 0 29.53 11.094 18.436 24.73 18.436 c 197.301 18.436 l 210.938
 18.436 222.031 29.53 222.031 43.166 c 222.031 70.538 l 394.512 70.538 l
 402.832 70.538 409.602 77.307 409.602 85.627 c 409.602 323.975 l 409.602
 332.295 402.832 339.061 394.512 339.061 c h
210.012 43.166 m 210.012 36.159 204.309 30.459 197.301 30.459 c 24.73 30.459
 l 17.723 30.459 12.023 36.159 12.023 43.166 c 12.023 366.432 l 12.023 373.44
 17.723 379.139 24.73 379.139 c 197.301 379.139 l 204.309 379.139 210.008
 373.44 210.008 366.432 c 210.008 339.061 l 35.129 339.061 l 26.809 339.061
 20.039 332.295 20.039 323.975 c 20.039 85.627 l 20.039 77.307 26.809 70.538
 35.129 70.538 c 64.363 70.538 l 79.664 49.018 l 80.797 47.428 82.625 46.491
 84.562 46.491 c 84.641 46.491 84.719 46.491 84.797 46.495 c 86.824 46.573
 88.676 47.67 89.719 49.409 c 102.398 70.538 l 210.012 70.538 l h
397.578 295.776 m 111.391 295.776 l 108.07 295.776 105.379 293.084 105.379
 289.764 c 105.379 286.444 108.07 283.752 111.391 283.752 c 397.578 283.752
 l 397.578 85.623 l 397.578 83.932 396.203 82.561 394.512 82.561 c 98.996
 82.561 l 96.883 82.561 94.926 81.452 93.84 79.643 c 84.137 63.475 l 72.363
 80.034 l 71.234 81.62 69.41 82.561 67.465 82.561 c 35.129 82.561 l 33.434
 82.561 32.062 83.932 32.062 85.623 c 32.062 283.756 l 72.273 283.756 l 
75.594 283.756 78.285 286.448 78.285 289.768 c 78.285 293.088 75.594 295.78
 72.273 295.78 c 32.062 295.78 l 32.062 323.975 l 32.062 325.666 33.434 
327.038 35.125 327.038 c 394.512 327.038 l 396.203 327.038 397.574 325.666
 397.574 323.975 c 397.574 295.776 l h
397.578 295.776 m f
371.746 270.928 m 329.625 270.928 l 322.895 270.928 317.422 265.455 317.422
 258.725 c 317.422 256.752 l 291.922 256.752 l 290.324 256.752 288.797 256.12
 287.668 254.991 c 271.352 238.674 l 258.039 254.928 237.82 265.319 215.223
 265.319 c 195.453 265.319 177.508 257.366 164.41 244.498 c 164.246 244.362
 164.086 244.221 163.93 244.065 c 163.777 243.913 163.633 243.752 163.5 
243.584 c 150.633 230.487 142.68 212.545 142.68 192.776 c 142.68 188.815
 143.004 184.932 143.617 181.143 c 124.074 161.6 l 110.617 161.6 l 110.617
 164.139 l 110.617 170.87 105.141 176.342 98.41 176.342 c 56.289 176.342
 l 49.562 176.342 44.086 170.87 44.086 164.139 c 44.086 147.67 l 44.086 
140.94 49.562 135.463 56.289 135.463 c 98.41 135.463 l 105.141 135.463 110.617
 140.94 110.617 147.67 c 110.617 149.577 l 126.562 149.577 l 128.16 149.577
 129.688 150.209 130.812 151.334 c 147.156 167.678 l 157.391 140.01 184.039
 120.233 215.219 120.233 c 226.898 120.233 237.938 123.014 247.723 127.936
 c 261.574 114.084 l 262.699 112.959 264.23 112.327 265.824 112.327 c 282.223
 112.327 l 284.762 103.924 292.57 97.791 301.789 97.791 c 313.059 97.791
 322.23 106.959 322.23 118.233 c 322.23 129.502 313.059 138.67 301.789 138.67
 c 292.648 138.67 284.891 132.639 282.285 124.35 c 268.312 124.35 l 258.25
 134.413 l 276.137 147.639 287.762 168.873 287.762 192.776 c 287.762 205.799
 284.309 218.026 278.277 228.6 c 294.406 244.729 l 317.418 244.729 l 317.418
 242.256 l 317.418 235.526 322.895 230.049 329.625 230.049 c 371.742 230.049
 l 378.473 230.049 383.949 235.526 383.949 242.256 c 383.949 258.725 l 383.949
 265.455 378.473 270.928 371.746 270.928 c h
98.594 147.67 m 98.594 147.569 98.512 147.491 98.41 147.491 c 56.289 147.491
 l 56.191 147.491 56.109 147.569 56.109 147.67 c 56.109 164.139 l 56.109
 164.241 56.191 164.323 56.289 164.323 c 98.41 164.323 l 98.512 164.323 
98.594 164.241 98.594 164.139 c h
301.789 126.647 m 306.43 126.647 310.207 122.873 310.207 118.229 c 310.207
 113.588 306.43 109.815 301.789 109.815 c 297.148 109.815 293.371 113.588
 293.371 118.229 c 293.371 122.873 297.148 126.647 301.789 126.647 c h
275.438 198.788 m 217.711 198.788 l 176.91 239.588 l 187.352 248.147 200.695
 253.295 215.219 253.295 c 246.562 253.295 272.41 229.346 275.438 198.788
 c h
168.41 231.084 m 206.719 192.776 l 168.41 154.467 l 159.848 164.909 154.703
 178.252 154.703 192.776 c 154.703 207.299 159.848 220.643 168.41 231.084
 c h
215.219 132.26 m 200.695 132.26 187.352 137.405 176.91 145.967 c 217.711
 186.764 l 275.438 186.764 l 272.41 156.205 246.562 132.26 215.219 132.26
 c h
371.926 242.256 m 371.926 242.155 371.844 242.073 371.746 242.073 c 329.625
 242.073 l 329.523 242.073 329.445 242.155 329.445 242.256 c 329.445 258.725
 l 329.445 258.823 329.527 258.905 329.625 258.905 c 371.746 258.905 l 371.844
 258.905 371.926 258.823 371.926 258.725 c h
371.926 242.256 m f
63.324 312.612 m 63.324 309.069 60.453 306.198 56.91 306.198 c 53.371 306.198
 50.5 309.069 50.5 312.612 c 50.5 316.151 53.371 319.022 56.91 319.022 c
 60.453 319.022 63.324 316.151 63.324 312.612 c h
63.324 312.612 m f
95.387 312.612 m 95.387 309.069 92.516 306.198 88.973 306.198 c 85.434 
306.198 82.562 309.069 82.562 312.612 c 82.562 316.151 85.434 319.022 88.973
 319.022 c 92.516 319.022 95.387 316.151 95.387 312.612 c h
95.387 312.612 m f
127.449 312.612 m 127.449 309.069 124.578 306.198 121.035 306.198 c 117.496
 306.198 114.625 309.069 114.625 312.612 c 114.625 316.151 117.496 319.022
 121.035 319.022 c 124.578 319.022 127.449 316.151 127.449 312.612 c h
127.449 312.612 m f
168.328 306.6 m 361.508 306.6 l 364.828 306.6 367.52 309.291 367.52 312.612
 c 367.52 315.932 364.828 318.623 361.508 318.623 c 168.328 318.623 l 165.008
 318.623 162.316 315.932 162.316 312.612 c 162.316 309.291 165.008 306.6
 168.328 306.6 c h
168.328 306.6 m f
68.535 354.291 m 122.238 354.291 l 125.559 354.291 128.25 356.983 128.25
 360.303 c 128.25 363.623 125.559 366.315 122.238 366.315 c 68.535 366.315
 l 65.215 366.315 62.523 363.623 62.523 360.303 c 62.523 356.983 65.215 
354.291 68.535 354.291 c h
68.535 354.291 m f
143.879 354.291 m 161.113 354.291 l 164.434 354.291 167.125 356.983 167.125
 360.303 c 167.125 363.623 164.434 366.315 161.113 366.315 c 143.879 366.315
 l 140.562 366.315 137.867 363.623 137.867 360.303 c 137.867 356.983 140.562
 354.291 143.879 354.291 c h
143.879 354.291 m f
Q Q
showpage
%%Trailer
end restore
%%EOF
