%!PS-Adobe-3.0 EPSF-3.0
%%Creator: cairo 1.14.2 (http://cairographics.org)
%%CreationDate: Mon Feb 19 09:15:05 2018
%%Pages: 1
%%DocumentData: Clean7Bit
%%LanguageLevel: 2
%%BoundingBox: 0 67 410 343
%%EndComments
%%BeginProlog
save
50 dict begin
/q { gsave } bind def
/Q { grestore } bind def
/cm { 6 array astore concat } bind def
/w { setlinewidth } bind def
/J { setlinecap } bind def
/j { setlinejoin } bind def
/M { setmiterlimit } bind def
/d { setdash } bind def
/m { moveto } bind def
/l { lineto } bind def
/c { curveto } bind def
/h { closepath } bind def
/re { exch dup neg 3 1 roll 5 3 roll moveto 0 rlineto
      0 exch rlineto 0 rlineto closepath } bind def
/S { stroke } bind def
/f { fill } bind def
/f* { eofill } bind def
/n { newpath } bind def
/W { clip } bind def
/W* { eoclip } bind def
/BT { } bind def
/ET { } bind def
/pdfmark where { pop globaldict /?pdfmark /exec load put }
    { globaldict begin /?pdfmark /pop load def /pdfmark
    /cleartomark load def end } ifelse
/BDC { mark 3 1 roll /BDC pdfmark } bind def
/EMC { mark /EMC pdfmark } bind def
/cairo_store_point { /cairo_point_y exch def /cairo_point_x exch def } def
/Tj { show currentpoint cairo_store_point } bind def
/TJ {
  {
    dup
    type /stringtype eq
    { show } { -0.001 mul 0 cairo_font_matrix dtransform rmoveto } ifelse
  } forall
  currentpoint cairo_store_point
} bind def
/cairo_selectfont { cairo_font_matrix aload pop pop pop 0 0 6 array astore
    cairo_font exch selectfont cairo_point_x cairo_point_y moveto } bind def
/Tf { pop /cairo_font exch def /cairo_font_matrix where
      { pop cairo_selectfont } if } bind def
/Td { matrix translate cairo_font_matrix matrix concatmatrix dup
      /cairo_font_matrix exch def dup 4 get exch 5 get cairo_store_point
      /cairo_font where { pop cairo_selectfont } if } bind def
/Tm { 2 copy 8 2 roll 6 array astore /cairo_font_matrix exch def
      cairo_store_point /cairo_font where { pop cairo_selectfont } if } bind def
/g { setgray } bind def
/rg { setrgbcolor } bind def
/d1 { setcachedevice } bind def
%%EndProlog
%%BeginSetup
%%EndSetup
%%Page: 1 1
%%BeginPageSetup
%%PageBoundingBox: 0 67 410 343
%%EndPageSetup
q 0 67 410 276 rectclip q
0.627451 0.458824 0.188235 rg
393.289 242.061 m 388.746 242.061 385.047 238.362 385.047 233.819 c 385.047
 219.045 l 385.047 217.944 384.148 217.045 383.047 217.045 c 381.941 217.045
 381.047 217.94 381.047 219.045 c 381.047 265.327 l 381.047 267.612 380.098
 269.854 378.445 271.479 c 376.895 272.998 374.887 273.834 372.793 273.834
 c 372.645 273.834 l 368.188 273.752 364.562 270.053 364.562 265.596 c 364.562
 231.877 l 364.562 230.772 363.664 229.873 362.562 229.873 c 361.457 229.873
 360.559 230.772 360.559 231.877 c 360.559 265.592 l 360.559 270.139 356.863
 273.834 352.32 273.834 c 347.773 273.834 344.078 270.139 344.078 265.592
 c 344.078 231.873 l 344.078 230.772 343.18 229.873 342.074 229.873 c 340.973
 229.873 340.074 230.772 340.074 231.873 c 340.074 265.592 l 340.074 270.139
 336.379 273.834 331.832 273.834 c 327.289 273.834 323.594 270.139 323.594
 265.592 c 323.594 231.873 l 323.594 230.772 322.695 229.873 321.59 229.873
 c 320.488 229.873 319.59 230.772 319.59 231.873 c 319.59 265.592 l 319.59
 270.139 315.895 273.834 311.348 273.834 c 306.805 273.834 303.109 270.139
 303.109 265.592 c 303.109 208.362 l 303.109 196.858 308.16 186.002 316.973
 178.577 c 318.09 177.635 l 318.09 169.213 l 385.945 169.213 l 385.945 177.635
 l 387.047 178.53 l 396.25 185.975 401.527 197.014 401.527 208.815 c 401.527
 233.819 l 401.531 238.362 397.832 242.061 393.289 242.061 c h
393.289 242.061 m f
0.509804 0.321569 0.0666667 rg
304.348 231.991 m 308.121 231.991 311.18 235.049 311.18 238.827 c 311.18
 265.592 l 311.18 268.67 312.879 271.358 315.387 272.772 c 313.875 273.623
 312.074 274.022 310.164 273.748 c 306.066 273.166 303.113 269.495 303.113
 265.354 c 303.113 231.991 l h
304.348 231.991 m f
334.695 273.311 m 333.266 273.842 331.664 274.01 329.977 273.62 c 326.188
 272.733 323.594 269.209 323.594 265.319 c 323.594 231.991 l 324.051 231.991
 l 327.824 231.991 330.887 235.053 330.887 238.827 c 330.887 266.393 l 330.883
 269.303 332.41 271.846 334.695 273.311 c h
334.695 273.311 m f
354.887 273.42 m 353.656 273.827 352.301 273.959 350.887 273.709 c 346.895
 273.002 344.078 269.366 344.078 265.311 c 344.078 231.991 l 347.852 231.991
 350.914 235.053 350.914 238.827 c 350.914 266.393 l 350.914 269.373 352.512
 271.971 354.887 273.42 c h
354.887 273.42 m f
364.562 265.663 m 364.562 231.991 l 365.043 231.991 l 368.82 231.991 371.879
 235.053 371.879 238.827 c 371.879 266.393 l 371.879 269.288 373.391 271.819
 375.652 273.288 c 374.742 273.643 373.777 273.834 372.793 273.834 c 372.645
 273.834 l 368.199 273.788 364.562 270.108 364.562 265.663 c h
364.562 265.663 m f
386.039 218.889 m 389.816 218.889 392.875 221.948 392.875 225.721 c 392.875
 234.143 l 392.875 237.147 394.5 239.772 396.91 241.209 c 395.43 241.94 
393.707 242.252 391.887 241.94 c 387.883 241.256 385.047 237.631 385.047
 233.569 c 385.047 219.045 l 385.047 218.991 385.035 218.94 385.031 218.889
 c h
386.039 218.889 m f
0.980392 0.827451 0.576471 rg
98.18 242.061 m 93.637 242.061 89.938 238.362 89.938 233.819 c 89.938 219.045
 l 89.938 217.944 89.039 217.045 87.938 217.045 c 86.836 217.045 85.938 
217.94 85.938 219.045 c 85.938 265.327 l 85.938 267.612 84.988 269.854 83.336
 271.475 c 81.789 272.998 79.77 273.834 77.648 273.834 c 77.535 273.834 
l 73.078 273.752 69.453 270.053 69.453 265.596 c 69.453 231.877 l 69.453
 230.772 68.555 229.873 67.453 229.873 c 66.348 229.873 65.449 230.772 65.449
 231.877 c 65.449 265.592 l 65.449 270.139 61.754 273.834 57.207 273.834
 c 52.664 273.834 48.969 270.139 48.969 265.592 c 48.969 231.873 l 48.969
 230.772 48.07 229.873 46.965 229.873 c 45.863 229.873 44.965 230.772 44.965
 231.873 c 44.965 265.592 l 44.965 270.139 41.27 273.834 36.727 273.834 
c 32.18 273.834 28.484 270.139 28.484 265.592 c 28.484 231.873 l 28.484 
230.772 27.586 229.873 26.48 229.873 c 25.379 229.873 24.48 230.772 24.48
 231.873 c 24.48 265.592 l 24.48 270.139 20.785 273.834 16.238 273.834 c
 11.695 273.834 8 270.139 8 265.592 c 8 208.362 l 8 196.858 13.055 186.002
 21.863 178.577 c 22.98 177.635 l 22.98 167.936 l 90.625 167.936 l 90.84
 177.635 l 91.938 178.53 l 101.141 185.975 106.418 197.014 106.418 208.815
 c 106.418 233.819 l 106.422 238.362 102.723 242.061 98.18 242.061 c h
98.18 242.061 m f
0.929412 0.717647 0.411765 rg
9.734 232.084 m 14.59 232.084 18.52 236.018 18.52 240.87 c 18.52 265.592
 l 18.52 268.139 19.684 270.416 21.504 271.932 c 19.977 273.202 17.988 273.932
 15.828 273.823 c 11.398 273.604 8 269.768 8 265.334 c 8 232.084 l h
9.734 232.084 m f
39.941 273.182 m 38.84 273.651 37.617 273.885 36.336 273.827 c 31.891 273.62
 28.488 269.756 28.488 265.307 c 28.488 232.084 l 28.555 232.084 l 33.406
 232.084 37.336 236.018 37.336 240.87 c 37.336 267.194 l 37.336 269.553 
38.344 271.678 39.941 273.182 c h
39.941 273.182 m f
60.379 273.202 m 59.098 273.737 57.652 273.959 56.137 273.764 c 51.988 
273.233 48.969 269.53 48.969 265.346 c 48.969 232.084 l 53.82 232.084 57.754
 236.018 57.754 240.87 c 57.754 267.194 l 57.754 269.565 58.77 271.694 60.379
 273.202 c h
60.379 273.202 m f
69.453 265.694 m 69.453 232.084 l 69.867 232.084 l 74.723 232.084 78.652
 236.018 78.652 240.87 c 78.652 267.194 l 78.652 269.479 79.594 271.541 
81.102 273.038 c 80.027 273.553 78.855 273.834 77.648 273.834 c 77.535 273.834
 l 73.09 273.803 69.453 270.139 69.453 265.694 c h
69.453 265.694 m f
90.922 218.776 m 95.773 218.776 99.707 222.709 99.707 227.561 c 99.707 
234.565 l 99.707 237.049 100.816 239.272 102.562 240.784 c 101.051 241.737
 99.215 242.225 97.254 242.006 c 93.035 241.538 89.938 237.788 89.938 233.541
 c 89.938 219.041 l 89.938 218.952 89.922 218.866 89.91 218.776 c h
90.922 218.776 m f
0.980392 0.827451 0.576471 rg
258.605 292.62 m 252.387 292.62 247.324 287.557 247.324 281.334 c 247.324
 262.174 l 247.324 261.073 246.426 260.174 245.324 260.174 c 244.223 260.174
 243.324 261.073 243.324 262.174 c 243.324 322.198 l 243.324 325.323 242.031
 328.385 239.773 330.6 c 237.652 332.682 234.895 333.827 232.004 333.827
 c 231.824 333.827 l 225.723 333.709 220.758 328.651 220.758 322.545 c 220.758
 278.815 l 220.758 277.713 219.859 276.815 218.758 276.815 c 217.656 276.815
 216.758 277.713 216.758 278.815 c 216.758 322.545 l 216.758 328.768 211.695
 333.827 205.473 333.827 c 199.254 333.827 194.191 328.768 194.191 322.545
 c 194.191 278.815 l 194.191 277.713 193.293 276.815 192.191 276.815 c 191.09
 276.815 190.191 277.713 190.191 278.815 c 190.191 322.545 l 190.191 328.768
 185.129 333.827 178.906 333.827 c 172.688 333.827 167.625 328.768 167.625
 322.545 c 167.625 278.815 l 167.625 277.713 166.727 276.815 165.625 276.815
 c 164.523 276.815 163.625 277.713 163.625 278.815 c 163.625 322.545 l 163.625
 328.768 158.562 333.827 152.34 333.827 c 146.121 333.827 141.059 328.768
 141.059 322.545 c 141.059 248.323 l 141.059 233.174 148.066 218.393 159.797
 208.784 c 160.902 207.877 l 160.902 198.448 l 249.176 198.448 l 249.262
 207.877 l 250.352 208.737 l 262.586 218.366 269.891 233.385 269.891 248.909
 c 269.891 281.334 l 269.891 287.557 264.828 292.62 258.605 292.62 c h
258.605 292.62 m f
258.605 292.62 m 252.387 292.62 247.324 287.557 247.324 281.334 c 247.324
 262.174 l 247.324 261.073 246.426 260.174 245.324 260.174 c 244.223 260.174
 243.324 261.073 243.324 262.174 c 243.324 322.198 l 243.324 325.323 242.031
 328.385 239.773 330.6 c 237.652 332.682 234.895 333.827 232.004 333.827
 c 231.824 333.827 l 225.723 333.709 220.758 328.651 220.758 322.545 c 220.758
 278.815 l 220.758 277.713 219.859 276.815 218.758 276.815 c 217.656 276.815
 216.758 277.713 216.758 278.815 c 216.758 322.545 l 216.758 328.768 211.695
 333.827 205.473 333.827 c 199.254 333.827 194.191 328.768 194.191 322.545
 c 194.191 278.815 l 194.191 277.713 193.293 276.815 192.191 276.815 c 191.09
 276.815 190.191 277.713 190.191 278.815 c 190.191 322.545 l 190.191 328.768
 185.129 333.827 178.906 333.827 c 172.688 333.827 167.625 328.768 167.625
 322.545 c 167.625 278.815 l 167.625 277.713 166.727 276.815 165.625 276.815
 c 164.523 276.815 163.625 277.713 163.625 278.815 c 163.625 322.545 l 163.625
 328.768 158.562 333.827 152.34 333.827 c 146.121 333.827 141.059 328.768
 141.059 322.545 c 141.059 248.323 l 141.059 233.174 148.066 218.393 159.797
 208.784 c 160.902 207.877 l 160.902 198.448 l 249.176 198.448 l 249.262
 207.877 l 250.352 208.737 l 262.586 218.366 269.891 233.385 269.891 248.909
 c 269.891 281.334 l 269.891 287.557 264.828 292.62 258.605 292.62 c h
258.605 292.62 m f
0.929412 0.717647 0.411765 rg
141.91 280.272 m 147.613 280.272 152.234 284.893 152.234 290.596 c 152.234
 322.545 l 152.234 326.733 154.535 330.389 157.934 332.334 c 156.023 333.428
 153.777 333.991 151.379 333.788 c 145.484 333.288 141.062 328.143 141.062
 322.225 c 141.062 280.272 l h
141.91 280.272 m f
183.406 332.885 m 181.605 333.674 179.559 334.01 177.414 333.729 c 171.746
 332.983 167.625 327.936 167.625 322.221 c 167.625 280.272 l 167.789 280.272
 l 173.492 280.272 178.113 284.893 178.113 290.596 c 178.113 323.346 l 178.113
 327.366 180.234 330.889 183.406 332.885 c h
183.406 332.885 m f
209.883 332.932 m 208.301 333.604 206.535 333.928 204.684 333.799 c 198.711
 333.389 194.191 328.19 194.191 322.205 c 194.191 280.272 l 199.895 280.272
 204.516 284.893 204.516 290.596 c 204.516 323.346 l 204.52 327.393 206.668
 330.94 209.883 332.932 c h
209.883 332.932 m f
220.758 322.545 m 220.758 280.272 l 220.871 280.272 l 226.574 280.272 231.195
 284.893 231.195 290.596 c 231.195 323.346 l 231.195 327.346 233.301 330.862
 236.453 332.862 c 235.059 333.487 233.551 333.827 232.004 333.827 c 231.824
 333.827 l 225.723 333.709 220.758 328.651 220.758 322.545 c h
220.758 322.545 m f
247.555 262.069 m 253.254 262.069 257.879 266.69 257.879 272.393 c 257.879
 281.69 l 257.879 285.87 260.168 289.514 263.551 291.463 c 261.668 292.385
 259.508 292.819 257.215 292.534 c 251.504 291.827 247.324 286.772 247.324
 281.022 c 247.324 262.178 l 247.324 262.139 247.316 262.104 247.312 262.069
 c h
247.555 262.069 m f
1 0.384314 0.654902 rg
159.867 192.143 90.422 -118.777 re f
0.988235 0.329412 0.47451 rg
250.285 192.143 m 159.863 192.143 l 159.863 73.37 l 199.27 73.37 l 199.27
 133.413 l 199.27 146.327 209.738 156.791 222.652 156.791 c 250.285 156.791
 l h
250.285 192.143 m f
0.917647 0.121569 0.34902 rg
161.172 181.565 m 154.359 181.565 148.812 187.108 148.812 193.92 c 148.812
 200.733 154.359 206.28 161.172 206.28 c 248.977 206.28 l 255.793 206.28
 261.336 200.733 261.336 193.92 c 261.336 187.108 255.793 181.565 248.977
 181.565 c h
161.172 181.565 m f
0.8 0.0352941 0.329412 rg
196.016 193.92 m 196.016 200.737 201.559 206.28 208.375 206.28 c 161.172
 206.28 l 154.359 206.28 148.812 200.737 148.812 193.92 c 148.812 187.108
 154.359 181.565 161.172 181.565 c 208.375 181.565 l 201.559 181.565 196.016
 187.108 196.016 193.92 c h
196.016 193.92 m f
0.192157 0.823529 0.968627 rg
21.953 166.409 69.902 -93.043 re f
0.0745098 0.67451 0.909804 rg
90.754 164.436 m 57.211 164.436 l 57.211 166.416 l 21.953 166.416 l 21.953
 73.37 l 57.211 73.37 l 57.211 127.991 l 57.211 137.491 64.914 145.194 74.414
 145.194 c 90.754 145.194 l 91.129 145.194 91.492 145.221 91.855 145.264
 c 91.855 164.37 l 91.492 164.409 91.129 164.436 90.754 164.436 c h
90.754 164.436 m f
0 0.443137 0.717647 rg
23.051 156.795 m 17.746 156.795 13.43 161.112 13.43 166.416 c 13.43 171.721
 17.746 176.038 23.051 176.038 c 90.758 176.038 l 96.062 176.038 100.375
 171.721 100.375 166.416 c 100.375 161.112 96.062 156.795 90.758 156.795
 c h
23.051 156.795 m f
0.0156863 0.352941 0.517647 rg
48.379 166.413 m 48.379 171.717 52.695 176.034 58 176.034 c 23.051 176.034
 l 17.746 176.034 13.43 171.721 13.43 166.413 c 13.43 161.112 17.746 156.795
 23.051 156.795 c 58 156.795 l 52.695 156.795 48.379 161.112 48.379 166.413
 c h
48.379 166.413 m f
0.764706 0.854902 0.25098 rg
317.062 166.409 69.902 -93.043 re f
0.678431 0.737255 0.0823529 rg
386.965 166.413 m 317.059 166.413 l 317.059 73.37 l 352.32 73.37 l 352.32
 117.334 l 352.32 128.28 361.195 137.155 372.141 137.155 c 386.965 137.155
 l h
386.965 166.413 m f
0.54902 0.607843 0 rg
318.16 156.795 m 312.855 156.795 308.539 161.112 308.539 166.416 c 308.539
 171.721 312.855 176.038 318.16 176.038 c 385.863 176.038 l 391.168 176.038
 395.484 171.721 395.484 166.416 c 395.484 161.112 391.168 156.795 385.863
 156.795 c h
318.16 156.795 m f
0.443137 0.466667 0 rg
346.207 166.413 m 346.207 171.717 350.523 176.034 355.828 176.034 c 318.16
 176.034 l 312.855 176.034 308.539 171.721 308.539 166.413 c 308.539 161.112
 312.855 156.795 318.16 156.795 c 355.828 156.795 l 350.523 156.795 346.207
 161.112 346.207 166.413 c h
346.207 166.413 m f
0.705882 0.792157 0.819608 rg
403.598 67.768 m 6.141 67.768 l 2.824 67.768 0.137 70.455 0.137 73.772 
c 0.137 77.084 2.824 79.772 6.141 79.772 c 403.598 79.772 l 406.914 79.772
 409.602 77.084 409.602 73.772 c 409.602 70.455 406.914 67.768 403.598 67.768
 c h
403.598 67.768 m f
0 g
403.348 79.772 m 392.562 79.772 l 392.562 152.768 l 397.602 155.252 401.086
 160.428 401.086 166.416 c 401.086 170.452 399.496 174.116 396.922 176.842
 c 404.926 185.448 409.531 196.873 409.531 208.815 c 409.531 233.448 l 409.531
 242.237 402.699 249.717 393.914 250.053 c 392.227 250.116 390.59 249.92
 389.047 249.502 c 389.047 265.327 l 389.047 269.748 387.227 274.073 384.051
 277.19 c 380.914 280.264 376.809 281.924 372.496 281.834 c 368.75 281.764
 365.305 280.401 362.578 278.178 c 359.781 280.463 356.207 281.838 352.32
 281.838 c 348.441 281.838 344.875 280.471 342.078 278.194 c 339.281 280.471
 335.715 281.838 331.836 281.838 c 327.957 281.838 324.391 280.471 321.594
 278.194 c 318.719 280.534 315.031 281.913 311.027 281.834 c 302.117 281.659
 295.109 274.112 295.109 265.198 c 295.109 208.362 l 295.109 196.721 299.527
 185.502 307.203 176.955 c 304.566 174.217 302.938 170.506 302.938 166.413
 c 302.938 160.428 306.422 155.252 311.457 152.768 c 311.457 79.772 l 255.887
 79.772 l 255.887 177.346 l 262.371 180.057 266.938 186.463 266.938 193.92
 c 266.938 199.284 264.57 204.104 260.832 207.397 c 271.641 218.362 277.891
 233.291 277.891 248.909 c 277.891 280.916 l 277.891 291.346 269.785 300.205
 259.367 300.604 c 256.516 300.713 253.793 300.202 251.324 299.194 c 251.324
 322.198 l 251.324 327.455 249.16 332.6 245.379 336.311 c 241.656 339.963
 236.805 341.94 231.676 341.827 c 226.695 341.733 222.16 339.713 218.777
 336.495 c 215.312 339.799 210.629 341.83 205.473 341.83 c 200.332 341.83
 195.652 339.807 192.191 336.514 c 188.73 339.807 184.051 341.83 178.906
 341.83 c 173.766 341.83 169.086 339.807 165.625 336.514 c 162.016 339.948
 157.078 342.002 151.676 341.819 c 141.219 341.463 133.059 332.58 133.059
 322.12 c 133.059 248.323 l 133.059 233.084 139.059 218.413 149.445 207.506
 c 145.629 204.213 143.211 199.346 143.211 193.92 c 143.211 186.467 147.777
 180.057 154.262 177.346 c 154.262 139.557 l 154.262 136.245 156.949 133.557
 160.262 133.557 c 163.578 133.557 166.266 136.245 166.266 139.557 c 166.266
 175.963 l 243.883 175.963 l 243.883 79.772 l 166.266 79.772 l 166.266 100.51
 l 166.266 103.823 163.578 106.51 160.262 106.51 c 156.949 106.51 154.262
 103.823 154.262 100.51 c 154.262 79.772 l 97.453 79.772 l 97.453 152.768
 l 102.492 155.252 105.973 160.428 105.973 166.416 c 105.973 170.452 104.387
 174.116 101.812 176.842 c 109.812 185.448 114.418 196.873 114.418 208.815
 c 114.418 233.819 l 114.418 242.788 107.148 250.061 98.176 250.061 c 96.711
 250.061 95.289 249.866 93.938 249.498 c 93.938 265.323 l 93.938 269.745
 92.117 274.069 88.941 277.186 c 85.805 280.264 81.707 281.913 77.387 281.83
 c 73.641 281.764 70.191 280.397 67.469 278.174 c 64.672 280.463 61.098 
281.834 57.211 281.834 c 53.332 281.834 49.766 280.467 46.969 278.19 c 44.172
 280.467 40.605 281.834 36.727 281.834 c 32.844 281.834 29.281 280.467 26.484
 278.19 c 23.609 280.53 19.922 281.909 15.918 281.83 c 7.012 281.659 0 274.108
 0 265.198 c 0 208.362 l 0 196.721 4.418 185.502 12.094 176.955 c 9.457 
174.217 7.828 170.506 7.828 166.413 c 7.828 160.428 11.312 155.252 16.348
 152.768 c 16.348 79.772 l 6.391 79.772 l 3.105 79.772 0.238 77.237 0.141
 73.955 c 0.039 70.557 2.766 67.768 6.141 67.768 c 403.598 67.768 l 406.977
 67.768 409.699 70.553 409.598 73.955 c 409.5 77.241 406.633 79.772 403.348
 79.772 c h
12.004 208.362 m 12.004 265.592 l 12.004 267.932 13.906 269.834 16.242 
269.834 c 18.582 269.834 20.484 267.932 20.484 265.592 c 20.484 231.873 
l 20.484 228.561 23.172 225.873 26.484 225.873 c 29.801 225.873 32.488 228.561
 32.488 231.873 c 32.488 265.592 l 32.488 267.932 34.391 269.834 36.727 
269.834 c 39.066 269.834 40.969 267.932 40.969 265.592 c 40.969 231.873 
l 40.969 228.561 43.656 225.873 46.969 225.873 c 50.285 225.873 52.973 228.561
 52.973 231.873 c 52.973 265.592 l 52.973 267.932 54.875 269.834 57.211 
269.834 c 59.551 269.834 61.453 267.932 61.453 265.592 c 61.453 231.873 
l 61.453 228.561 64.141 225.873 67.453 225.873 c 70.77 225.873 73.457 228.561
 73.457 231.873 c 73.457 265.592 l 73.457 267.889 75.32 269.791 77.613 269.834
 c 79.062 269.846 80.062 269.084 80.535 268.62 c 81.426 267.748 81.938 266.545
 81.938 265.327 c 81.938 219.045 l 81.938 215.729 84.625 213.041 87.938 
213.041 c 91.254 213.041 93.941 215.729 93.941 219.045 c 93.941 233.819 
l 93.941 236.155 95.844 238.057 98.18 238.057 c 100.52 238.057 102.422 236.155
 102.422 233.819 c 102.422 208.815 l 102.422 198.276 97.609 188.26 89.426
 181.635 c 24.445 181.635 l 16.621 188.229 12.004 198.08 12.004 208.362 
c h
85.453 79.772 m 28.352 79.772 l 28.352 151.194 l 85.453 151.194 l h
90.754 163.198 m 23.051 163.198 l 21.277 163.198 19.832 164.639 19.832 
166.416 c 19.832 168.19 21.273 169.635 23.051 169.635 c 90.758 169.635 l
 92.531 169.635 93.977 168.19 93.977 166.416 c 93.977 164.639 92.531 163.198
 90.754 163.198 c h
145.062 248.323 m 145.062 322.545 l 145.062 326.561 148.328 329.827 152.344
 329.827 c 156.359 329.827 159.625 326.561 159.625 322.545 c 159.625 278.815
 l 159.625 275.502 162.312 272.815 165.629 272.815 c 168.941 272.815 171.629
 275.502 171.629 278.815 c 171.629 322.545 l 171.629 326.561 174.895 329.827
 178.91 329.827 c 182.926 329.827 186.191 326.561 186.191 322.545 c 186.191
 278.815 l 186.191 275.502 188.879 272.815 192.195 272.815 c 195.508 272.815
 198.195 275.502 198.195 278.815 c 198.195 322.545 l 198.195 326.561 201.461
 329.827 205.477 329.827 c 209.492 329.827 212.758 326.561 212.758 322.545
 c 212.758 278.815 l 212.758 275.502 215.445 272.815 218.762 272.815 c 222.074
 272.815 224.762 275.502 224.762 278.815 c 224.762 322.545 l 224.762 326.487
 227.965 329.752 231.902 329.827 c 233.77 329.854 235.57 329.123 236.973
 327.745 c 238.465 326.276 239.324 324.256 239.324 322.198 c 239.324 262.174
 l 239.324 258.862 242.012 256.174 245.324 256.174 c 248.641 256.174 251.328
 258.862 251.328 262.174 c 251.328 281.334 l 251.328 285.35 254.594 288.616
 258.609 288.616 c 262.625 288.616 265.891 285.35 265.891 281.334 c 265.891
 248.909 l 265.891 234.487 259.207 220.795 247.879 211.881 c 162.336 211.881
 l 151.484 220.768 145.062 234.245 145.062 248.323 c h
248.977 187.963 m 161.172 187.963 l 157.887 187.963 155.215 190.635 155.215
 193.92 c 155.215 197.205 157.887 199.877 161.172 199.877 c 248.977 199.877
 l 252.262 199.877 254.934 197.205 254.934 193.92 c 254.934 190.635 252.262
 187.963 248.977 187.963 c h
307.113 208.362 m 307.113 265.592 l 307.113 267.932 309.016 269.834 311.352
 269.834 c 313.691 269.834 315.594 267.932 315.594 265.592 c 315.594 231.873
 l 315.594 228.561 318.281 225.873 321.594 225.873 c 324.91 225.873 327.598
 228.561 327.598 231.873 c 327.598 265.592 l 327.598 267.932 329.5 269.834
 331.836 269.834 c 334.176 269.834 336.078 267.932 336.078 265.592 c 336.078
 231.873 l 336.078 228.561 338.766 225.873 342.078 225.873 c 345.395 225.873
 348.082 228.561 348.082 231.873 c 348.082 265.592 l 348.082 267.932 349.984
 269.834 352.32 269.834 c 354.66 269.834 356.562 267.932 356.562 265.592
 c 356.562 231.873 l 356.562 228.561 359.25 225.873 362.562 225.873 c 365.879
 225.873 368.566 228.561 368.566 231.873 c 368.566 265.592 l 368.566 267.889
 370.43 269.791 372.723 269.834 c 374.18 269.858 375.172 269.084 375.645
 268.62 c 376.535 267.748 377.047 266.545 377.047 265.327 c 377.047 219.045
 l 377.047 215.729 379.734 213.041 383.047 213.041 c 386.363 213.041 389.047
 215.729 389.047 219.045 c 389.047 233.819 l 389.047 236.155 390.953 238.057
 393.289 238.057 c 395.629 238.057 397.531 236.155 397.531 233.819 c 397.531
 208.815 l 397.531 198.276 392.719 188.26 384.535 181.635 c 319.555 181.635
 l 311.73 188.229 307.113 198.08 307.113 208.362 c h
380.562 79.772 m 323.461 79.772 l 323.461 151.194 l 380.562 151.194 l h
385.863 163.198 m 318.16 163.198 l 316.383 163.198 314.941 164.639 314.941
 166.416 c 314.941 168.19 316.383 169.635 318.16 169.635 c 385.863 169.635
 l 387.641 169.635 389.086 168.19 389.086 166.416 c 389.086 164.639 387.641
 163.198 385.863 163.198 c h
385.863 163.198 m f
Q Q
showpage
%%Trailer
end restore
%%EOF
