%!PS-Adobe-3.0 EPSF-3.0
%%Creator: cairo 1.14.2 (http://cairographics.org)
%%CreationDate: Mon Feb 19 09:15:05 2018
%%Pages: 1
%%DocumentData: Clean7Bit
%%LanguageLevel: 2
%%BoundingBox: 0 20 410 390
%%EndComments
%%BeginProlog
save
50 dict begin
/q { gsave } bind def
/Q { grestore } bind def
/cm { 6 array astore concat } bind def
/w { setlinewidth } bind def
/J { setlinecap } bind def
/j { setlinejoin } bind def
/M { setmiterlimit } bind def
/d { setdash } bind def
/m { moveto } bind def
/l { lineto } bind def
/c { curveto } bind def
/h { closepath } bind def
/re { exch dup neg 3 1 roll 5 3 roll moveto 0 rlineto
      0 exch rlineto 0 rlineto closepath } bind def
/S { stroke } bind def
/f { fill } bind def
/f* { eofill } bind def
/n { newpath } bind def
/W { clip } bind def
/W* { eoclip } bind def
/BT { } bind def
/ET { } bind def
/pdfmark where { pop globaldict /?pdfmark /exec load put }
    { globaldict begin /?pdfmark /pop load def /pdfmark
    /cleartomark load def end } ifelse
/BDC { mark 3 1 roll /BDC pdfmark } bind def
/EMC { mark /EMC pdfmark } bind def
/cairo_store_point { /cairo_point_y exch def /cairo_point_x exch def } def
/Tj { show currentpoint cairo_store_point } bind def
/TJ {
  {
    dup
    type /stringtype eq
    { show } { -0.001 mul 0 cairo_font_matrix dtransform rmoveto } ifelse
  } forall
  currentpoint cairo_store_point
} bind def
/cairo_selectfont { cairo_font_matrix aload pop pop pop 0 0 6 array astore
    cairo_font exch selectfont cairo_point_x cairo_point_y moveto } bind def
/Tf { pop /cairo_font exch def /cairo_font_matrix where
      { pop cairo_selectfont } if } bind def
/Td { matrix translate cairo_font_matrix matrix concatmatrix dup
      /cairo_font_matrix exch def dup 4 get exch 5 get cairo_store_point
      /cairo_font where { pop cairo_selectfont } if } bind def
/Tm { 2 copy 8 2 roll 6 array astore /cairo_font_matrix exch def
      cairo_store_point /cairo_font where { pop cairo_selectfont } if } bind def
/g { setgray } bind def
/rg { setrgbcolor } bind def
/d1 { setcachedevice } bind def
%%EndProlog
%%BeginSetup
%%EndSetup
%%Page: 1 1
%%BeginPageSetup
%%PageBoundingBox: 0 20 410 390
%%EndPageSetup
q 0 20 410 370 rectclip q
1 0.811765 0.34902 rg
263.609 67.217 m 248.18 67.217 235.676 79.725 235.676 95.151 c 235.676 
122.717 l 218.016 141.67 l 216.113 143.709 217.562 147.038 220.352 147.038
 c 235.676 147.038 l 235.676 153.19 l 235.676 168.616 248.18 181.12 263.605
 181.12 c 376.051 181.12 l 391.477 181.12 403.98 168.616 403.98 153.19 c
 403.98 95.151 l 403.98 79.721 391.477 67.217 376.051 67.217 c h
263.609 67.217 m f
0.976471 0.631373 0.254902 rg
312.129 95.151 m 312.129 122.717 l 294.473 141.67 l 292.566 143.709 294.016
 147.041 296.809 147.041 c 312.129 147.041 l 312.129 153.19 l 312.129 168.616
 324.637 181.123 340.062 181.123 c 263.609 181.123 l 248.18 181.123 235.676
 168.616 235.676 153.19 c 235.676 147.041 l 220.352 147.041 l 217.562 147.041
 216.113 143.709 218.016 141.67 c 235.676 122.717 l 235.676 95.151 l 235.676
 79.725 248.184 67.217 263.609 67.217 c 340.062 67.217 l 324.637 67.217 
312.129 79.725 312.129 95.151 c h
312.129 95.151 m f
0.909804 0.882353 0.839216 rg
374.203 88.006 m 265.457 88.006 l 260.988 88.006 257.363 91.631 257.363
 96.1 c 257.363 152.362 l 257.363 156.834 260.988 160.459 265.457 160.459
 c 374.203 160.459 l 378.672 160.459 382.297 156.834 382.297 152.362 c 382.297
 96.1 l 382.297 91.631 378.672 88.006 374.203 88.006 c h
374.203 88.006 m f
1 0.811765 0.34902 rg
276.121 269.393 m 263.609 269.393 l 248.18 269.393 235.676 281.901 235.676
 297.327 c 235.676 355.366 l 235.676 370.791 248.18 383.299 263.609 383.299
 c 376.051 383.299 l 391.477 383.299 403.984 370.791 403.984 355.366 c 403.984
 297.327 l 403.984 281.901 391.477 269.393 376.051 269.393 c 298.199 269.393
 l 281.793 249.17 l 279.898 246.834 276.121 248.174 276.121 251.182 c h
276.121 269.393 m f
0.976471 0.631373 0.254902 rg
312.129 297.327 m 312.129 355.366 l 312.129 370.791 324.637 383.299 340.062
 383.299 c 263.609 383.299 l 248.18 383.299 235.676 370.791 235.676 355.366
 c 235.676 297.327 l 235.676 281.901 248.18 269.393 263.609 269.393 c 276.121
 269.393 l 276.121 251.182 l 276.121 248.174 279.898 246.834 281.793 249.17
 c 298.199 269.393 l 340.062 269.393 l 324.637 269.393 312.129 281.901 312.129
 297.327 c h
312.129 297.327 m f
0.909804 0.882353 0.839216 rg
374.203 290.913 m 265.457 290.913 l 260.988 290.913 257.363 294.541 257.363
 299.01 c 257.363 355.272 l 257.363 359.745 260.988 363.37 265.457 363.37
 c 374.203 363.37 l 378.672 363.37 382.297 359.741 382.297 355.272 c 382.297
 299.01 l 382.297 294.541 378.672 290.913 374.203 290.913 c h
374.203 290.913 m f
0.980392 0.827451 0.576471 rg
319.828 321.928 m 308.551 321.928 299.371 331.104 299.371 342.385 c 299.371
 353.663 308.551 362.842 319.828 362.842 c 331.109 362.842 340.285 353.663
 340.285 342.385 c 340.285 331.104 331.109 321.928 319.828 321.928 c h
319.828 321.928 m f
0.192157 0.823529 0.968627 rg
287.059 291.444 m 289.086 299.44 l 292.566 313.155 304.879 322.729 319.027
 322.729 c 320.633 322.729 l 334.781 322.729 347.094 313.155 350.57 299.44
 c 352.602 291.444 l h
287.059 291.444 m f
0.980392 0.827451 0.576471 rg
319.828 118.955 m 308.551 118.955 299.371 128.131 299.371 139.413 c 299.371
 150.694 308.551 159.87 319.828 159.87 c 331.109 159.87 340.285 150.694 
340.285 139.413 c 340.285 128.131 331.109 118.955 319.828 118.955 c h
319.828 118.955 m f
1 0.384314 0.654902 rg
287.059 88.471 m 289.086 96.467 l 292.566 110.182 304.879 119.756 319.027
 119.756 c 320.633 119.756 l 334.781 119.756 347.094 110.182 350.57 96.467
 c 352.602 88.471 l h
287.059 88.471 m f
0.929412 0.717647 0.411765 rg
319.469 342.385 m 319.469 350.014 323.672 356.674 329.879 360.194 c 326.906
 361.873 323.48 362.842 319.832 362.842 c 308.551 362.842 299.375 353.663
 299.375 342.385 c 299.375 331.104 308.551 321.928 319.832 321.928 c 323.48
 321.928 326.91 322.893 329.879 324.577 c 323.672 328.092 319.469 334.756
 319.469 342.385 c h
319.469 342.385 m f
0.0745098 0.67451 0.909804 rg
329.879 321.315 m 326.941 322.233 323.836 322.729 320.633 322.729 c 319.027
 322.729 l 304.879 322.729 292.566 313.151 289.086 299.44 c 287.059 291.44
 l 307.156 291.44 l 309.184 299.44 l 311.875 310.045 319.855 318.174 329.879
 321.315 c h
329.879 321.315 m f
0.929412 0.717647 0.411765 rg
319.469 139.413 m 319.469 147.041 323.672 153.705 329.879 157.221 c 326.906
 158.905 323.48 159.87 319.832 159.87 c 308.551 159.87 299.375 150.694 299.375
 139.413 c 299.375 128.131 308.551 118.955 319.832 118.955 c 323.48 118.955
 326.91 119.92 329.879 121.604 c 323.672 125.12 319.469 131.784 319.469 
139.413 c h
319.469 139.413 m f
0.988235 0.329412 0.47451 rg
329.879 118.342 m 326.941 119.264 323.836 119.756 320.633 119.756 c 319.027
 119.756 l 304.879 119.756 292.566 110.182 289.086 96.467 c 287.059 88.471
 l 307.156 88.471 l 309.184 96.467 l 311.875 107.077 319.855 115.202 329.879
 118.342 c h
329.879 118.342 m f
0.407843 g
181.363 285.166 m 175.457 293.807 l 34.301 294.674 l 26.816 285.342 l 21.789
 278.069 19.137 269.538 19.137 260.666 c 19.137 223.678 l 188.922 223.678
 l 188.922 260.666 l 188.922 269.467 186.309 277.94 181.363 285.166 c h
181.363 285.166 m f
0.207843 g
104.027 255.448 m 80.09 255.448 57.328 262.33 44.633 273.413 c 44.598 273.444
 44.555 273.479 44.508 273.51 c 43.113 274.573 42.016 275.682 41.164 276.905
 c 37.316 282.428 34.926 289.717 34.281 291.819 c 34.004 292.737 l 34.004
 293.92 l 34.109 304.737 42.062 314.643 56.422 321.83 c 69.469 328.362 86.375
 331.955 104.027 331.955 c 105.367 331.955 106.766 331.932 108.18 331.885
 c 108.613 331.94 l 109.102 331.928 l 110 331.909 111.883 331.87 114.414
 331.87 c 120.258 331.87 129.223 332.061 138.762 332.955 c 154.555 334.44
 165.938 337.291 172.605 341.436 c 174.516 342.623 l 176.75 342.358 l 179.453
 342.038 184.199 340.205 185.605 331.553 c 188.23 315.401 178.766 278.541
 151.348 265.475 c 151.277 265.44 l 138.391 258.995 121.613 255.448 104.027
 255.448 c h
104.027 255.448 m f
0.188235 0.164706 0.129412 rg
114.414 331.87 m 111.883 331.87 110 331.909 109.102 331.928 c 108.613 331.94
 l 108.18 331.885 l 106.762 331.932 105.367 331.955 104.027 331.955 c 86.375
 331.955 69.469 328.358 56.422 321.83 c 42.062 314.643 34.109 304.737 34.004
 293.92 c 34.004 292.737 l 34.281 291.819 l 34.926 289.717 37.316 282.428
 41.164 276.905 c 42.016 275.682 43.113 274.573 44.508 273.51 c 44.555 273.479
 44.598 273.444 44.633 273.413 c 57.328 262.33 80.09 255.448 104.027 255.448
 c 117.219 255.448 129.961 257.444 140.941 261.163 c 135.613 263.932 130.875
 267.065 126.914 270.522 c 126.867 270.561 126.812 270.608 126.754 270.651
 c 124.965 272.006 123.562 273.432 122.469 274.995 c 117.539 282.069 114.477
 291.409 113.656 294.1 c 113.297 295.272 l 113.301 296.791 l 113.438 310.647
 123.621 323.334 142.016 332.541 c 142.695 332.881 143.395 333.205 144.09
 333.53 c 142.371 333.323 140.598 333.127 138.758 332.955 c 129.219 332.061
 120.258 331.87 114.414 331.87 c h
114.414 331.87 m f
0.858824 0.682353 0.431373 rg
21.535 190.557 m 12.742 190.557 5.617 197.686 5.617 206.479 c 5.617 208.557
 l 5.617 214.748 9.145 220.221 14.52 222.846 c 16.008 223.573 17.625 224.002
 19.27 224.221 c 20.891 224.436 l 21.07 224.448 21.359 224.467 21.539 224.479
 c 37.512 224.479 l 37.512 190.557 l h
21.535 190.557 m f
170.543 190.557 m 170.543 224.479 l 186.52 224.479 l 186.613 224.479 188.254
 224.276 189.328 224.143 c 189.934 224.069 190.539 223.967 191.129 223.791
 c 197.832 221.768 202.441 215.631 202.441 208.557 c 202.441 206.479 l 202.441
 197.686 195.312 190.557 186.52 190.557 c h
170.543 190.557 m f
0.764706 0.854902 0.25098 rg
53.008 26.303 m 49.238 26.303 46.172 29.37 46.172 33.139 c 46.172 56.588
 l 46.172 73.502 59.934 87.264 76.848 87.264 c 129.859 87.264 l 146.773 
87.264 160.535 73.502 160.535 56.588 c 160.535 33.139 l 160.535 29.37 157.469
 26.303 153.699 26.303 c h
53.008 26.303 m f
0.678431 0.737255 0.0823529 rg
114.43 87.264 m 76.848 87.264 l 59.906 87.264 46.172 73.53 46.172 56.588
 c 46.172 33.139 l 46.172 29.362 49.23 26.303 53.008 26.303 c 90.59 26.303
 l 86.82 26.303 83.754 29.37 83.754 33.139 c 83.754 56.663 l 83.762 59.491
 86.969 61.088 89.32 59.51 c 93.605 56.639 98.812 55.041 104.398 55.268 
c 118.023 55.819 128.617 67.393 128.617 81.034 c 128.617 87.264 l h
114.43 87.264 m f
0.980392 0.827451 0.576471 rg
103.352 80.506 m 94.93 80.506 88.078 87.358 88.078 95.776 c 88.078 128.276
 l 95.332 127.327 l 98.211 126.948 101.137 126.76 104.027 126.76 c 106.484
 126.76 108.992 126.901 111.492 127.178 c 118.625 127.979 l 118.625 95.776
 l 118.625 87.358 111.773 80.506 103.352 80.506 c h
103.352 80.506 m f
0.929412 0.717647 0.411765 rg
103.352 95.776 m 103.352 126.768 l 100.68 126.795 97.984 126.979 95.332
 127.327 c 88.078 128.276 l 88.078 95.776 l 88.078 87.358 94.93 80.506 103.352
 80.506 c 106.137 80.506 108.738 81.264 110.988 82.573 c 106.43 85.217 103.352
 90.139 103.352 95.776 c h
103.352 95.776 m f
0.980392 0.827451 0.576471 rg
103.363 115.53 m 66.305 115.889 36.707 146.643 36.707 183.705 c 36.707 
260.666 l 36.707 263.362 37.129 266.045 37.949 268.616 c 39.293 272.819 
44.379 274.44 47.91 271.795 c 60.906 262.061 81.887 256.248 104.027 256.248
 c 121.395 256.248 138.059 259.784 150.949 266.205 c 151.086 266.272 l 151.277
 266.354 l 151.488 266.475 l 151.609 266.538 l 154.773 268.155 157.645 269.924
 160.152 271.799 c 163.68 274.436 168.758 272.819 170.105 268.623 c 170.93
 266.065 171.348 263.389 171.348 260.666 c 171.348 182.846 l 171.348 145.506
 140.785 115.166 103.363 115.53 c h
103.363 115.53 m f
0.929412 0.717647 0.411765 rg
170.105 268.623 m 168.758 272.819 163.684 274.436 160.156 271.799 c 157.648
 269.924 154.773 268.155 151.609 266.541 c 151.488 266.479 l 151.277 266.358
 l 151.086 266.272 l 150.949 266.205 l 138.059 259.788 121.395 256.252 104.027
 256.252 c 81.887 256.252 60.91 262.061 47.91 271.799 c 44.379 274.44 39.293
 272.819 37.949 268.616 c 37.129 266.045 36.711 263.366 36.711 260.666 c
 36.711 183.717 l 36.711 147.471 65.031 117.065 101.246 115.584 c 110.695
 115.198 119.727 116.795 127.992 119.955 c 105.133 131.745 89.562 155.842
 89.562 183.268 c 89.562 215.194 l 89.562 223.077 95.996 229.385 103.883
 229.373 c 104.027 229.373 l 122.109 229.373 139.461 233.057 152.887 239.741
 c 153.027 239.811 l 153.227 239.897 l 153.445 240.026 l 153.574 240.088
 l 156.863 241.772 159.859 243.612 162.469 245.565 c 165.316 247.694 169.121
 247.155 171.348 244.772 c 171.348 260.666 l 171.348 263.389 170.93 266.065
 170.105 268.623 c h
170.105 268.623 m f
0 g
194.539 228.541 m 194.539 260.666 l 194.539 273.217 189.852 285.061 181.305
 294.205 c 199.609 326.502 183.312 348.338 182.605 349.26 c 181.438 350.78
 179.609 351.635 177.699 351.608 c 175.785 351.565 174.004 350.612 172.906
 349.045 c 166.461 339.834 131.301 336.784 108.391 337.569 c 108.078 337.577
 107.77 337.565 107.465 337.526 c 106.297 337.557 105.145 337.573 104.031
 337.573 c 62.996 337.573 30.562 319.538 28.496 296.084 c 27.801 295.295
 l 18.59 286.01 13.52 273.721 13.52 260.666 c 13.52 228.541 l 5.605 225.354
 0 217.6 0 208.557 c 0 206.479 l 0 194.584 9.645 184.94 21.539 184.94 c 
31.094 184.94 l 31.094 182.846 l 31.094 150.135 52.742 122.381 82.465 113.166
 c 82.465 94.975 l 82.465 94.268 82.5 93.569 82.57 92.881 c 76.848 92.881
 l 56.805 92.881 40.559 76.631 40.559 56.592 c 40.559 33.139 l 40.559 26.264
 46.133 20.69 53.008 20.69 c 69.766 20.69 l 73.09 20.69 75.785 23.381 75.785
 26.705 c 75.785 30.03 73.09 32.721 69.766 32.721 c 53.008 32.721 l 52.777
 32.721 52.59 32.909 52.59 33.139 c 52.59 56.588 l 52.59 69.987 63.453 80.846
 76.848 80.846 c 87.984 80.846 l 91.805 76.694 97.277 74.088 103.355 74.088
 c 109.426 74.088 114.902 76.694 118.723 80.846 c 129.859 80.846 l 143.258
 80.846 154.117 69.987 154.117 56.588 c 154.117 33.139 l 154.117 32.909 
153.93 32.721 153.699 32.721 c 108.922 32.721 l 105.598 32.721 102.902 30.026
 102.902 26.705 c 102.902 23.381 105.598 20.686 108.922 20.686 c 153.699
 20.686 l 160.578 20.686 166.152 26.26 166.152 33.139 c 166.152 56.588 l
 166.152 76.631 149.902 92.877 129.859 92.877 c 124.137 92.877 l 124.207
 93.569 124.242 94.268 124.242 94.971 c 124.242 112.76 l 154.66 121.545 
176.969 149.639 176.969 182.846 c 176.969 184.94 l 186.523 184.94 l 198.418
 184.94 208.059 194.58 208.059 206.475 c 208.059 208.557 l 208.059 217.6
 202.453 225.354 194.539 228.541 c h
31.094 196.975 m 21.535 196.975 l 16.297 196.975 12.035 201.237 12.035 
206.479 c 12.035 208.561 l 12.035 213.034 15.145 216.788 19.316 217.791 
c 19.391 217.788 19.461 217.78 19.535 217.78 c 20.16 217.78 20.766 217.873
 21.332 218.053 c 21.402 218.053 21.469 218.065 21.539 218.065 c 31.094 
218.065 l h
34.945 275.799 m 32.426 271.186 31.094 265.952 31.094 260.666 c 31.094 
230.096 l 25.555 230.096 l 25.555 260.666 l 25.555 268.28 27.848 275.545
 32.098 281.694 c 32.938 279.834 33.926 277.885 35.07 275.995 c 35.031 275.928
 34.98 275.87 34.945 275.799 c h
112.207 94.975 m 112.207 90.092 108.234 86.12 103.352 86.12 c 98.469 86.12
 94.496 90.092 94.496 94.975 c 94.496 110.534 l 97.617 110.127 100.797 109.913
 104.027 109.913 c 106.793 109.913 109.52 110.073 112.203 110.373 c 112.203
 94.975 l h
164.93 182.846 m 164.93 149.264 137.609 121.944 104.027 121.944 c 70.445
 121.944 43.125 149.264 43.125 182.846 c 43.125 260.666 l 43.125 262.705
 43.445 264.733 44.062 266.659 c 58.203 256.069 80.238 249.83 104.027 249.83
 c 122.531 249.83 140.227 253.694 153.809 260.459 c 153.992 260.538 154.172
 260.62 154.348 260.717 c 154.41 260.752 154.469 260.791 154.531 260.827
 c 157.977 262.584 161.156 264.534 163.996 266.659 c 164.617 264.733 164.93
 262.721 164.93 260.666 c h
168.848 293.166 m 167.84 293.268 l 167.848 293.362 l 167.781 292.866 165.992
 281.131 148.422 271.19 c 148.418 271.186 148.41 271.182 148.406 271.178
 c 136.559 265.256 120.762 261.866 104.027 261.866 c 81.574 261.866 60.43
 268.143 48.855 278.248 c 48.402 278.643 47.914 278.983 47.402 279.276 c
 44.008 283.455 41.5 290.163 40.422 293.69 c 40.422 293.694 40.422 293.698
 40.422 293.702 c 40.422 310.959 69.551 325.538 104.027 325.538 c 105.312
 325.538 106.656 325.514 108.02 325.471 c 108.332 325.459 108.641 325.475
 108.945 325.514 c 112.523 325.428 125.328 325.248 139.359 326.569 c 156.281
 328.159 168.391 331.26 175.992 335.987 c 178.477 328.932 180.195 316.006
 170.238 299.104 c 169.152 297.26 168.703 295.186 168.848 293.166 c h
174.738 272.338 m 174.191 273.713 173.395 274.928 172.414 275.948 c 173.914
 277.909 175.109 279.795 176.066 281.545 c 180.25 275.428 182.504 268.217
 182.504 260.666 c 182.504 230.096 l 176.965 230.096 l 176.965 260.666 l
 176.965 264.698 176.215 268.623 174.738 272.338 c h
196.023 206.479 m 196.023 201.237 191.762 196.975 186.52 196.975 c 176.965
 196.975 l 176.965 218.061 l 186.52 218.061 l 186.59 218.061 186.656 218.053
 186.727 218.053 c 187.293 217.873 187.895 217.776 188.523 217.776 c 188.594
 217.776 188.668 217.788 188.742 217.788 c 192.91 216.784 196.023 213.034
 196.023 208.557 c h
196.023 206.479 m f
376.051 388.913 m 263.609 388.913 l 245.109 388.913 230.059 373.866 230.059
 355.366 c 230.059 297.327 l 230.059 278.827 245.109 263.776 263.609 263.776
 c 270.504 263.776 l 270.504 243.307 l 270.504 240.76 272.109 238.491 274.508
 237.639 c 275.168 237.405 275.848 237.291 276.52 237.291 c 278.297 237.291
 280.027 238.08 281.191 239.518 c 300.875 263.776 l 376.051 263.776 l 394.547
 263.776 409.598 278.827 409.598 297.327 c 409.598 355.366 l 409.602 373.866
 394.551 388.913 376.051 388.913 c h
397.566 297.327 m 397.566 285.463 387.914 275.811 376.051 275.811 c 298.012
 275.811 l 296.199 275.811 294.48 274.995 293.34 273.584 c 282.539 260.276
 l 282.539 269.795 l 282.539 273.12 279.844 275.811 276.523 275.811 c 263.609
 275.811 l 251.746 275.811 242.094 285.463 242.094 297.327 c 242.094 355.366
 l 242.094 367.229 251.746 376.881 263.609 376.881 c 376.051 376.881 l 387.914
 376.881 397.566 367.229 397.566 355.366 c h
397.566 297.327 m f
377.234 368.455 m 262.426 368.455 l 256.699 368.455 252.039 363.799 252.039
 358.073 c 252.039 296.209 l 252.039 290.487 256.699 285.827 262.426 285.827
 c 377.234 285.827 l 382.961 285.827 387.617 290.487 387.617 296.209 c 387.617
 358.073 l 387.617 363.799 382.961 368.455 377.234 368.455 c h
333.867 342.385 m 333.867 334.643 327.57 328.346 319.828 328.346 c 312.09
 328.346 305.789 334.643 305.789 342.385 c 305.789 350.123 312.09 356.424
 319.828 356.424 c 327.57 356.424 333.867 350.123 333.867 342.385 c h
264.074 356.424 m 297.875 356.424 l 295.273 352.366 293.758 347.549 293.758
 342.385 c 293.758 335.143 296.727 328.584 301.508 323.854 c 291.887 318.569
 284.898 309.069 283.031 297.858 c 264.074 297.858 l h
295.309 297.862 m 297.996 308.452 307.609 316.311 319.027 316.311 c 320.633
 316.311 l 332.051 316.311 341.664 308.452 344.352 297.862 c h
375.586 297.862 m 356.629 297.862 l 354.762 309.069 347.773 318.569 338.152
 323.858 c 342.934 328.584 345.902 335.143 345.902 342.385 c 345.902 347.553
 344.387 352.37 341.781 356.424 c 375.586 356.424 l h
375.586 297.862 m f
377.234 165.491 m 262.426 165.491 l 256.699 165.491 252.039 160.834 252.039
 155.108 c 252.039 93.245 l 252.039 87.518 256.699 82.862 262.426 82.862
 c 377.234 82.862 l 382.961 82.862 387.617 87.522 387.617 93.245 c 387.617
 155.108 l 387.617 160.834 382.961 165.491 377.234 165.491 c h
333.867 139.42 m 333.867 131.678 327.57 125.377 319.828 125.377 c 312.09
 125.377 305.789 131.678 305.789 139.42 c 305.789 147.159 312.09 153.459
 319.828 153.459 c 327.57 153.459 333.867 147.159 333.867 139.42 c h
264.074 153.459 m 297.875 153.459 l 295.273 149.401 293.758 144.584 293.758
 139.42 c 293.758 132.178 296.727 125.62 301.508 120.889 c 291.887 115.604
 284.898 106.104 283.031 94.893 c 264.074 94.893 l h
295.309 94.893 m 297.996 105.487 307.609 113.346 319.027 113.346 c 320.633
 113.346 l 332.051 113.346 341.664 105.487 344.352 94.893 c h
375.586 94.893 m 356.629 94.893 l 354.762 106.104 347.773 115.604 338.152
 120.889 c 342.934 125.62 345.902 132.178 345.902 139.42 c 345.902 144.584
 344.387 149.401 341.781 153.459 c 375.586 153.459 l h
375.586 94.893 m f
376.051 186.737 m 263.609 186.737 l 245.109 186.737 230.059 171.69 230.059
 153.19 c 230.059 152.655 l 213.934 152.655 l 211.539 152.655 209.371 151.233
 208.418 149.038 c 207.461 146.842 207.898 144.288 209.535 142.538 c 230.062
 120.506 l 230.062 95.151 l 230.062 76.651 245.109 61.6 263.609 61.6 c 376.051
 61.6 l 394.551 61.6 409.602 76.651 409.602 95.151 c 409.602 153.19 l 409.602
 171.69 394.551 186.737 376.051 186.737 c h
397.566 95.151 m 397.566 83.288 387.914 73.635 376.051 73.635 c 263.609
 73.635 l 251.746 73.635 242.094 83.288 242.094 95.151 c 242.094 122.877
 l 242.094 124.401 241.516 125.866 240.477 126.979 c 227.766 140.623 l 236.074
 140.623 l 239.398 140.623 242.094 143.315 242.094 146.639 c 242.094 153.19
 l 242.094 165.053 251.746 174.705 263.609 174.705 c 376.051 174.705 l 387.914
 174.705 397.566 165.053 397.566 153.19 c h
397.566 95.151 m f
Q Q
showpage
%%Trailer
end restore
%%EOF
