%!PS-Adobe-3.0 EPSF-3.0
%%Creator: cairo 1.14.2 (http://cairographics.org)
%%CreationDate: Mon Feb 19 09:15:05 2018
%%Pages: 1
%%DocumentData: Clean7Bit
%%LanguageLevel: 2
%%BoundingBox: 0 8 410 401
%%EndComments
%%BeginProlog
save
50 dict begin
/q { gsave } bind def
/Q { grestore } bind def
/cm { 6 array astore concat } bind def
/w { setlinewidth } bind def
/J { setlinecap } bind def
/j { setlinejoin } bind def
/M { setmiterlimit } bind def
/d { setdash } bind def
/m { moveto } bind def
/l { lineto } bind def
/c { curveto } bind def
/h { closepath } bind def
/re { exch dup neg 3 1 roll 5 3 roll moveto 0 rlineto
      0 exch rlineto 0 rlineto closepath } bind def
/S { stroke } bind def
/f { fill } bind def
/f* { eofill } bind def
/n { newpath } bind def
/W { clip } bind def
/W* { eoclip } bind def
/BT { } bind def
/ET { } bind def
/pdfmark where { pop globaldict /?pdfmark /exec load put }
    { globaldict begin /?pdfmark /pop load def /pdfmark
    /cleartomark load def end } ifelse
/BDC { mark 3 1 roll /BDC pdfmark } bind def
/EMC { mark /EMC pdfmark } bind def
/cairo_store_point { /cairo_point_y exch def /cairo_point_x exch def } def
/Tj { show currentpoint cairo_store_point } bind def
/TJ {
  {
    dup
    type /stringtype eq
    { show } { -0.001 mul 0 cairo_font_matrix dtransform rmoveto } ifelse
  } forall
  currentpoint cairo_store_point
} bind def
/cairo_selectfont { cairo_font_matrix aload pop pop pop 0 0 6 array astore
    cairo_font exch selectfont cairo_point_x cairo_point_y moveto } bind def
/Tf { pop /cairo_font exch def /cairo_font_matrix where
      { pop cairo_selectfont } if } bind def
/Td { matrix translate cairo_font_matrix matrix concatmatrix dup
      /cairo_font_matrix exch def dup 4 get exch 5 get cairo_store_point
      /cairo_font where { pop cairo_selectfont } if } bind def
/Tm { 2 copy 8 2 roll 6 array astore /cairo_font_matrix exch def
      cairo_store_point /cairo_font where { pop cairo_selectfont } if } bind def
/g { setgray } bind def
/rg { setrgbcolor } bind def
/d1 { setcachedevice } bind def
%%EndProlog
%%BeginSetup
%%EndSetup
%%Page: 1 1
%%BeginPageSetup
%%PageBoundingBox: 0 8 410 401
%%EndPageSetup
q 0 8 410 393 rectclip q
0.764706 0.854902 0.25098 rg
236.578 325.382 m 210.902 325.382 l 206.094 316.222 l 197.332 298.812 l
 196.504 297.167 194.027 297.757 194.027 299.597 c 194.027 325.378 l 188.266
 325.378 l 178.82 325.378 171.168 333.034 171.168 342.476 c 171.168 377.671
 l 171.168 387.116 178.82 394.769 188.266 394.769 c 256.453 394.769 l 265.895
 394.769 273.547 387.116 273.547 377.675 c 273.547 342.476 l 273.547 333.034
 265.895 325.382 256.453 325.382 c 253.449 325.382 l 253.449 300.952 l 253.449
 299.144 251.039 298.53 250.172 300.116 c 241.387 316.222 l h
236.578 325.382 m f
0.678431 0.737255 0.0823529 rg
197.871 327.347 m 197.871 362.542 l 197.871 371.988 205.523 379.64 214.969
 379.64 c 273.43 379.64 l 272.453 388.155 265.23 394.773 256.453 394.773
 c 188.266 394.773 l 178.824 394.773 171.168 387.116 171.168 377.675 c 171.168
 342.48 l 171.168 333.034 178.824 325.382 188.266 325.382 c 194.031 325.382
 l 194.031 299.597 l 194.031 297.757 196.508 297.171 197.336 298.812 c 204.793
 313.632 l 200.598 316.745 197.871 321.722 197.871 327.347 c h
197.871 327.347 m f
0.956863 0.619608 0.172549 rg
395.855 215.441 m 395.84 215.78 l 394.879 235.101 386.805 253.308 373.105
 267.05 c 358.312 281.886 338.633 290.058 317.684 290.058 c 274.535 290.058
 239.43 254.952 239.43 211.804 c 239.43 179.187 l 239.402 146.527 l 239.402
 102.327 l 239.402 94.327 245.91 87.82 253.91 87.82 c 379.836 87.82 l 387.836
 87.82 394.344 94.327 394.344 102.327 c 394.344 145.343 l 395.84 179.636
 l 395.84 215.097 l h
395.855 215.441 m f
0.929412 0.517647 0.0235294 rg
342.297 202.234 m 320.281 212.386 306.152 228.089 306.152 245.714 c 306.152
 262.277 318.629 277.144 338.402 287.296 c 331.734 289.116 324.781 290.058
 317.684 290.058 c 274.535 290.058 239.43 254.952 239.43 211.804 c 239.43
 179.183 l 239.402 146.523 l 239.402 102.323 l 239.402 94.327 245.91 87.82
 253.906 87.82 c 342.297 87.82 l h
342.297 202.234 m f
0.858824 0.682353 0.431373 rg
250.426 143.398 m 240.137 143.991 232.074 152.534 232.074 162.847 c 232.074
 173.159 240.137 181.702 250.426 182.296 c 257.195 182.687 l 257.195 143.011
 l h
250.426 143.398 m f
378.965 182.722 m 385.773 182.284 l 395.996 181.628 404 173.089 404 162.847
 c 404 152.601 395.996 144.066 385.773 143.409 c 378.965 142.972 l h
378.965 182.722 m f
0.956863 0.462745 0.603922 rg
345.871 63.421 m 290.289 63.421 l 273.664 63.421 260.137 49.894 260.137
 33.269 c 260.137 21.925 l 260.137 18.015 263.32 14.831 267.23 14.831 c 
368.93 14.831 l 372.84 14.831 376.023 18.015 376.023 21.925 c 376.023 33.269
 l 376.023 49.894 362.496 63.421 345.871 63.421 c h
345.871 63.421 m f
0.988235 0.329412 0.47451 rg
333.105 63.421 m 290.289 63.421 l 273.637 63.421 260.137 49.921 260.137
 33.269 c 260.137 21.925 l 260.137 18.007 263.312 14.831 267.23 14.831 c
 301.82 14.831 l 297.91 14.831 294.73 18.015 294.73 21.925 c 294.73 33.421
 l 294.758 39.464 301.305 43.081 306.645 40.257 c 309.973 38.499 313.746
 37.484 317.754 37.429 c 331.438 37.249 342.633 48.78 342.633 62.468 c 342.633
 63.421 l h
333.105 63.421 m f
0.980392 0.827451 0.576471 rg
317.629 54.859 m 308.375 54.859 300.848 62.39 300.848 71.644 c 300.848 
102.523 l 308.227 101.374 l 311.332 100.89 314.496 100.644 317.629 100.644
 c 320.766 100.644 323.93 100.89 327.031 101.374 c 334.414 102.523 l 334.414
 71.644 l 334.414 62.39 326.887 54.859 317.629 54.859 c h
317.629 54.859 m f
0.929412 0.717647 0.411765 rg
320.277 71.644 m 320.277 100.691 l 319.543 100.663 318.809 100.648 318.078
 100.648 c 314.945 100.648 311.781 100.894 308.68 101.374 c 301.297 102.523
 l 301.297 71.644 l 301.297 62.39 308.824 54.863 318.078 54.863 c 321.602
 54.863 324.867 55.956 327.57 57.816 c 323.172 60.843 320.277 65.909 320.277
 71.644 c h
320.277 71.644 m f
0.980392 0.827451 0.576471 rg
318.078 86.003 m 284.066 86.003 256.395 113.675 256.395 147.687 c 256.395
 223.601 l 267.102 213.859 l 268.57 212.519 270.207 211.234 271.965 210.038
 c 281.59 203.488 294.395 199.878 308.02 199.878 c 329.664 199.878 349.004
 209.241 356.148 223.179 c 358.609 227.984 l 363.758 226.366 l 366.055 225.648
 368.434 225.28 370.82 225.28 c 371.461 225.28 372.137 225.308 372.836 225.366
 c 379.766 225.945 l 379.766 182.374 l 379.684 181.866 l 379.68 181.866 
379.68 181.878 379.68 181.894 c 379.68 144.515 l 379.672 144.343 l 378.23
 117.507 359.781 94.878 333.77 88.03 c 330.438 87.245 l 326.391 86.421 322.234
 86.003 318.078 86.003 c h
318.078 86.003 m f
0.929412 0.717647 0.411765 rg
370.82 225.28 m 368.434 225.28 366.055 225.648 363.758 226.366 c 358.609
 227.984 l 356.148 223.179 l 349.004 209.241 329.664 199.878 308.02 199.878
 c 294.395 199.878 281.59 203.488 271.965 210.038 c 270.207 211.234 268.57
 212.519 267.102 213.859 c 256.395 223.601 l 256.395 147.687 l 256.395 113.675
 284.066 86.003 318.078 86.003 c 322.234 86.003 326.391 86.421 330.438 87.245
 c 333.77 88.03 l 334.625 88.257 335.469 88.499 336.305 88.757 c 314.227
 98.999 298.875 121.37 298.875 147.269 c 298.875 170.995 l 298.875 174.777
 302.008 177.765 305.789 177.679 c 306.379 177.663 306.973 177.659 307.566
 177.659 c 330.188 177.659 350.402 187.445 357.867 202.011 c 359.352 204.913
 362.711 206.32 365.82 205.343 c 368.223 204.589 370.707 204.206 373.203
 204.206 c 373.871 204.206 374.578 204.238 375.309 204.3 c 379.766 204.671
 l 379.766 225.945 l 372.836 225.366 l 372.137 225.308 371.461 225.28 370.82
 225.28 c h
370.82 225.28 m f
0 0.443137 0.717647 rg
43.496 21.089 m 43.496 43.179 l 43.496 59.023 56.34 71.866 72.184 71.866
 c 121.719 71.866 l 137.535 71.866 150.406 58.995 150.406 43.179 c 150.391
 21.07 l 150.391 17.636 147.605 14.851 144.168 14.851 c 49.715 14.866 l 
46.281 14.866 43.496 17.652 43.496 21.089 c h
43.496 21.089 m f
0.0235294 0.352941 0.517647 rg
82.273 14.866 m 78.84 14.866 76.055 17.652 76.055 21.089 c 76.055 43.179
 l 76.055 43.366 76.055 43.554 76.059 43.741 c 76.188 50.355 83.012 54.515
 89.086 51.894 c 91.648 50.788 94.488 50.206 97.465 50.28 c 108.348 50.558
 116.883 59.777 116.883 70.659 c 116.883 71.866 l 72.184 71.866 l 56.34 
71.866 43.496 59.023 43.496 43.179 c 43.496 21.089 l 43.496 17.652 46.281
 14.866 49.719 14.866 c 144.168 14.855 l 144.199 14.855 144.227 14.859 144.258
 14.859 c h
82.273 14.866 m f
0.980392 0.827451 0.576471 rg
96.949 66.081 m 89.07 66.081 82.656 72.495 82.656 80.378 c 82.656 109.753
 l 89.844 108.855 l 92.543 108.519 95.074 108.355 97.582 108.355 c 99.742
 108.355 101.961 108.476 104.172 108.71 c 111.246 109.456 l 111.246 80.378
 l 111.246 72.495 104.832 66.081 96.949 66.081 c h
96.949 66.081 m f
0.929412 0.717647 0.411765 rg
97.582 87.48 m 97.582 108.355 l 95.074 108.355 92.543 108.519 89.844 108.855
 c 82.656 109.753 l 82.656 80.378 l 82.656 72.495 89.07 66.081 96.949 66.081
 c 102.305 66.081 106.973 69.042 109.422 73.409 c 102.707 74.577 97.582 
80.437 97.582 87.48 c h
97.582 87.48 m f
0.207843 g
165.004 262.648 m 163.035 264.89 l 162.961 274.409 155.812 283.691 143.391
 290.378 c 131.25 296.909 114.984 300.507 97.582 300.507 c 80.18 300.507
 63.91 296.909 51.773 290.378 c 39.355 283.691 32.199 274.409 32.129 264.89
 c 30.18 262.667 l 22.473 254.964 18.23 244.738 18.23 233.87 c 18.23 199.28
 l 176.934 199.28 l 176.934 233.87 l 176.934 244.738 172.691 254.964 165.004
 262.648 c h
165.004 262.648 m f
0.858824 0.682353 0.431373 rg
21.473 168.331 m 12.719 168.331 5.598 175.456 5.598 184.206 c 5.598 192.96
 12.719 200.081 21.473 200.081 c 35.453 200.081 l 35.453 168.331 l h
21.473 168.331 m f
159.711 168.331 m 159.711 200.081 l 173.691 200.081 l 182.445 200.081 189.566
 192.96 189.566 184.206 c 189.566 175.452 182.445 168.331 173.691 168.331
 c h
159.711 168.331 m f
0.188235 0.164706 0.129412 rg
123.746 232.331 m 102.395 238.648 87.832 251.214 87.832 265.687 c 87.832
 279.538 101.164 291.636 121.02 298.191 c 113.66 299.706 105.746 300.507
 97.578 300.507 c 80.176 300.507 63.91 296.909 51.773 290.378 c 39.352 283.691
 32.199 274.409 32.125 264.89 c 30.176 262.667 l 22.473 254.964 18.23 244.738
 18.23 233.87 c 18.23 199.28 l 123.746 199.28 l h
123.746 232.331 m f
0.980392 0.827451 0.576471 rg
96.961 98.23 m 62.316 98.566 34.652 127.312 34.652 161.956 c 34.652 233.87
 l 34.652 236.163 34.973 238.433 35.605 240.62 c 36.84 244.898 41.953 246.64
 45.539 244.003 c 57.852 234.956 76.82 229.769 97.582 229.769 c 118 229.769
 137.457 235.093 149.629 244.007 c 153.215 246.64 158.328 244.894 159.559
 240.616 c 160.191 238.425 160.512 236.152 160.512 233.866 c 160.512 161.155
 l 160.512 126.249 131.945 97.89 96.961 98.23 c h
96.961 98.23 m f
0.929412 0.717647 0.411765 rg
159.281 241.456 m 157.992 245.32 153.301 246.761 150.043 244.316 c 137.902
 235.214 118.234 229.769 97.582 229.769 c 76.82 229.769 57.852 234.956 45.539
 244.003 c 42.34 247.202 36.871 245.691 35.773 241.296 c 35.605 240.62 l
 34.973 238.433 34.652 236.159 34.652 233.87 c 34.652 161.964 l 34.652 127.655
 61.789 99.042 96.09 98.241 c 104.23 98.054 112.035 99.429 119.23 102.073
 c 97.23 112.761 82.125 135.562 82.125 161.609 c 82.125 186.988 l 82.125
 199.749 91.898 210.28 104.609 211.476 c 104.688 211.484 104.766 211.491
 104.844 211.499 c 125.895 213.523 145.426 220.937 157.09 231.335 c 158.105
 232.241 159.297 232.761 160.512 232.937 c 160.512 233.866 l 160.512 236.445
 160.094 239.007 159.281 241.456 c h
159.281 241.456 m f
0 g
182.531 203.769 m 182.531 233.87 l 182.531 246.163 177.758 257.738 169.09
 266.484 c 168.527 267.124 l 166.469 289.167 136.047 306.109 97.582 306.109
 c 59.113 306.109 28.695 289.167 26.637 267.124 c 26.078 266.484 l 17.402
 257.738 12.633 246.167 12.633 233.87 c 12.633 203.769 l 5.117 200.359 -0.102
 192.753 0 183.956 c 0.137 172.12 10.094 162.734 21.93 162.734 c 29.055 
162.734 l 29.055 161.155 l 29.055 130.515 49.266 104.511 77.055 95.769 c
 77.055 79.046 l 77.055 78.511 77.082 77.988 77.125 77.464 c 72.184 77.464
 l 53.246 77.464 37.898 62.113 37.898 43.179 c 37.898 21.265 l 37.898 14.632
 43.273 9.253 49.906 9.253 c 67.762 9.253 l 71.078 9.253 73.766 11.941 73.766
 15.257 c 73.766 15.261 l 73.766 18.573 71.078 21.261 67.766 21.261 c 49.895
 21.265 l 49.895 43.175 l 49.895 55.488 59.875 65.468 72.184 65.468 c 82.43
 65.468 l 86.062 61.585 91.227 59.152 96.953 59.152 c 102.676 59.152 107.84
 61.581 111.473 65.468 c 121.719 65.468 l 134.008 65.468 144.008 55.468 
144.008 43.179 c 143.996 21.253 l 106.805 21.257 l 103.488 21.257 100.801
 18.57 100.801 15.253 c 100.801 11.941 103.488 9.253 106.805 9.253 c 143.996
 9.253 l 150.629 9.253 156.004 14.632 156.004 21.265 c 156.004 43.175 l 
156.004 62.113 140.656 77.464 121.719 77.464 c 116.777 77.464 l 116.82 77.988
 116.848 78.511 116.848 79.042 c 116.848 95.402 l 145.281 103.745 166.113
 130.054 166.113 161.155 c 166.113 162.734 l 173.234 162.734 l 185.074 162.734
 195.031 172.12 195.164 183.956 c 195.266 192.753 190.043 200.359 182.531
 203.769 c h
29.055 174.734 m 21.473 174.734 l 16.246 174.734 11.996 178.984 11.996 
184.206 c 11.996 189.433 16.246 193.683 21.473 193.683 c 29.055 193.683 
l h
104.848 79.046 m 104.848 74.691 101.305 71.148 96.949 71.148 c 92.598 71.148
 89.055 74.691 89.055 79.046 c 89.055 93.175 l 91.852 92.827 94.691 92.628
 97.582 92.628 c 100.035 92.628 102.461 92.761 104.848 93.015 c h
154.113 161.155 m 154.113 129.984 128.754 104.624 97.582 104.624 c 66.41
 104.624 41.051 129.984 41.051 161.155 c 41.051 233.87 l 41.051 235.57 41.289
 237.241 41.754 238.847 c 55.035 229.081 75.406 223.37 97.582 223.37 c 119.598
 223.37 140.117 229.105 153.41 238.847 c 153.871 237.238 154.113 235.562
 154.113 233.87 c h
162.227 248.62 m 161.172 250.48 159.207 251.636 157.066 251.659 c 152.48
 251.702 l 151.062 251.722 149.641 251.21 148.539 250.273 c 137.719 241.077
 118.195 235.366 97.582 235.366 c 76.125 235.366 56.207 241.429 45.602 251.183
 c 44.508 252.191 43.082 252.753 41.598 252.769 c 38.902 252.792 l 36.844
 252.847 34.914 251.773 33.801 250.042 c 30.695 245.218 29.055 239.624 29.055
 233.87 c 29.055 205.679 l 24.629 205.679 l 24.629 233.87 l 24.629 243.027
 28.207 251.648 34.703 258.14 c 34.797 258.234 34.887 258.327 34.973 258.429
 c 37.039 260.78 l 37.996 261.874 38.527 263.28 38.527 264.734 c 38.527 
278.921 62.258 294.105 97.582 294.105 c 132.91 294.105 156.641 278.921 156.641
 264.734 c 156.641 263.28 157.168 261.874 158.129 260.78 c 160.195 258.425
 l 160.281 258.327 160.371 258.23 160.465 258.14 c 166.961 251.644 170.535
 243.023 170.535 233.87 c 170.535 205.679 l 166.113 205.679 l 166.113 233.87
 l 166.109 239.042 164.766 244.144 162.227 248.62 c h
173.691 174.734 m 166.109 174.734 l 166.109 193.683 l 173.691 193.683 l
 178.914 193.683 183.168 189.433 183.168 184.206 c 183.168 178.98 178.914
 174.734 173.691 174.734 c h
173.691 174.734 m f
247.738 292.066 m 248.793 290.058 250.859 288.855 253.051 288.855 c 253.527
 288.855 254.008 288.913 254.488 289.03 c 257.168 289.691 259.051 292.097
 259.051 294.855 c 259.051 319.929 l 270.348 321.222 279.148 330.843 279.148
 342.48 c 279.148 377.671 l 279.148 390.187 268.969 400.37 256.453 400.37
 c 188.266 400.37 l 175.75 400.37 165.57 390.187 165.57 377.671 c 165.57
 342.476 l 165.57 329.964 175.75 319.78 188.266 319.78 c 188.43 319.78 l
 188.43 294.855 l 188.43 292.093 190.312 289.691 192.992 289.03 c 195.676
 288.366 198.461 289.624 199.742 292.066 c 214.289 319.78 l 233.195 319.78
 l h
210.66 331.78 m 208.43 331.78 206.383 330.542 205.348 328.57 c 200.426 
319.195 l 200.426 325.78 l 200.426 329.093 197.742 331.78 194.43 331.78 
c 188.262 331.78 l 182.363 331.78 177.566 336.577 177.566 342.48 c 177.566
 377.671 l 177.566 383.573 182.363 388.37 188.262 388.37 c 256.453 388.37
 l 262.352 388.37 267.148 383.573 267.148 377.671 c 267.148 342.476 l 267.148
 336.577 262.352 331.777 256.453 331.777 c 253.051 331.777 l 249.738 331.777
 247.051 329.093 247.051 325.78 c 247.051 319.195 l 242.133 328.566 l 241.094
 330.542 239.051 331.777 236.82 331.777 c h
210.66 331.78 m f
401.363 181.413 m 401.406 181.702 401.438 181.999 401.438 182.3 c 401.535
 211.538 l 401.609 234.765 392.305 256.562 375.398 272.632 c 360.434 286.859
 340.605 295.073 319.965 295.624 c 272.691 296.886 233.832 258.796 233.832
 211.804 c 233.832 182.077 l 233.832 181.613 233.891 181.159 233.992 180.726
 c 229.359 176.171 226.477 169.839 226.477 162.847 c 226.477 155.839 229.371
 149.495 234.02 144.941 c 233.883 144.437 233.805 143.909 233.805 143.363
 c 233.805 102.323 l 233.805 91.222 242.805 82.218 253.906 82.218 c 295.695
 82.218 l 295.695 69.792 l 295.695 69.534 295.707 69.277 295.715 69.015 
c 290.289 69.015 l 270.543 69.015 254.539 53.011 254.539 33.265 c 254.539
 21.921 l 254.539 14.913 260.219 9.23 267.23 9.23 c 283.695 9.23 l 287.008
 9.23 289.691 11.917 289.691 15.23 c 289.691 18.542 287.008 21.23 283.695
 21.23 c 267.23 21.23 l 266.844 21.23 266.535 21.538 266.535 21.925 c 266.535
 33.269 l 266.535 46.386 277.168 57.019 290.289 57.019 c 299.715 57.019 
l 303.766 51.218 310.484 47.413 318.078 47.413 c 325.676 47.413 332.395 
51.218 336.441 57.019 c 345.871 57.019 l 358.992 57.019 369.625 46.386 369.625
 33.269 c 369.625 21.925 l 369.625 21.538 369.312 21.23 368.93 21.23 c 322.727
 21.23 l 319.414 21.23 316.73 18.542 316.73 15.23 c 316.73 11.917 319.414
 9.23 322.727 9.23 c 368.93 9.23 l 375.938 9.23 381.621 14.913 381.621 21.921
 c 381.621 33.265 l 381.621 53.011 365.617 69.015 345.871 69.015 c 340.441
 69.015 l 340.453 69.277 340.461 69.534 340.461 69.792 c 340.461 82.222 
l 379.836 82.222 l 390.941 82.222 399.941 91.222 399.941 102.323 c 399.941
 143.089 l 405.812 147.683 409.602 154.827 409.602 162.847 c 409.602 170.198
 406.418 176.823 401.363 181.413 c h
245.828 211.804 m 245.828 251.425 278.062 283.655 317.684 283.655 c 336.922
 283.655 354.992 276.155 368.57 262.53 c 381.234 249.831 388.562 233.238
 389.449 215.464 c 389.441 215.355 389.438 215.241 389.438 215.132 c 389.438
 187.437 l 388.113 187.702 386.754 187.859 385.363 187.905 c 385.363 226.058
 l 385.363 226.101 385.359 226.144 385.359 226.183 c 385.395 226.984 385.273
 227.8 384.969 228.593 c 383.781 231.687 380.312 233.234 377.219 232.046
 c 375.195 231.273 373.039 230.878 370.82 230.878 c 368.348 230.878 365.922
 231.39 363.711 232.351 c 362.887 233.585 361.609 234.523 360.051 234.874
 c 356.82 235.609 353.605 233.585 352.871 230.355 c 352.805 230.05 352.727
 229.745 352.641 229.441 c 348.816 215.777 329.633 205.476 308.02 205.476
 c 283.57 205.476 262.902 218.597 262.711 234.183 c 262.707 234.437 l 262.691
 237.738 260.008 240.402 256.707 240.402 c 256.691 240.402 l 253.387 240.394
 250.711 237.71 250.711 234.402 c 250.711 234.288 250.711 234.175 250.711
 234.066 c 250.793 219.714 l 250.793 187.905 l 249.09 187.855 247.43 187.632
 245.828 187.257 c h
238.473 162.847 m 238.473 169.804 243.934 175.511 250.793 175.905 c 250.793
 149.788 l 243.934 150.183 238.473 155.89 238.473 162.847 c h
253.906 94.218 m 249.438 94.218 245.801 97.855 245.801 102.323 c 245.801
 138.441 l 247.645 138.007 249.559 137.769 251.531 137.769 c 254.156 120.077
 263.695 104.62 277.301 94.218 c h
328.465 69.796 m 328.465 64.07 323.805 59.409 318.078 59.409 c 312.352 
59.409 307.695 64.07 307.695 69.796 c 307.695 81.206 l 311.078 80.679 314.547
 80.402 318.078 80.402 c 321.609 80.402 325.078 80.679 328.465 81.206 c 
h
332.141 94.218 m 331.973 94.218 l 330.953 94.218 329.996 93.964 329.16 
93.515 c 325.578 92.784 321.875 92.402 318.082 92.402 c 287.598 92.402 262.793
 117.202 262.793 147.687 c 262.793 209.124 l 264.484 207.585 266.344 206.124
 268.363 204.749 c 279.039 197.48 293.125 193.48 308.02 193.48 c 332.32 
193.48 353.734 204.437 361.844 220.261 c 364.727 219.359 367.758 218.882
 370.824 218.882 c 371.68 218.882 372.527 218.921 373.371 218.991 c 373.371
 182.89 l 373.32 182.577 373.285 182.257 373.285 181.929 c 373.285 144.687
 l 371.977 120.386 354.906 100.21 332.141 94.218 c h
387.941 102.327 m 387.941 97.855 384.305 94.218 379.836 94.218 c 358.859
 94.218 l 372.465 104.62 382.004 120.081 384.629 137.769 c 385.754 137.773
 386.859 137.859 387.941 138.007 c h
385.363 149.796 m 385.363 175.898 l 392.184 175.46 397.602 169.777 397.602
 162.847 c 397.602 155.917 392.188 150.234 385.363 149.796 c h
385.363 149.796 m f
Q Q
showpage
%%Trailer
end restore
%%EOF
