%!PS-Adobe-3.0 EPSF-3.0
%%Creator: cairo 1.14.2 (http://cairographics.org)
%%CreationDate: Mon Feb 19 09:15:05 2018
%%Pages: 1
%%DocumentData: Clean7Bit
%%LanguageLevel: 2
%%BoundingBox: 0 0 410 409
%%EndComments
%%BeginProlog
save
50 dict begin
/q { gsave } bind def
/Q { grestore } bind def
/cm { 6 array astore concat } bind def
/w { setlinewidth } bind def
/J { setlinecap } bind def
/j { setlinejoin } bind def
/M { setmiterlimit } bind def
/d { setdash } bind def
/m { moveto } bind def
/l { lineto } bind def
/c { curveto } bind def
/h { closepath } bind def
/re { exch dup neg 3 1 roll 5 3 roll moveto 0 rlineto
      0 exch rlineto 0 rlineto closepath } bind def
/S { stroke } bind def
/f { fill } bind def
/f* { eofill } bind def
/n { newpath } bind def
/W { clip } bind def
/W* { eoclip } bind def
/BT { } bind def
/ET { } bind def
/pdfmark where { pop globaldict /?pdfmark /exec load put }
    { globaldict begin /?pdfmark /pop load def /pdfmark
    /cleartomark load def end } ifelse
/BDC { mark 3 1 roll /BDC pdfmark } bind def
/EMC { mark /EMC pdfmark } bind def
/cairo_store_point { /cairo_point_y exch def /cairo_point_x exch def } def
/Tj { show currentpoint cairo_store_point } bind def
/TJ {
  {
    dup
    type /stringtype eq
    { show } { -0.001 mul 0 cairo_font_matrix dtransform rmoveto } ifelse
  } forall
  currentpoint cairo_store_point
} bind def
/cairo_selectfont { cairo_font_matrix aload pop pop pop 0 0 6 array astore
    cairo_font exch selectfont cairo_point_x cairo_point_y moveto } bind def
/Tf { pop /cairo_font exch def /cairo_font_matrix where
      { pop cairo_selectfont } if } bind def
/Td { matrix translate cairo_font_matrix matrix concatmatrix dup
      /cairo_font_matrix exch def dup 4 get exch 5 get cairo_store_point
      /cairo_font where { pop cairo_selectfont } if } bind def
/Tm { 2 copy 8 2 roll 6 array astore /cairo_font_matrix exch def
      cairo_store_point /cairo_font where { pop cairo_selectfont } if } bind def
/g { setgray } bind def
/rg { setrgbcolor } bind def
/d1 { setcachedevice } bind def
%%EndProlog
%%BeginSetup
%%EndSetup
%%Page: 1 1
%%BeginPageSetup
%%PageBoundingBox: 0 0 410 409
%%EndPageSetup
q 0 0 410 409 rectclip q
1 0.384314 0.654902 rg
398.039 368.262 m 394.164 372.18 389.004 374.352 383.508 374.383 c 289.332
 374.902 l 270.977 374.902 l 270.977 317.422 l 271.297 310.715 l 271.816
 299.773 280.801 291.16 291.777 291.098 c 291.734 291.098 l 308.02 290.769
 l 307.961 280.512 l 307.941 277.203 312.09 275.703 314.191 278.262 c 324.375
 290.676 l 383.137 290.594 l 394.445 290.594 403.699 299.785 403.762 311.082
 c 403.996 353.664 l 404.027 359.164 401.91 364.348 398.039 368.262 c h
398.039 368.262 m f
0.988235 0.329412 0.47451 rg
295.668 291.019 m 295.234 292.531 294.961 294.117 294.883 295.754 c 294.566
 302.461 l 294.566 348.613 l 294.566 354.867 299.637 359.937 305.891 359.937
 c 312.918 359.937 l 403.207 359.441 l 402.27 362.734 400.516 365.758 398.039
 368.262 c 394.168 372.176 389.008 374.352 383.512 374.379 c 289.332 374.898
 l 270.98 374.898 l 270.98 317.422 l 271.297 310.715 l 271.82 299.773 280.801
 291.156 291.777 291.098 c 291.738 291.098 l h
295.668 291.019 m f
0.764706 0.854902 0.25098 rg
272.066 363.434 m 261.258 363.434 252.461 372.227 252.461 383.035 c 252.461
 393.848 261.258 402.641 272.066 402.641 c 282.875 402.641 291.672 393.848
 291.672 383.035 c 291.672 372.227 282.875 363.434 272.066 363.434 c h
272.066 363.434 m f
244.859 323.531 m 244.859 323.691 l 244.859 338.687 257.133 351.281 272.129
 351.027 c 286.699 350.777 298.473 338.852 298.473 324.223 c 298.473 323.531
 l 298.473 319.715 295.379 316.621 291.562 316.621 c 251.77 316.621 l 247.953
 316.621 244.859 319.715 244.859 323.531 c h
244.859 323.531 m f
0.192157 0.823529 0.968627 rg
138.086 301.418 m 105.012 323.617 l 26.09 323.172 l 20.594 323.141 15.434
 320.969 11.559 317.051 c 7.688 313.137 5.57 307.953 5.602 302.457 c 5.836
 259.871 l 5.898 248.574 15.137 239.387 26.438 239.387 c 74.02 239.469 l
 84.203 227.055 l 86.305 224.496 90.453 225.996 90.434 229.305 c 90.375 
239.559 l 117.816 239.891 l 129.195 239.953 138.402 249.246 138.34 260.609
 c h
138.086 301.418 m f
0.0745098 0.67451 0.909804 rg
30.773 248.207 m 30.539 290.789 l 30.508 296.285 32.625 301.469 36.496 
305.387 c 40.371 309.301 45.531 311.473 51.027 311.504 c 122.461 311.906
 l 105.012 323.617 l 26.09 323.172 l 20.594 323.141 15.434 320.969 11.559
 317.051 c 7.688 313.137 5.57 307.953 5.602 302.457 c 5.836 259.871 l 5.898
 248.574 15.141 239.387 26.438 239.387 c 32.816 239.394 l 31.523 242.066
 30.793 245.055 30.773 248.207 c h
30.773 248.207 m f
83.613 227.773 m 84.203 227.055 l 85.945 224.93 89.09 225.605 90.105 227.785
 c h
83.613 227.773 m f
0.972549 0.807843 0.160784 rg
100.832 304.437 m 100.832 307.687 l 100.832 322.684 113.105 335.277 128.102
 335.023 c 142.668 334.773 154.441 322.844 154.441 308.219 c 154.441 304.437
 l 154.441 302.328 152.734 300.617 150.625 300.617 c 104.648 300.617 l 102.539
 300.621 100.832 302.328 100.832 304.437 c h
100.832 304.437 m f
128.035 347.43 m 117.227 347.43 108.434 356.223 108.434 367.031 c 108.434
 377.844 117.227 386.637 128.035 386.637 c 138.844 386.637 147.641 377.844
 147.641 367.031 c 147.641 356.223 138.844 347.43 128.035 347.43 c h
128.035 347.43 m f
0.678431 0.737255 0.0823529 rg
274.094 383.035 m 274.094 389.852 277.59 395.863 282.883 399.375 c 279.777
 401.437 276.062 402.641 272.066 402.641 c 261.258 402.641 252.461 393.848
 252.461 383.035 c 252.461 372.227 261.258 363.434 272.066 363.434 c 276.062
 363.434 279.777 364.637 282.883 366.695 c 277.59 370.211 274.094 376.223
 274.094 383.035 c h
274.094 383.035 m f
266.492 323.531 m 266.492 323.691 l 266.492 334.707 273.117 344.422 282.578
 348.703 c 279.375 350.137 275.844 350.965 272.129 351.027 c 257.133 351.281
 244.859 338.691 244.859 323.691 c 244.859 323.531 l 244.859 319.715 247.953
 316.625 251.77 316.625 c 273.398 316.625 l 269.582 316.621 266.492 319.715
 266.492 323.531 c h
266.492 323.531 m f
0.968627 0.639216 0.282353 rg
122.461 304.437 m 122.461 307.687 l 122.461 318.703 129.09 328.418 138.547
 332.699 c 135.344 334.133 131.812 334.961 128.098 335.023 c 113.102 335.277
 100.828 322.687 100.828 307.687 c 100.828 304.437 l 100.828 302.328 102.539
 300.621 104.648 300.621 c 126.277 300.621 l 124.168 300.621 122.461 302.328
 122.461 304.437 c h
122.461 304.437 m f
130.062 367.031 m 130.062 373.848 133.559 379.859 138.852 383.371 c 135.75
 385.434 132.031 386.637 128.035 386.637 c 117.227 386.637 108.434 377.844
 108.434 367.031 c 108.434 356.223 117.227 347.43 128.035 347.43 c 132.031
 347.43 135.75 348.633 138.852 350.691 c 133.559 354.207 130.062 360.219
 130.062 367.031 c h
130.062 367.031 m f
0.764706 0.854902 0.25098 rg
146.438 146.504 117.625 -105.137 re f
0.678431 0.737255 0.0823529 rg
146.438 146.504 32.406 -105.137 re f
0.192157 0.823529 0.968627 rg
220.438 66.742 m 215.793 64.273 210.543 62.969 205.254 62.969 c 186.617
 62.969 171.605 78.777 172.926 97.691 c 174.039 113.652 186.973 126.586 
202.938 127.699 c 221.848 129.023 237.66 114.012 237.66 95.375 c 237.66 
89.223 235.922 83.238 232.637 78.051 c 236.234 67.578 l 236.949 65.496 235.105
 63.441 232.961 63.922 c h
220.438 66.742 m f
0.0745098 0.67451 0.909804 rg
188.129 91.504 m 189.242 107.465 202.176 120.398 218.141 121.516 c 220.359
 121.668 222.531 121.59 224.645 121.316 c 218.66 125.801 211.09 128.269 
202.938 127.703 c 186.973 126.586 174.039 113.652 172.926 97.691 c 171.707
 80.219 184.43 65.406 201.066 63.25 c 192.602 69.594 187.324 79.965 188.129
 91.504 c h
188.129 91.504 m f
0.917647 0.231373 0.219608 rg
159.734 6.957 m 152.402 6.957 146.441 12.922 146.441 20.25 c 146.441 42.164
 l 264.066 42.164 l 264.066 20.25 l 264.066 12.922 258.102 6.957 250.77 
6.957 c h
159.734 6.957 m f
146.441 145.699 m 146.441 169.703 l 146.441 177.031 152.402 182.996 159.734
 182.996 c 250.773 182.996 l 258.102 182.996 264.066 177.031 264.066 169.703
 c 264.066 145.699 l h
146.441 145.699 m f
0.894118 0.00392157 0.211765 rg
178.848 20.25 m 178.848 42.164 l 146.441 42.164 l 146.441 20.25 l 146.441
 12.922 152.402 6.957 159.734 6.957 c 192.141 6.957 l 184.809 6.957 178.848
 12.922 178.848 20.25 c h
178.848 20.25 m f
192.141 182.996 m 159.734 182.996 l 152.402 182.996 146.438 177.031 146.438
 169.703 c 146.438 145.699 l 178.848 145.699 l 178.848 169.703 l 178.848
 177.031 184.809 182.996 192.141 182.996 c h
192.141 182.996 m f
194.051 158.187 m 216.457 158.187 l 219.77 158.187 222.457 160.875 222.457
 164.191 c 222.457 167.504 219.77 170.191 216.457 170.191 c 194.051 170.191
 l 190.734 170.191 188.047 167.504 188.047 164.191 c 188.047 160.875 190.734
 158.187 194.051 158.187 c h
194.051 158.187 m f
212.852 24.957 m 212.852 20.758 209.449 17.355 205.25 17.355 c 201.051 
17.355 197.648 20.758 197.648 24.957 c 197.648 29.156 201.051 32.559 205.25
 32.559 c 209.449 32.559 212.852 29.156 212.852 24.957 c h
212.852 24.957 m f
0 g
143.73 295.019 m 154.043 295.019 l 157.355 295.019 160.043 297.703 160.043
 301.019 c 160.043 308.223 l 160.043 326.09 145.508 340.629 127.637 340.629
 c 117.766 340.629 108.922 336.187 102.973 329.207 c 26.059 328.773 l 11.609
 328.695 -0.078 316.875 0 302.426 c 0.234 259.844 l 0.316 245.441 12.055
 233.781 26.414 233.785 c 26.559 233.785 l 71.375 233.863 l 85.445 216.715
 l 86.605 215.297 88.32 214.519 90.086 214.519 c 90.766 214.519 91.453 214.637
 92.121 214.875 c 94.512 215.738 96.098 218.012 96.086 220.555 c 96.008 
234.023 l 117.887 234.289 l 132.336 234.367 144.023 246.187 143.945 260.641
 c h
127.637 328.625 m 138.887 328.625 148.039 319.473 148.039 308.223 c 148.039
 307.019 l 107.23 307.019 l 107.23 308.223 l 107.23 319.473 116.387 328.625
 127.637 328.625 c h
117.781 246.289 m 89.902 245.953 l 86.605 245.914 83.957 243.219 83.973
 239.922 c 83.988 237.406 l 78.848 243.672 l 77.707 245.062 76.004 245.867
 74.207 245.867 c 74.199 245.867 l 26.516 245.785 l 26.438 245.785 l 18.645
 245.785 12.281 252.105 12.238 259.906 c 12 302.492 l 11.957 310.32 18.293
 316.727 26.125 316.769 c 96.496 317.164 l 95.676 314.32 95.23 311.324 95.23
 308.219 c 95.23 301.019 l 95.23 297.703 97.918 295.016 101.23 295.016 c
 131.727 295.016 l 131.941 260.566 l 131.984 252.738 125.648 246.332 117.781
 246.289 c h
117.781 246.289 m f
383.539 379.984 m 297.141 380.461 l 297.227 381.309 297.273 382.168 297.273
 383.035 c 297.273 396.934 285.965 408.242 272.066 408.242 c 258.168 408.242
 246.863 396.934 246.863 383.035 c 246.863 369.137 258.168 357.832 272.066
 357.832 c 280.547 357.832 288.055 362.043 292.625 368.48 c 383.473 367.98
 l 391.305 367.937 397.641 361.531 397.598 353.703 c 397.363 311.117 l 397.32
 303.316 390.957 296.996 383.137 296.996 c 383.059 296.996 l 324.195 297.078
 l 324.188 297.078 l 322.391 297.078 320.688 296.273 319.547 294.883 c 314.41
 288.621 l 314.422 291.133 l 314.441 294.414 311.82 297.098 308.543 297.164
 c 291.867 297.5 l 291.836 297.5 291.809 297.5 291.777 297.5 c 284.203 297.543
 278.047 303.543 277.691 311.023 c 298.07 311.023 l 301.387 311.023 304.074
 313.707 304.074 317.023 c 304.074 324.227 l 304.074 342.094 289.535 356.633
 271.664 356.633 c 253.797 356.633 239.258 342.094 239.258 324.227 c 239.258
 317.023 l 239.258 313.707 241.945 311.023 245.262 311.023 c 265.672 311.023
 l 266.031 296.969 277.516 285.602 291.664 285.5 c 302.387 285.285 l 302.312
 271.762 l 302.297 269.223 303.887 266.949 306.273 266.086 c 306.941 265.844
 307.629 265.73 308.312 265.73 c 310.074 265.73 311.789 266.508 312.953 
267.922 c 327.023 285.07 l 383.016 284.992 l 383.16 284.992 l 397.543 284.996
 409.281 296.652 409.363 311.051 c 409.598 353.637 l 409.68 368.086 397.988
 379.902 383.539 379.984 c h
272.066 369.832 m 264.785 369.832 258.863 375.758 258.863 383.035 c 258.863
 390.316 264.789 396.238 272.066 396.238 c 279.344 396.238 285.27 390.316
 285.27 383.035 c 285.27 375.758 279.348 369.832 272.066 369.832 c h
251.262 324.223 m 251.262 335.477 260.414 344.629 271.668 344.629 c 282.918
 344.629 292.07 335.477 292.07 324.223 c 292.07 323.023 l 251.262 323.023
 l h
251.262 324.223 m f
250.773 188.594 m 159.734 188.594 l 149.297 188.594 140.84 180.137 140.84
 169.699 c 140.84 130.102 l 140.84 126.785 143.527 124.098 146.84 124.098
 c 150.156 124.098 152.844 126.785 152.844 130.102 c 152.844 140.098 l 257.664
 140.098 l 257.664 47.766 l 152.84 47.766 l 152.84 91.051 l 152.84 94.363
 150.156 97.051 146.84 97.051 c 143.527 97.051 140.84 94.363 140.84 91.051
 c 140.84 20.25 l 140.84 9.812 149.297 1.355 159.73 1.355 c 250.77 1.355
 l 261.207 1.355 269.664 9.812 269.664 20.25 c 269.664 169.703 l 269.668
 180.137 261.207 188.594 250.773 188.594 c h
257.664 20.25 m 257.664 16.449 254.57 13.359 250.77 13.359 c 159.734 13.359
 l 155.934 13.359 152.84 16.449 152.84 20.25 c 152.84 35.762 l 257.664 35.762
 l h
257.664 152.102 m 152.84 152.102 l 152.84 169.703 l 152.84 173.5 155.934
 176.594 159.734 176.594 c 250.773 176.594 l 254.57 176.594 257.664 173.5
 257.664 169.703 c h
257.664 152.102 m f
120.883 90.367 m 114.734 94.074 108.773 98.227 103.16 102.715 c 100.57 
104.785 96.797 104.363 94.727 101.773 c 92.656 99.187 93.078 95.41 95.664
 93.34 c 101.688 88.523 108.086 84.066 114.684 80.09 c 115.652 79.504 116.723
 79.227 117.777 79.227 c 119.812 79.227 121.793 80.262 122.922 82.129 c 
124.633 84.969 123.719 88.656 120.883 90.367 c h
120.883 90.367 m f
46.16 192.152 m 44.484 199.117 43.254 206.273 42.508 213.426 c 42.164 216.723
 39.211 219.113 35.918 218.773 c 32.621 218.43 30.227 215.477 30.57 212.184
 c 31.371 204.504 32.691 196.82 34.492 189.34 c 35.156 186.59 37.613 184.742
 40.32 184.742 c 40.789 184.742 41.258 184.797 41.73 184.91 c 44.953 185.687
 46.938 188.93 46.16 192.152 c h
46.16 192.152 m f
320.156 114.102 m 315.043 109.055 309.547 104.305 303.824 99.977 c 301.18
 97.977 300.656 94.215 302.656 91.57 c 303.836 90.012 305.629 89.187 307.445
 89.187 c 308.707 89.187 309.977 89.582 311.059 90.402 c 317.203 95.043 
323.098 100.141 328.586 105.555 c 330.945 107.883 330.973 111.684 328.645
 114.039 c 326.316 116.402 322.52 116.426 320.156 114.102 c h
320.156 114.102 m f
354.824 150.277 m 351.961 151.949 348.289 150.992 346.613 148.129 c 342.992
 141.934 338.918 135.918 334.508 130.242 c 332.473 127.625 332.945 123.855
 335.559 121.82 c 336.656 120.969 337.953 120.559 339.238 120.559 c 341.027
 120.559 342.801 121.355 343.98 122.875 c 348.715 128.965 353.09 135.422
 356.977 142.07 c 358.648 144.93 357.684 148.605 354.824 150.277 c h
354.824 150.277 m f
52.598 171.551 m 51.398 174.641 47.926 176.176 44.832 174.977 c 41.742 
173.781 40.207 170.305 41.402 167.215 c 44.18 160.039 47.469 152.977 51.18
 146.219 c 52.27 144.23 54.328 143.105 56.445 143.105 c 57.422 143.105 58.41
 143.344 59.328 143.844 c 62.234 145.437 63.297 149.086 61.703 151.992 c
 58.246 158.289 55.184 164.867 52.598 171.551 c h
52.598 171.551 m f
73.309 133.797 m 71.348 136.469 67.59 137.043 64.922 135.082 c 62.25 133.117
 61.676 129.363 63.641 126.691 c 68.199 120.488 73.219 114.523 78.555 108.965
 c 79.734 107.738 81.309 107.121 82.887 107.121 c 84.379 107.121 85.879 
107.676 87.043 108.793 c 89.434 111.09 89.508 114.887 87.215 117.277 c 82.234
 122.461 77.559 128.019 73.309 133.797 c h
73.309 133.797 m f
374.375 246.637 m 374.527 246.637 374.684 246.641 374.84 246.656 c 378.145
 246.91 380.617 249.797 380.363 253.102 c 379.77 260.797 378.66 268.516 
377.062 276.035 c 376.375 279.277 373.188 281.348 369.945 280.66 c 366.703
 279.973 364.633 276.785 365.32 273.543 c 366.809 266.535 367.844 259.348
 368.395 252.176 c 368.641 249.027 371.27 246.637 374.375 246.637 c h
374.375 246.637 m f
374.887 236.605 m 371.574 236.605 368.887 233.918 368.887 230.605 c 368.887
 223.394 368.414 216.144 367.48 209.055 c 367.047 205.766 369.363 202.754
 372.648 202.32 c 372.914 202.285 373.176 202.269 373.438 202.269 c 376.402
 202.269 378.98 204.469 379.379 207.488 c 380.379 215.098 380.891 222.875
 380.891 230.602 c 380.891 233.918 378.203 236.605 374.887 236.605 c h
374.887 236.605 m f
370.613 192.117 m 367.414 192.984 364.117 191.086 363.258 187.887 c 361.387
 180.953 359.031 174.078 356.258 167.453 c 354.977 164.394 356.418 160.879
 359.473 159.602 c 360.23 159.285 361.016 159.133 361.789 159.133 c 364.137
 159.133 366.363 160.516 367.328 162.816 c 370.309 169.934 372.836 177.316
 374.844 184.762 c 375.707 187.961 373.812 191.254 370.613 192.117 c h
370.613 192.117 m f
128.035 341.828 m 141.934 341.828 153.242 353.137 153.242 367.035 c 153.242
 380.934 141.934 392.238 128.035 392.238 c 114.137 392.238 102.832 380.934
 102.832 367.035 c 102.832 353.137 114.137 341.828 128.035 341.828 c h
128.035 380.234 m 135.316 380.234 141.238 374.312 141.238 367.035 c 141.238
 359.754 135.316 353.832 128.035 353.832 c 120.758 353.832 114.832 359.754
 114.832 367.035 c 114.832 374.312 120.758 380.234 128.035 380.234 c h
128.035 380.234 m f
238.766 77.449 m 241.715 82.949 243.262 89.09 243.262 95.375 c 243.262 
116.332 226.207 133.383 205.254 133.383 c 184.297 133.383 167.242 116.332
 167.242 95.375 c 167.242 74.418 184.297 57.367 205.254 57.367 c 210.734
 57.367 216.184 58.562 221.141 60.844 c 235.941 57.516 l 236.379 57.418 
236.82 57.367 237.258 57.367 c 238.941 57.367 240.578 58.078 241.727 59.367
 c 243.18 60.984 243.641 63.262 242.934 65.32 c h
226.52 76.152 m 228.09 71.582 l 221.699 73.023 l 220.289 73.34 218.812 
73.137 217.539 72.453 c 213.789 70.434 209.539 69.371 205.254 69.371 c 190.914
 69.371 179.246 81.035 179.246 95.375 c 179.246 109.715 190.914 121.379 
205.254 121.379 c 219.59 121.379 231.258 109.715 231.258 95.375 c 231.258
 90.391 229.836 85.539 227.145 81.348 c 226.152 79.805 225.922 77.891 226.52
 76.152 c h
226.52 76.152 m f
194.051 158.187 m 216.457 158.187 l 219.77 158.187 222.457 160.875 222.457
 164.191 c 222.457 167.504 219.77 170.191 216.457 170.191 c 194.051 170.191
 l 190.734 170.191 188.047 167.504 188.047 164.191 c 188.047 160.875 190.734
 158.187 194.051 158.187 c h
194.051 158.187 m f
212.852 24.957 m 212.852 20.758 209.449 17.355 205.25 17.355 c 201.051 
17.355 197.648 20.758 197.648 24.957 c 197.648 29.156 201.051 32.559 205.25
 32.559 c 209.449 32.559 212.852 29.156 212.852 24.957 c h
212.852 24.957 m f
Q Q
showpage
%%Trailer
end restore
%%EOF
