%!PS-Adobe-3.0 EPSF-3.0
%%Creator: cairo 1.14.2 (http://cairographics.org)
%%CreationDate: Mon Feb 19 09:15:05 2018
%%Pages: 1
%%DocumentData: Clean7Bit
%%LanguageLevel: 2
%%BoundingBox: 0 61 410 349
%%EndComments
%%BeginProlog
save
50 dict begin
/q { gsave } bind def
/Q { grestore } bind def
/cm { 6 array astore concat } bind def
/w { setlinewidth } bind def
/J { setlinecap } bind def
/j { setlinejoin } bind def
/M { setmiterlimit } bind def
/d { setdash } bind def
/m { moveto } bind def
/l { lineto } bind def
/c { curveto } bind def
/h { closepath } bind def
/re { exch dup neg 3 1 roll 5 3 roll moveto 0 rlineto
      0 exch rlineto 0 rlineto closepath } bind def
/S { stroke } bind def
/f { fill } bind def
/f* { eofill } bind def
/n { newpath } bind def
/W { clip } bind def
/W* { eoclip } bind def
/BT { } bind def
/ET { } bind def
/pdfmark where { pop globaldict /?pdfmark /exec load put }
    { globaldict begin /?pdfmark /pop load def /pdfmark
    /cleartomark load def end } ifelse
/BDC { mark 3 1 roll /BDC pdfmark } bind def
/EMC { mark /EMC pdfmark } bind def
/cairo_store_point { /cairo_point_y exch def /cairo_point_x exch def } def
/Tj { show currentpoint cairo_store_point } bind def
/TJ {
  {
    dup
    type /stringtype eq
    { show } { -0.001 mul 0 cairo_font_matrix dtransform rmoveto } ifelse
  } forall
  currentpoint cairo_store_point
} bind def
/cairo_selectfont { cairo_font_matrix aload pop pop pop 0 0 6 array astore
    cairo_font exch selectfont cairo_point_x cairo_point_y moveto } bind def
/Tf { pop /cairo_font exch def /cairo_font_matrix where
      { pop cairo_selectfont } if } bind def
/Td { matrix translate cairo_font_matrix matrix concatmatrix dup
      /cairo_font_matrix exch def dup 4 get exch 5 get cairo_store_point
      /cairo_font where { pop cairo_selectfont } if } bind def
/Tm { 2 copy 8 2 roll 6 array astore /cairo_font_matrix exch def
      cairo_store_point /cairo_font where { pop cairo_selectfont } if } bind def
/g { setgray } bind def
/rg { setrgbcolor } bind def
/d1 { setcachedevice } bind def
%%EndProlog
%%BeginSetup
%%EndSetup
%%Page: 1 1
%%BeginPageSetup
%%PageBoundingBox: 0 61 410 349
%%EndPageSetup
q 0 61 410 288 rectclip q
0.407843 g
9.891 241.022 m 43.523 234.936 l 43.523 196.327 l 9.891 190.245 l 7.672
 189.846 5.617 191.444 5.617 193.569 c 5.617 237.698 l 5.617 239.823 7.672
 241.42 9.891 241.022 c h
9.891 241.022 m f
51.031 231.28 40.766 -32.094 re f
0.317647 0.301961 0.290196 rg
49.746 191.963 m 44.656 191.963 40.52 196.104 40.52 201.19 c 40.52 230.077
 l 40.52 235.163 44.656 239.303 49.746 239.303 c 54.832 239.303 58.973 235.163
 58.973 230.077 c 58.973 201.19 l 58.973 196.104 54.832 191.963 49.746 191.963
 c h
49.746 191.963 m f
290.668 213.627 62.156 -63.387 re f
0.407843 g
338.992 150.334 m 338.992 213.534 l 381.918 237.506 l 381.918 126.362 l
 h
338.992 150.334 m f
0.317647 0.301961 0.290196 rg
391.547 115.741 m 385.574 115.741 380.715 120.6 380.715 126.573 c 380.715
 237.295 l 380.715 243.268 385.574 248.127 391.547 248.127 c 397.52 248.127
 402.379 243.268 402.379 237.295 c 402.379 126.573 l 402.379 120.6 397.52
 115.741 391.547 115.741 c h
391.547 115.741 m f
0.407843 g
135.598 270.592 m 121.219 270.592 109.523 282.291 109.523 296.67 c 109.523
 311.049 121.219 322.745 135.598 322.745 c 149.977 322.745 161.672 311.049
 161.672 296.67 c 161.672 282.291 149.977 270.592 135.598 270.592 c h
135.598 270.592 m f
0.356863 0.34902 0.341176 rg
129.578 297.073 m 129.578 307.713 135.988 316.877 145.145 320.928 c 142.188
 322.096 138.969 322.745 135.598 322.745 c 121.219 322.745 109.523 311.049
 109.523 296.67 c 109.523 282.291 121.219 270.596 135.598 270.596 c 139.336
 270.596 142.891 271.393 146.105 272.815 c 136.441 276.631 129.578 286.061
 129.578 297.073 c h
129.578 297.073 m f
0.407843 g
254.344 251.338 m 229.348 251.338 209.012 271.674 209.012 296.67 c 209.012
 321.666 229.348 342.002 254.344 342.002 c 279.34 342.002 299.676 321.666
 299.676 296.67 c 299.676 271.674 279.34 251.338 254.344 251.338 c h
254.344 251.338 m f
0.356863 0.34902 0.341176 rg
251.234 309.104 m 251.234 321.479 256.219 332.702 264.281 340.893 c 261.082
 341.612 257.758 342.002 254.344 342.002 c 229.348 342.002 209.012 321.666
 209.012 296.67 c 209.012 271.674 229.348 251.338 254.344 251.338 c 266.969
 251.338 278.398 256.53 286.629 264.885 c 266.398 269.428 251.234 287.526
 251.234 309.104 c h
251.234 309.104 m f
1 g
254.344 283.631 m 247.156 283.631 241.309 289.479 241.309 296.67 c 241.309
 303.862 247.156 309.709 254.344 309.709 c 261.535 309.709 267.383 303.862
 267.383 296.67 c 267.383 289.479 261.535 283.631 254.344 283.631 c h
254.344 283.631 m f
0.866667 0.843137 0.815686 rg
254.344 309.705 m 250.141 309.705 246.41 307.702 244.023 304.604 c 245.137
 304.913 246.309 305.096 247.523 305.096 c 254.715 305.096 260.562 299.245
 260.562 292.057 c 260.562 289.069 259.543 286.323 257.848 284.123 c 263.336
 285.659 267.383 290.694 267.383 296.67 c 267.383 303.858 261.535 309.705
 254.344 309.705 c h
254.344 309.705 m f
0.407843 g
123.93 111.729 m 105.531 111.729 l 93.555 111.729 83.848 121.436 83.848
 133.413 c 83.848 230.452 l 83.848 242.432 93.555 252.139 105.531 252.139
 c 291.418 252.139 l 298.641 252.139 304.492 246.288 304.492 239.065 c 304.492
 124.803 l 304.492 117.58 298.641 111.729 291.418 111.729 c 161.328 111.729
 l 147.832 78.338 l 146.125 74.12 140.176 74.049 138.371 78.233 c h
123.93 111.729 m f
0.329412 0.317647 0.317647 rg
181.734 133.416 m 181.734 230.452 l 181.734 242.432 191.441 252.139 203.418
 252.139 c 105.531 252.139 l 93.555 252.139 83.844 242.428 83.844 230.452
 c 83.844 133.416 l 83.844 121.44 93.555 111.729 105.531 111.729 c 123.926
 111.729 l 138.371 78.233 l 140.172 74.053 146.125 74.12 147.832 78.338 
c 161.328 111.729 l 203.418 111.729 l 191.441 111.729 181.734 121.44 181.734
 133.416 c h
181.734 133.416 m f
0.909804 0.882353 0.839216 rg
114.102 137.405 m 110.25 137.405 107.113 140.538 107.113 144.393 c 107.113
 221.881 l 107.113 225.737 110.246 228.873 114.102 228.873 c 275.035 228.873
 l 278.891 228.873 282.027 225.737 282.027 221.881 c 282.027 144.393 l 282.027
 140.538 278.891 137.405 275.035 137.405 c h
114.102 137.405 m f
0.886275 0.8 0.686275 rg
275.035 228.87 m 114.102 228.87 l 110.25 228.87 107.113 225.737 107.113
 221.881 c 107.113 220.002 l 261.957 220.002 l 265.812 220.002 268.949 216.87
 268.949 213.014 c 268.949 137.401 l 275.035 137.401 l 278.891 137.401 282.027
 140.538 282.027 144.393 c 282.027 221.881 l 282.027 225.737 278.891 228.87
 275.035 228.87 c h
275.035 228.87 m f
0 g
393.152 253.745 m 385.469 253.745 379.02 248.444 377.223 241.311 c 337.703
 219.241 l 310.109 219.241 l 310.109 239.065 l 310.109 249.373 301.727 257.756
 291.418 257.756 c 287.18 257.756 l 298.25 267.108 305.293 281.077 305.293
 296.67 c 305.293 324.666 282.594 347.459 254.629 347.612 c 254.602 347.612
 254.57 347.612 254.543 347.612 c 254.477 347.612 254.41 347.62 254.344 
347.62 c 248.906 347.62 243.668 346.752 238.754 345.17 c 135.023 328.346
 l 117.812 328.038 103.902 313.952 103.902 296.67 c 103.902 279.385 117.812
 265.299 135.023 264.991 c 179.641 257.756 l 105.531 257.756 l 92.695 257.756
 81.906 248.85 79.004 236.893 c 62.914 236.893 l 60.441 241.655 55.473 244.916
 49.746 244.916 c 45.867 244.916 42.344 243.409 39.695 240.967 c 10.121 
246.647 l 7.617 247.131 5.055 246.471 3.09 244.85 c 1.125 243.225 0 240.834
 0 238.288 c 0 192.979 l 0 190.432 1.125 188.038 3.09 186.416 c 4.633 185.139
 6.543 184.463 8.504 184.463 c 9.043 184.463 9.582 184.514 10.121 184.616
 c 39.699 190.295 l 42.344 187.854 45.867 186.346 49.746 186.346 c 55.141
 186.346 59.859 189.252 62.461 193.569 c 78.23 193.569 l 78.23 133.416 l
 78.23 118.362 90.477 106.112 105.531 106.112 c 120.234 106.112 l 137.695
 65.62 l 138.645 63.409 140.82 61.983 143.219 61.983 c 143.289 61.983 l 
145.715 62.01 147.891 63.495 148.797 65.745 c 165.117 106.112 l 291.418 
106.112 l 301.727 106.112 310.109 114.498 310.109 124.803 c 310.109 144.627
 l 337.703 144.627 l 377.223 122.557 l 379.023 115.424 385.469 110.123 393.152
 110.123 c 402.223 110.123 409.602 117.502 409.602 126.573 c 409.602 237.295
 l 409.602 246.366 402.223 253.745 393.152 253.745 c h
293.258 296.67 m 293.258 275.354 276.027 257.995 254.766 257.768 c 241.652
 259.893 l 226.41 265.17 215.43 279.659 215.43 296.67 c 215.43 313.686 226.41
 328.17 241.652 333.448 c 254.766 335.573 l 276.027 335.346 293.258 317.987
 293.258 296.67 c h
157.27 319.764 m 215.117 329.143 l 207.801 320.323 203.395 309.002 203.395
 296.67 c 203.395 284.338 207.801 273.018 215.117 264.194 c 157.27 273.577
 l 163.43 279.362 167.289 287.569 167.289 296.67 c 167.289 305.768 163.43
 313.979 157.27 319.764 c h
115.941 296.67 m 115.941 307.502 124.75 316.319 135.582 316.327 c 135.59
 316.327 l 135.594 316.327 135.598 316.327 135.598 316.327 c 146.438 316.327
 155.254 307.51 155.254 296.67 c 155.254 285.83 146.438 277.014 135.598 
277.014 c 124.758 277.014 115.941 285.83 115.941 296.67 c h
12.035 234.026 m 34.902 229.635 l 34.902 201.631 l 12.035 197.241 l h
49.746 198.381 m 48.195 198.381 46.938 199.643 46.938 201.19 c 46.938 230.077
 l 46.938 231.623 48.199 232.881 49.746 232.881 c 51.293 232.881 52.555 
231.623 52.555 230.077 c 52.555 201.19 l 52.555 199.643 51.293 198.381 49.746
 198.381 c h
64.59 205.604 m 64.59 224.862 l 78.23 224.862 l 78.23 205.604 l h
298.074 124.803 m 298.074 121.131 295.09 118.147 291.418 118.147 c 161.059
 118.147 l 158.605 118.147 156.398 116.659 155.48 114.385 c 143.039 83.612
 l 129.719 114.51 l 128.766 116.717 126.594 118.147 124.191 118.147 c 105.531
 118.147 l 97.113 118.147 90.266 124.995 90.266 133.413 c 90.266 230.452
 l 90.266 238.873 97.113 245.721 105.531 245.721 c 291.418 245.721 l 254.352
 245.721 l 291.418 245.721 l 295.09 245.721 298.074 242.737 298.074 239.065
 c h
310.109 207.209 m 333.375 207.209 l 333.375 156.659 l 310.109 156.659 l
 h
375.5 137.299 m 345.41 154.104 l 345.41 209.764 l 375.5 226.569 l h
397.566 126.573 m 397.566 124.139 395.586 122.159 393.152 122.159 c 390.719
 122.159 388.738 124.139 388.738 126.573 c 388.738 237.295 l 388.738 239.729
 390.719 241.709 393.152 241.709 c 395.586 241.709 397.566 239.729 397.566
 237.295 c h
397.566 126.573 m f
237.898 296.67 m 237.898 287.6 245.273 280.221 254.344 280.221 c 263.414
 280.221 270.793 287.6 270.793 296.67 c 270.793 305.741 263.414 313.12 254.344
 313.12 c 245.273 313.12 237.898 305.741 237.898 296.67 c h
258.758 296.67 m 258.758 294.237 256.777 292.256 254.344 292.256 c 251.91
 292.256 249.934 294.237 249.934 296.67 c 249.934 299.104 251.91 301.08 
254.344 301.08 c 256.777 301.08 258.758 299.104 258.758 296.67 c h
258.758 296.67 m f
261.164 324.752 m 261.164 320.987 258.113 317.932 254.344 317.932 c 250.578
 317.932 247.523 320.987 247.523 324.752 c 247.523 328.518 250.578 331.573
 254.344 331.573 c 258.113 331.573 261.164 328.518 261.164 324.752 c h
261.164 324.752 m f
281.023 316.53 m 281.023 312.76 277.969 309.709 274.203 309.709 c 270.438
 309.709 267.383 312.76 267.383 316.53 c 267.383 320.295 270.438 323.346
 274.203 323.346 c 277.969 323.346 281.023 320.295 281.023 316.53 c h
281.023 316.53 m f
289.246 296.67 m 289.246 292.905 286.195 289.85 282.426 289.85 c 278.66
 289.85 275.605 292.905 275.605 296.67 c 275.605 300.436 278.66 303.491 
282.426 303.491 c 286.195 303.491 289.246 300.436 289.246 296.67 c h
289.246 296.67 m f
281.023 276.811 m 281.023 273.045 277.969 269.991 274.203 269.991 c 270.438
 269.991 267.383 273.045 267.383 276.811 c 267.383 280.58 270.438 283.631
 274.203 283.631 c 277.969 283.631 281.023 280.58 281.023 276.811 c h
281.023 276.811 m f
261.164 268.588 m 261.164 264.823 258.113 261.768 254.344 261.768 c 250.578
 261.768 247.523 264.823 247.523 268.588 c 247.523 272.354 250.578 275.409
 254.344 275.409 c 258.113 275.409 261.164 272.354 261.164 268.588 c h
261.164 268.588 m f
241.309 276.811 m 241.309 273.045 238.254 269.991 234.488 269.991 c 230.719
 269.991 227.668 273.045 227.668 276.811 c 227.668 280.58 230.719 283.631
 234.488 283.631 c 238.254 283.631 241.309 280.58 241.309 276.811 c h
241.309 276.811 m f
233.082 296.67 m 233.082 292.905 230.031 289.85 226.262 289.85 c 222.496
 289.85 219.441 292.905 219.441 296.67 c 219.441 300.436 222.496 303.491
 226.262 303.491 c 230.031 303.491 233.082 300.436 233.082 296.67 c h
233.082 296.67 m f
241.309 316.53 m 241.309 312.76 238.254 309.709 234.488 309.709 c 230.719
 309.709 227.668 312.76 227.668 316.53 c 227.668 320.295 230.719 323.346
 234.488 323.346 c 238.254 323.346 241.309 320.295 241.309 316.53 c h
241.309 316.53 m f
143.219 297.073 m 143.219 292.639 139.629 289.049 135.195 289.049 c 130.766
 289.049 127.172 292.639 127.172 297.073 c 127.172 301.502 130.766 305.096
 135.195 305.096 c 139.629 305.096 143.219 301.502 143.219 297.073 c h
143.219 297.073 m f
275.035 234.487 m 114.102 234.487 l 107.141 234.487 101.496 228.842 101.496
 221.881 c 101.496 144.393 l 101.496 137.432 107.141 131.788 114.102 131.788
 c 206.465 131.788 l 209.789 131.788 212.484 134.483 212.484 137.803 c 212.484
 141.127 209.789 143.823 206.465 143.823 c 114.102 143.823 l 113.789 143.823
 113.531 144.08 113.531 144.393 c 113.531 221.881 l 113.531 222.198 113.789
 222.452 114.102 222.452 c 275.035 222.452 l 275.352 222.452 275.605 222.198
 275.605 221.881 c 275.605 144.393 l 275.605 144.08 275.352 143.823 275.035
 143.823 c 245.621 143.823 l 242.301 143.823 239.605 141.127 239.605 137.803
 c 239.605 134.483 242.301 131.788 245.621 131.788 c 275.035 131.788 l 282
 131.788 287.641 137.432 287.641 144.393 c 287.641 221.881 l 287.641 228.842
 282 234.487 275.035 234.487 c h
275.035 234.487 m f
133.191 200.788 m 155.254 200.788 l 158.578 200.788 161.273 203.483 161.273
 206.807 c 161.273 210.131 158.578 212.823 155.254 212.823 c 133.191 212.823
 l 129.867 212.823 127.172 210.131 127.172 206.807 c 127.172 203.483 129.867
 200.788 133.191 200.788 c h
133.191 200.788 m f
194.57 189.557 m 133.191 189.557 l 129.867 189.557 127.172 186.862 127.172
 183.538 c 127.172 180.213 129.867 177.522 133.191 177.522 c 194.57 177.522
 l 197.895 177.522 200.59 180.213 200.59 183.538 c 200.59 186.862 197.895
 189.557 194.57 189.557 c h
194.57 189.557 m f
257.152 189.557 m 213.426 189.557 l 210.102 189.557 207.406 186.862 207.406
 183.538 c 207.406 180.213 210.102 177.522 213.426 177.522 c 257.152 177.522
 l 260.477 177.522 263.172 180.213 263.172 183.538 c 263.172 186.862 260.477
 189.557 257.152 189.557 c h
257.152 189.557 m f
175.312 200.788 m 256.352 200.788 l 259.676 200.788 262.367 203.483 262.367
 206.807 c 262.367 210.131 259.676 212.823 256.352 212.823 c 175.312 212.823
 l 171.988 212.823 169.297 210.131 169.297 206.807 c 169.297 203.483 171.988
 200.788 175.312 200.788 c h
175.312 200.788 m f
182.535 166.288 m 131.586 166.288 l 128.262 166.288 125.566 163.596 125.566
 160.272 c 125.566 156.948 128.262 154.252 131.586 154.252 c 182.535 154.252
 l 185.859 154.252 188.551 156.948 188.551 160.272 c 188.551 163.596 185.859
 166.288 182.535 166.288 c h
182.535 166.288 m f
257.152 166.288 m 206.203 166.288 l 202.879 166.288 200.188 163.596 200.188
 160.272 c 200.188 156.948 202.879 154.252 206.203 154.252 c 257.152 154.252
 l 260.477 154.252 263.172 156.948 263.172 160.272 c 263.172 163.596 260.477
 166.288 257.152 166.288 c h
257.152 166.288 m f
Q Q
showpage
%%Trailer
end restore
%%EOF
