%!PS-Adobe-3.0 EPSF-3.0
%%Creator: cairo 1.14.2 (http://cairographics.org)
%%CreationDate: Mon Feb 19 09:15:05 2018
%%Pages: 1
%%DocumentData: Clean7Bit
%%LanguageLevel: 2
%%BoundingBox: 0 5 410 405
%%EndComments
%%BeginProlog
save
50 dict begin
/q { gsave } bind def
/Q { grestore } bind def
/cm { 6 array astore concat } bind def
/w { setlinewidth } bind def
/J { setlinecap } bind def
/j { setlinejoin } bind def
/M { setmiterlimit } bind def
/d { setdash } bind def
/m { moveto } bind def
/l { lineto } bind def
/c { curveto } bind def
/h { closepath } bind def
/re { exch dup neg 3 1 roll 5 3 roll moveto 0 rlineto
      0 exch rlineto 0 rlineto closepath } bind def
/S { stroke } bind def
/f { fill } bind def
/f* { eofill } bind def
/n { newpath } bind def
/W { clip } bind def
/W* { eoclip } bind def
/BT { } bind def
/ET { } bind def
/pdfmark where { pop globaldict /?pdfmark /exec load put }
    { globaldict begin /?pdfmark /pop load def /pdfmark
    /cleartomark load def end } ifelse
/BDC { mark 3 1 roll /BDC pdfmark } bind def
/EMC { mark /EMC pdfmark } bind def
/cairo_store_point { /cairo_point_y exch def /cairo_point_x exch def } def
/Tj { show currentpoint cairo_store_point } bind def
/TJ {
  {
    dup
    type /stringtype eq
    { show } { -0.001 mul 0 cairo_font_matrix dtransform rmoveto } ifelse
  } forall
  currentpoint cairo_store_point
} bind def
/cairo_selectfont { cairo_font_matrix aload pop pop pop 0 0 6 array astore
    cairo_font exch selectfont cairo_point_x cairo_point_y moveto } bind def
/Tf { pop /cairo_font exch def /cairo_font_matrix where
      { pop cairo_selectfont } if } bind def
/Td { matrix translate cairo_font_matrix matrix concatmatrix dup
      /cairo_font_matrix exch def dup 4 get exch 5 get cairo_store_point
      /cairo_font where { pop cairo_selectfont } if } bind def
/Tm { 2 copy 8 2 roll 6 array astore /cairo_font_matrix exch def
      cairo_store_point /cairo_font where { pop cairo_selectfont } if } bind def
/g { setgray } bind def
/rg { setrgbcolor } bind def
/d1 { setcachedevice } bind def
%%EndProlog
%%BeginSetup
%%EndSetup
%%Page: 1 1
%%BeginPageSetup
%%PageBoundingBox: 0 5 410 405
%%EndPageSetup
q 0 5 410 400 rectclip q
0.705882 0.792157 0.819608 rg
147.199 221.6 m 147.199 260.401 l 147.199 298.557 178.242 329.6 216.398
 329.6 c 254.559 329.6 285.602 298.557 285.602 260.401 c 285.602 221.6 l
 h
147.199 221.6 m f
0.329412 0.317647 0.317647 rg
216.398 35.881 m 204 33.229 l 204 138.401 l 228.801 138.401 l 228.801 33.229
 l h
216.398 35.881 m f
0.278431 0.25098 0.25098 rg
215.602 138.401 m 204 138.401 l 204 33.229 l 215.602 35.709 l h
215.602 138.401 m f
228 35.881 m 222.199 34.639 l 228.801 33.229 l 228.801 35.709 l h
228 35.881 m f
0.407843 g
148.977 11.202 m 141.379 11.202 135.199 17.381 135.199 24.975 c 135.199
 31.795 140.086 37.514 146.82 38.58 c 216.398 49.604 l 285.98 38.58 l 292.711
 37.514 297.602 31.795 297.602 24.975 c 297.602 17.381 291.422 11.202 283.824
 11.202 c h
148.977 11.202 m f
0.317647 0.298039 0.298039 rg
209.613 24.264 m 202.016 24.264 195.836 30.444 195.836 38.041 c 195.836
 41.381 197.016 44.455 199.004 46.85 c 146.82 38.58 l 140.086 37.514 135.199
 31.795 135.199 24.975 c 135.199 17.381 141.379 11.202 148.977 11.202 c 
283.824 11.202 l 291.18 11.202 297.191 16.998 297.562 24.264 c h
209.613 24.264 m f
0.407843 g
216.398 123.998 m 178.242 123.998 147.199 155.041 147.199 193.202 c 147.199
 199.998 l 285.602 199.998 l 285.602 193.202 l 285.602 155.041 254.559 123.998
 216.398 123.998 c h
216.398 123.998 m f
0.568627 0.690196 0.717647 rg
237.777 326.217 m 231.039 328.409 223.855 329.6 216.398 329.6 c 178.242
 329.6 147.199 298.557 147.199 260.401 c 147.199 221.6 l 189.953 221.6 l
 189.953 260.401 l 189.953 291.1 210.051 317.19 237.777 326.217 c h
237.777 326.217 m f
0.329412 0.317647 0.317647 rg
189.953 193.202 m 189.953 199.998 l 147.199 199.998 l 147.199 193.202 l
 147.199 155.041 178.242 123.998 216.398 123.998 c 223.859 123.998 231.039
 125.19 237.777 127.381 c 210.051 136.409 189.953 162.498 189.953 193.202
 c h
189.953 193.202 m f
216.398 155.998 m 210.004 155.998 204.801 161.205 204.801 167.6 c 204.801
 173.995 210.004 179.202 216.398 179.202 c 222.797 179.202 228 173.995 228
 167.6 c 228 161.205 222.797 155.998 216.398 155.998 c h
216.398 155.998 m f
143.602 199.202 m 137.203 199.202 132 204.405 132 210.799 c 132 217.198
 137.203 222.401 143.602 222.401 c 289.199 222.401 l 295.598 222.401 300.801
 217.198 300.801 210.799 c 300.801 204.405 295.598 199.202 289.199 199.202
 c h
143.602 199.202 m f
0.258824 0.231373 0.231373 rg
192.488 210.799 m 192.488 217.198 197.691 222.401 204.09 222.401 c 143.602
 222.401 l 137.203 222.401 132 217.198 132 210.799 c 132 204.405 137.203
 199.202 143.602 199.202 c 204.09 199.202 l 197.691 199.202 192.488 204.405
 192.488 210.799 c h
192.488 210.799 m f
1 0.384314 0.654902 rg
324.133 91.202 m 309.703 91.202 l 296.859 91.202 285.992 101.248 285.609
 114.084 c 285.215 127.424 295.949 138.401 309.199 138.401 c 379.898 138.401
 l 392.738 138.401 403.609 128.35 403.988 115.514 c 404.387 102.174 393.652
 91.202 380.398 91.202 c 336.652 91.202 l 332 81.307 l 331.227 79.659 328.859
 79.717 328.168 81.401 c h
324.133 91.202 m f
1 0.811765 0.34902 rg
267.348 351.202 m 244.902 351.202 l 232.062 351.202 221.191 361.248 220.812
 374.088 c 220.414 387.424 231.148 398.401 244.398 398.401 c 379.898 398.401
 l 392.738 398.401 403.609 388.35 403.988 375.514 c 404.387 362.178 393.652
 351.202 380.398 351.202 c 279.867 351.202 l 275.832 341.401 l 275.141 339.713
 272.777 339.659 272 341.307 c h
267.348 351.202 m f
0.764706 0.854902 0.25098 rg
64.934 259.998 m 29.703 259.998 l 16.859 259.998 5.992 270.049 5.609 282.885
 c 5.215 296.225 15.949 307.202 29.199 307.202 c 99.898 307.202 l 112.738
 307.202 123.609 297.151 123.988 284.315 c 124.387 270.975 113.652 259.998
 100.398 259.998 c 77.453 259.998 l 72.801 250.108 l 72.023 248.459 69.66
 248.514 68.965 250.202 c h
64.934 259.998 m f
0.988235 0.329412 0.47451 rg
304.102 97.233 m 303.707 110.573 314.441 121.549 327.691 121.549 c 398.391
 121.549 l 400.008 121.549 401.594 121.389 403.133 121.084 c 400.293 131.139
 390.809 138.401 379.898 138.401 c 309.199 138.401 l 295.949 138.401 285.215
 127.424 285.609 114.084 c 285.945 102.866 294.289 93.776 304.961 91.666
 c 304.457 93.444 304.16 95.307 304.102 97.233 c h
304.102 97.233 m f
1 0.709804 0.360784 rg
239.301 357.233 m 238.906 370.573 249.641 381.549 262.891 381.549 c 398.391
 381.549 l 400.008 381.549 401.594 381.389 403.133 381.084 c 400.293 391.139
 390.809 398.401 379.898 398.401 c 244.398 398.401 l 231.148 398.401 220.414
 387.424 220.809 374.084 c 221.145 362.866 229.488 353.776 240.16 351.666
 c 239.656 353.444 239.359 355.307 239.301 357.233 c h
239.301 357.233 m f
0.678431 0.737255 0.0823529 rg
24.102 266.034 m 23.707 279.37 34.441 290.35 47.691 290.35 c 118.391 290.35
 l 120.008 290.35 121.594 290.19 123.133 289.885 c 120.293 299.94 110.809
 307.202 99.898 307.202 c 29.199 307.202 l 15.949 307.202 5.215 296.225 
5.609 282.885 c 5.945 271.666 14.289 262.577 24.961 260.463 c 24.457 262.241
 24.16 264.104 24.102 266.034 c h
24.102 266.034 m f
0 g
244.398 345.6 m 263.793 345.6 l 268.57 335.444 l 269.562 333.338 271.68
 331.998 274 331.998 c 274.047 331.998 274.098 331.998 274.148 332.002 c
 276.527 332.061 278.645 333.518 279.547 335.713 c 283.617 345.6 l 380.398
 345.6 l 396.5 345.6 409.602 358.698 409.602 374.799 c 409.602 390.901 396.5
 403.998 380.398 403.998 c 244.398 403.998 l 228.301 403.998 215.199 390.901
 215.199 374.799 c 215.199 358.698 228.301 345.6 244.398 345.6 c h
244.398 391.998 m 380.398 391.998 l 389.883 391.998 397.602 384.284 397.602
 374.799 c 397.602 365.315 389.883 357.6 380.398 357.6 c 279.602 357.6 l
 277.168 357.6 274.977 356.131 274.051 353.885 c 273.633 352.87 l 273.027
 354.155 l 272.039 356.256 269.926 357.6 267.602 357.6 c 244.398 357.6 l
 234.914 357.6 227.199 365.315 227.199 374.799 c 227.199 384.284 234.914
 391.998 244.398 391.998 c h
244.398 391.998 m f
100.398 312.799 m 29.199 312.799 l 13.098 312.799 0 299.702 0 283.6 c 0
 267.498 13.098 254.401 29.199 254.401 c 61.184 254.401 l 65.254 244.514
 l 66.156 242.319 68.273 240.862 70.652 240.803 c 70.703 240.803 70.754 
240.799 70.801 240.799 c 73.121 240.799 75.238 242.139 76.23 244.245 c 81.008
 254.401 l 100.398 254.401 l 116.5 254.401 129.602 267.498 129.602 283.6
 c 129.602 299.702 116.5 312.799 100.398 312.799 c h
100.398 266.401 m 77.199 266.401 l 74.875 266.401 72.762 265.057 71.77 
262.955 c 71.168 261.67 l 70.75 262.686 l 69.824 264.932 67.633 266.401 
65.199 266.401 c 29.199 266.401 l 19.715 266.401 12 274.116 12 283.6 c 12
 293.084 19.715 300.799 29.199 300.799 c 100.398 300.799 l 109.883 300.799
 117.602 293.084 117.602 283.6 c 117.602 274.116 109.883 266.401 100.398
 266.401 c h
100.398 266.401 m f
380.398 143.998 m 309.199 143.998 l 293.098 143.998 280 130.901 280 114.799
 c 280 98.698 293.098 85.6 309.199 85.6 c 320.383 85.6 l 324.453 75.717 
l 325.359 73.518 327.477 72.061 329.852 72.002 c 329.902 72.002 329.953 
72.002 330 72.002 c 332.32 72.002 334.438 73.338 335.43 75.448 c 340.207
 85.6 l 380.398 85.6 l 396.5 85.6 409.602 98.698 409.602 114.799 c 409.602
 130.901 396.5 143.998 380.398 143.998 c h
380.398 97.6 m 336.398 97.6 l 334.074 97.6 331.961 96.256 330.973 94.155
 c 330.367 92.87 l 329.949 93.885 l 329.023 96.131 326.832 97.6 324.398 
97.6 c 309.199 97.6 l 299.715 97.6 292 105.315 292 114.799 c 292 124.284
 299.715 131.998 309.199 131.998 c 380.398 131.998 l 389.883 131.998 397.602
 124.284 397.602 114.799 c 397.602 105.315 389.883 97.6 380.398 97.6 c h
380.398 97.6 m f
286.855 44.112 m 234.398 52.424 l 234.398 120.596 l 266.977 128.674 291.199
 158.159 291.199 193.202 c 291.199 193.725 l 299.742 194.721 306.398 201.995
 306.398 210.799 c 306.398 219.608 299.742 226.877 291.199 227.873 c 291.199
 260.401 l 291.199 301.643 257.645 335.202 216.398 335.202 c 175.156 335.202
 141.602 301.643 141.602 260.401 c 141.602 227.873 l 133.055 226.877 126.398
 219.608 126.398 210.799 c 126.398 201.995 133.055 194.721 141.602 193.725
 c 141.602 193.202 l 141.602 158.159 165.82 128.674 198.398 120.596 c 198.398
 52.424 l 145.945 44.112 l 136.473 42.612 129.602 34.565 129.602 24.975 
c 129.602 14.291 138.293 5.6 148.977 5.6 c 283.824 5.6 l 294.508 5.6 303.199
 14.291 303.199 24.975 c 303.199 34.565 296.328 42.612 286.855 44.112 c 
h
138.445 211.487 m 138.781 214.104 141.137 215.998 143.781 215.998 c 218.758
 215.998 l 222.16 215.998 224.871 218.889 224.609 222.288 c 224.602 222.373
 224.594 222.463 224.59 222.549 c 224.371 225.623 221.816 227.998 218.738
 227.998 c 153.602 227.998 l 153.602 259.6 l 153.602 294.174 181.207 322.862
 215.781 323.198 c 250.691 323.534 279.199 295.233 279.199 260.401 c 279.199
 227.998 l 255.945 227.998 l 252.773 227.998 250.199 225.483 250.082 222.315
 c 250.078 222.264 250.078 222.213 250.074 222.163 c 249.941 218.807 252.578
 215.998 255.938 215.998 c 289.02 215.998 l 291.66 215.998 294.02 214.104
 294.355 211.483 c 294.762 208.311 292.293 205.6 289.199 205.6 c 143.602
 205.6 l 140.508 205.6 138.035 208.315 138.445 211.487 c h
153.602 193.202 m 153.602 193.6 l 279.199 193.6 l 279.199 193.202 l 279.199
 158.573 251.027 130.401 216.398 130.401 c 181.773 130.401 153.602 158.573
 153.602 193.202 c h
222.398 118.401 m 222.398 54.327 l 217.34 55.127 l 216.719 55.225 216.082
 55.225 215.461 55.127 c 210.398 54.327 l 210.398 118.401 l h
283.824 17.6 m 148.977 17.6 l 144.91 17.6 141.602 20.909 141.602 24.975
 c 141.602 28.627 144.219 31.69 147.82 32.26 c 216.398 43.123 l 284.977 
32.26 l 288.586 31.69 291.199 28.627 291.199 24.975 c 291.199 20.909 287.891
 17.6 283.824 17.6 c h
283.824 17.6 m f
233.602 167.6 m 233.602 177.084 225.883 184.799 216.398 184.799 c 206.914
 184.799 199.199 177.084 199.199 167.6 c 199.199 158.116 206.914 150.401
 216.398 150.401 c 225.883 150.401 233.602 158.116 233.602 167.6 c h
211.199 167.6 m 211.199 170.467 213.531 172.799 216.398 172.799 c 219.266
 172.799 221.602 170.467 221.602 167.6 c 221.602 164.733 219.266 162.401
 216.398 162.401 c 213.531 162.401 211.199 164.733 211.199 167.6 c h
211.199 167.6 m f
Q Q
showpage
%%Trailer
end restore
%%EOF
