<?xml version="1.0" encoding="iso-8859-1"?>
<!-- Generator: Adobe Illustrator 19.0.0, SVG Export Plug-In . SVG Version: 6.00 Build 0)  -->
<svg version="1.1" id="Capa_1" xmlns="http://www.w3.org/2000/svg" xmlns:xlink="http://www.w3.org/1999/xlink" x="0px" y="0px"
	 viewBox="0 0 512 512" style="enable-background:new 0 0 512 512;" xml:space="preserve">
<polygon style="fill:#FFCF59;" points="279.628,109.509 232.741,108.735 214.207,147.5 297.794,147.5 "/>
<polygon style="fill:#FFB55C;" points="232.741,108.735 214.207,147.5 242.206,147.5 260.522,109.194 "/>
<path style="fill:#EA3B38;" d="M256.5,121c-15.164,0-27.5-12.336-27.5-27.5S241.336,66,256.5,66S284,78.336,284,93.5
	S271.664,121,256.5,121z"/>
<path style="fill:#E40136;" d="M256,96.199c0-11.202,6.737-20.855,16.368-25.137C267.881,67.879,262.408,66,256.5,66
	C241.336,66,229,78.336,229,93.5s12.336,27.5,27.5,27.5c3.961,0,7.726-0.848,11.132-2.363C260.601,113.651,256,105.455,256,96.199z"
	/>
<path style="fill:#686868;" d="M428.072,147H84.928C76.697,147,70,153.697,70,161.928V344h373v-45V195v-33.072
	C443,153.697,436.303,147,428.072,147z"/>
<path style="fill:#5B5752;" d="M166.928,147h-82C76.697,147,70,153.697,70,161.928V344h82V161.928
	C152,153.697,158.697,147,166.928,147z"/>
<path style="fill:#C3DA40;" d="M93,177.621v137.758c0,4.209,3.412,7.621,7.621,7.621h310.758c4.209,0,7.621-3.412,7.621-7.621
	v-16.992V272v-50.613V195v-17.379c0-4.209-3.412-7.621-7.621-7.621H100.621C96.412,170,93,173.412,93,177.621z"/>
<rect x="160" y="234" style="fill:#FAD393;" width="23" height="51"/>
<rect x="160" y="234" style="fill:#EDB769;" width="11.5" height="51"/>
<path style="fill:#31D2F7;" d="M140,323v-29.067C140,280.185,151.185,269,164.933,269h13.134C191.815,269,203,280.185,203,293.933
	V323H140z"/>
<path style="fill:#13ACE8;" d="M183.164,269.526c-1.646-0.343-3.351-0.526-5.097-0.526h-13.134C151.185,269,140,280.185,140,293.933
	V323h23.328v-29.067C163.328,281.932,171.853,271.885,183.164,269.526z"/>
<path style="fill:#FAD393;" d="M165.165,250c-11.67,0-21.165-9.495-21.165-21.165v-15.67c0-11.67,9.495-21.165,21.165-21.165h12.67
	c11.67,0,21.165,9.495,21.165,21.165v15.67c0,11.67-9.495,21.165-21.165,21.165H165.165z"/>
<path style="fill:#EDB769;" d="M166.314,228.835v-15.67c0-10.009,6.992-18.399,16.343-20.589c-1.552-0.364-3.161-0.576-4.822-0.576
	h-12.67c-11.67,0-21.165,9.495-21.165,21.165v15.67c0,11.67,9.495,21.165,21.165,21.165h12.67c1.661,0,3.27-0.212,4.822-0.576
	C173.306,247.234,166.314,238.844,166.314,228.835z"/>
<path style="fill:#FF62A7;" d="M256,323h155.379c4.209,0,7.621-3.412,7.621-7.621v-16.992V272v-26H256V323z"/>
<path style="fill:#31D2F7;" d="M411.379,170H256v77h163v-25.613V195v-17.379C419,173.412,415.588,170,411.379,170z"/>
<path style="fill:#C3DA40;" d="M360.491,215.946l-5.377-5.238v-0.001h-33.23l-5.376,5.244C310.465,221.845,307,230.063,307,238.5
	v8.5h63v-8.5C370,229.929,366.623,221.919,360.491,215.946z"/>
<path style="fill:#ADBC15;" d="M339.662,215.951l5.376-5.244h-23.154l-5.376,5.244C310.465,221.845,307,230.063,307,238.5v8.5
	h23.154v-8.5C330.154,230.063,333.619,221.845,339.662,215.951z"/>
<path style="fill:#FAD393;" d="M338.5,221c-9.649,0-17.5-7.851-17.5-17.5s7.851-17.5,17.5-17.5s17.5,7.851,17.5,17.5
	S348.149,221,338.5,221z"/>
<path style="fill:#EDB769;" d="M335,203.5c0-7.16,4.327-13.322,10.5-16.029c-2.146-0.941-4.511-1.471-7-1.471
	c-9.649,0-17.5,7.851-17.5,17.5s7.851,17.5,17.5,17.5c2.489,0,4.854-0.531,7-1.471C339.327,216.822,335,210.66,335,203.5z"/>
<path style="fill:#31D2F7;" d="M360.491,291.946l-5.377-5.238l0,0h-33.23l-5.376,5.244C310.465,297.845,307,306.063,307,314.5v8.5
	h63v-8.5C370,305.929,366.623,297.919,360.491,291.946z"/>
<path style="fill:#13ACE8;" d="M345.425,291.951l5.376-5.244h-28.918l-5.376,5.244C310.465,297.845,307,306.063,307,314.5v8.5
	h28.918v-8.5C335.918,306.063,339.383,297.845,345.425,291.951z"/>
<path style="fill:#FAD393;" d="M338.5,297c-9.649,0-17.5-7.851-17.5-17.5s7.851-17.5,17.5-17.5s17.5,7.851,17.5,17.5
	S348.149,297,338.5,297z"/>
<path style="fill:#FFCF59;" d="M424.5,223c-7.995,0-14.5-6.505-14.5-14.5v-1.146L398.423,194H490.5c7.995,0,14.5,6.505,14.5,14.5
	s-6.505,14.5-14.5,14.5H424.5z"/>
<path style="fill:#FFB55C;" d="M439.044,209.5c-7.995,0-14.5-6.505-14.5-14.5v-1h-26.121L410,207.354v1.146
	c0,7.995,6.505,14.5,14.5,14.5h66c7.658,0,13.932-5.972,14.449-13.5H439.044z"/>
<path style="fill:#FFCF59;" d="M424.5,301.208c-7.995,0-14.5-6.505-14.5-14.5v-1.146l-11.577-13.354H490.5
	c7.995,0,14.5,6.505,14.5,14.5s-6.505,14.5-14.5,14.5H424.5z"/>
<path style="fill:#FFB55C;" d="M439.044,287.708c-7.995,0-14.5-6.505-14.5-14.5v-1h-26.121L410,285.562v1.146
	c0,7.995,6.505,14.5,14.5,14.5h66c7.658,0,13.932-5.972,14.449-13.5H439.044z"/>
<path style="fill:#4F4B4B;" d="M198.955,464.639L210,442.383V401h93v41.383l11.045,22.256c2.366,4.768-1.102,10.361-6.425,10.361
	H205.38C200.058,475,196.59,469.407,198.955,464.639z"/>
<path style="fill:#443B3B;" d="M303,401h-55.801H210v23.573v17.81l-11.045,22.256c-2.366,4.768,1.102,10.361,6.425,10.361h37.199
	c-5.323,0-8.791-5.593-6.425-10.361l11.045-22.256v-6.05c0-6.495,5.265-11.761,11.761-11.761H303V401z"/>
<path style="fill:#514F4F;" d="M84.928,402C76.697,402,70,395.303,70,387.072V343h373v44.072c0,8.231-6.697,14.928-14.928,14.928
	H84.928z"/>
<path style="fill:#4F4B4B;" d="M152,387.072V343H70v44.072C70,395.303,76.697,402,84.928,402h82
	C158.697,402,152,395.303,152,387.072z"/>
<path style="fill:#FFCF59;" d="M169.853,37H39.5C21.767,37,7.305,51.276,7.005,68.938C6.695,87.12,21.964,102,40.147,102h90.631
	l7.581,20.215c0.742,1.978,3.54,1.978,4.282,0L150.222,102H170.5c17.733,0,32.195-14.276,32.495-31.939
	C203.305,51.88,188.036,37,169.853,37z"/>
<path style="fill:#FFB55C;" d="M35.332,94.589c0.301-17.662,14.762-31.938,32.495-31.938H198.18c1.391,0,2.762,0.097,4.113,0.266
	C199.125,48.14,185.584,37,169.853,37H39.5C21.767,37,7.305,51.276,7.005,68.938c-0.286,16.791,12.717,30.756,29.03,32.795
	C35.54,99.43,35.29,97.041,35.332,94.589z"/>
<circle cx="256.5" cy="370.5" r="14.5"/>
<path d="M133.478,129.133c1.098,2.927,3.896,4.867,7.022,4.867s5.925-1.939,7.022-4.867l7.55-20.133H170.5
	c21.78,0,39.5-17.72,39.5-39.5S192.28,30,170.5,30h-131C17.72,30,0,47.72,0,69.5S17.72,109,39.5,109h86.428L133.478,129.133z
	 M15,69.5C15,55.991,25.991,45,39.5,45h131c13.509,0,24.5,10.991,24.5,24.5S184.009,94,170.5,94h-20.625
	c-3.126,0-5.925,1.939-7.022,4.867l-2.353,6.273l-2.353-6.273C137.05,95.939,134.251,94,131.125,94H39.5
	C25.991,94,15,83.009,15,69.5z"/>
<path d="M490.5,264H450v-34h40.5c11.855,0,21.5-9.645,21.5-21.5s-9.645-21.5-21.5-21.5H450v-25.072
	c0-12.091-9.837-21.928-21.928-21.928H301.966l-14.743-30.836C289.632,104.46,291,99.138,291,93.5c0-19.023-15.477-34.5-34.5-34.5
	S222,74.477,222,93.5c0,5.231,1.176,10.191,3.268,14.637L210.034,140H84.928C72.837,140,63,149.837,63,161.928v225.144
	C63,399.163,72.837,409,84.928,409H203v31.741l-15.098,30.425c-1.154,2.325-1.023,5.081,0.344,7.287S192.025,482,194.62,482h123.759
	c2.595,0,5.006-1.342,6.374-3.547c1.368-2.205,1.498-4.962,0.344-7.287L310,440.741V409h118.072
	c12.091,0,21.928-9.837,21.928-21.928V307h40.5c11.855,0,21.5-9.645,21.5-21.5C512,273.645,502.355,264,490.5,264z M490.5,202
	c3.584,0,6.5,2.916,6.5,6.5s-2.916,6.5-6.5,6.5h-66c-3.584,0-6.5-2.916-6.5-6.5v-1.333c0-1.807-0.652-3.553-1.837-4.917l-0.216-0.25
	H490.5z M435,230v34h-9v-34H435z M256.5,74c10.752,0,19.5,8.748,19.5,19.5s-8.748,19.5-19.5,19.5S237,104.252,237,93.5
	S245.748,74,256.5,74z M235.731,121.027C241.513,125.4,248.708,128,256.5,128c7.463,0,14.375-2.39,20.026-6.434l8.575,17.934
	h-58.202L235.731,121.027z M206.715,467l8.436-17H259.5c4.142,0,7.5-3.358,7.5-7.5c0-4.142-3.358-7.5-7.5-7.5H218v-26h77v33.5
	c0,1.157,0.268,2.298,0.782,3.334L306.285,467H206.715z M435,336h-75.274c-5.061,0-8.621,4.965-7.017,9.765
	c0.021,0.063,0.042,0.126,0.063,0.189c0.997,3.021,3.837,5.046,7.018,5.046H435v36.072c0,3.826-3.102,6.928-6.928,6.928H84.928
	c-3.826,0-6.928-3.102-6.928-6.928V351h236.724c3.219,0,6.077-2.073,7.049-5.142c0.02-0.063,0.04-0.126,0.061-0.19
	c1.534-4.778-2.03-9.668-7.048-9.668H78V161.928c0-3.826,3.102-6.928,6.928-6.928h343.144c3.826,0,6.928,3.102,6.928,6.928V187h-9
	v-16.5c0-4.142-3.358-7.5-7.5-7.5h-325c-4.142,0-7.5,3.358-7.5,7.5v152c0,4.142,3.358,7.5,7.5,7.5h325c4.142,0,7.5-3.358,7.5-7.5
	V307h9L435,336L435,336z M393.837,199.417l9.216,10.614c0.432,6.119,3.447,11.528,7.946,15.171V239h-34v-0.5
	c0-11.808-5.367-22.802-14.496-30.081c0.325-1.589,0.496-3.234,0.496-4.919c0-13.509-10.991-24.5-24.5-24.5S314,189.991,314,203.5
	c0,1.683,0.171,3.327,0.496,4.916C305.373,215.697,300,226.723,300,238.5v0.5h-36v-61h147v9h-11.5c-2.938,0-5.605,1.715-6.824,4.388
	S391.911,197.2,393.837,199.417z M393.837,276.417l9.216,10.614c0.432,6.119,3.447,11.528,7.946,15.171V315h-34v-0.5
	c0-11.808-5.367-22.802-14.496-30.081c0.325-1.589,0.496-3.234,0.496-4.919c0-13.509-10.991-24.5-24.5-24.5S314,265.991,314,279.5
	c0,1.683,0.171,3.327,0.496,4.916C305.373,291.697,300,302.723,300,314.5v0.5h-36v-61h147v10h-11.5
	c-2.938,0-5.605,1.715-6.824,4.388C391.457,271.061,391.911,274.2,393.837,276.417z M338.5,304c6.306,0,12.062-2.396,16.409-6.324
	c4.499,4.383,7.091,10.409,7.091,16.824v0.5h-47v-0.5c0-6.397,2.596-12.435,7.094-16.822C326.44,301.605,332.195,304,338.5,304z
	 M329,279.5c0-5.238,4.262-9.5,9.5-9.5s9.5,4.262,9.5,9.5c0,5.238-4.262,9.5-9.5,9.5S329,284.738,329,279.5z M338.5,228
	c6.306,0,12.062-2.396,16.409-6.324c4.499,4.383,7.091,10.409,7.091,16.824v0.5h-47v-0.5c0-6.397,2.596-12.435,7.094-16.822
	C326.44,225.605,332.195,228,338.5,228z M329,203.5c0-5.238,4.262-9.5,9.5-9.5s9.5,4.262,9.5,9.5s-4.262,9.5-9.5,9.5
	S329,208.738,329,203.5z M190,264.322v-10.088c9.457-4.548,16-14.223,16-25.399v-15.67c0-15.53-12.635-28.165-28.165-28.165h-12.67
	C149.635,185,137,197.635,137,213.165v15.67c0,11.176,6.543,20.852,16,25.399v10.088c-11.712,4.737-20,16.221-20,29.611V315h-32V178
	h148v137h-39v-21.067C210,280.543,201.712,269.059,190,264.322z M165.165,242c-7.259,0-13.165-5.906-13.165-13.165v-15.67
	c0-7.259,5.906-13.165,13.165-13.165h12.67c7.259,0,13.165,5.906,13.165,13.165v15.67c0,7.259-5.906,13.165-13.165,13.165H165.165z
	 M175,257v5h-7v-5H175z M164.933,277h13.134c9.337,0,16.933,7.596,16.933,16.933V315h-47v-21.067
	C148,284.596,155.596,277,164.933,277z M490.5,292h-66c-3.584,0-6.5-2.916-6.5-6.5v-1.333c0-1.807-0.652-3.553-1.837-4.917
	l-0.216-0.25H490.5c3.584,0,6.5,2.916,6.5,6.5C497,289.084,494.084,292,490.5,292z"/>
<circle cx="256.5" cy="93.5" r="9"/>
<g>
</g>
<g>
</g>
<g>
</g>
<g>
</g>
<g>
</g>
<g>
</g>
<g>
</g>
<g>
</g>
<g>
</g>
<g>
</g>
<g>
</g>
<g>
</g>
<g>
</g>
<g>
</g>
<g>
</g>
</svg>
