%!PS-Adobe-3.0 EPSF-3.0
%%Creator: cairo 1.14.2 (http://cairographics.org)
%%CreationDate: Mon Feb 19 09:15:05 2018
%%Pages: 1
%%DocumentData: Clean7Bit
%%LanguageLevel: 2
%%BoundingBox: 0 7 410 403
%%EndComments
%%BeginProlog
save
50 dict begin
/q { gsave } bind def
/Q { grestore } bind def
/cm { 6 array astore concat } bind def
/w { setlinewidth } bind def
/J { setlinecap } bind def
/j { setlinejoin } bind def
/M { setmiterlimit } bind def
/d { setdash } bind def
/m { moveto } bind def
/l { lineto } bind def
/c { curveto } bind def
/h { closepath } bind def
/re { exch dup neg 3 1 roll 5 3 roll moveto 0 rlineto
      0 exch rlineto 0 rlineto closepath } bind def
/S { stroke } bind def
/f { fill } bind def
/f* { eofill } bind def
/n { newpath } bind def
/W { clip } bind def
/W* { eoclip } bind def
/BT { } bind def
/ET { } bind def
/pdfmark where { pop globaldict /?pdfmark /exec load put }
    { globaldict begin /?pdfmark /pop load def /pdfmark
    /cleartomark load def end } ifelse
/BDC { mark 3 1 roll /BDC pdfmark } bind def
/EMC { mark /EMC pdfmark } bind def
/cairo_store_point { /cairo_point_y exch def /cairo_point_x exch def } def
/Tj { show currentpoint cairo_store_point } bind def
/TJ {
  {
    dup
    type /stringtype eq
    { show } { -0.001 mul 0 cairo_font_matrix dtransform rmoveto } ifelse
  } forall
  currentpoint cairo_store_point
} bind def
/cairo_selectfont { cairo_font_matrix aload pop pop pop 0 0 6 array astore
    cairo_font exch selectfont cairo_point_x cairo_point_y moveto } bind def
/Tf { pop /cairo_font exch def /cairo_font_matrix where
      { pop cairo_selectfont } if } bind def
/Td { matrix translate cairo_font_matrix matrix concatmatrix dup
      /cairo_font_matrix exch def dup 4 get exch 5 get cairo_store_point
      /cairo_font where { pop cairo_selectfont } if } bind def
/Tm { 2 copy 8 2 roll 6 array astore /cairo_font_matrix exch def
      cairo_store_point /cairo_font where { pop cairo_selectfont } if } bind def
/g { setgray } bind def
/rg { setrgbcolor } bind def
/d1 { setcachedevice } bind def
%%EndProlog
%%BeginSetup
%%EndSetup
%%Page: 1 1
%%BeginPageSetup
%%PageBoundingBox: 0 7 410 403
%%EndPageSetup
q 0 7 410 396 rectclip q
1 0.811765 0.34902 rg
326.645 69.334 m 264.113 69.334 l 251.078 69.334 240.469 79.944 240.469
 92.983 c 240.469 106.022 251.078 116.627 264.113 116.627 c 345.875 116.627
 l 358.914 116.627 369.523 106.022 369.523 92.983 c 369.523 79.944 358.914
 69.334 345.875 69.334 c 345.172 69.334 l 336.27 49.553 l h
326.645 69.334 m f
0.968627 0.639216 0.243137 rg
287.773 92.983 m 287.773 106.022 298.383 116.627 311.422 116.627 c 264.117
 116.627 l 251.078 116.627 240.469 106.022 240.469 92.983 c 240.469 79.944
 251.078 69.334 264.117 69.334 c 311.422 69.334 l 298.383 69.334 287.773
 79.944 287.773 92.983 c h
287.773 92.983 m f
1 0.384314 0.654902 rg
33.254 30.862 m 29.258 30.862 l 16.219 30.862 5.609 41.467 5.609 54.506
 c 5.609 67.545 16.219 78.155 29.258 78.155 c 111.016 78.155 l 124.055 78.155
 134.664 67.545 134.664 54.506 c 134.664 41.467 124.055 30.862 111.016 30.862
 c 50.277 30.862 l 42.098 12.682 l h
33.254 30.862 m f
0.988235 0.329412 0.47451 rg
56.68 54.506 m 56.68 67.545 67.285 78.155 80.324 78.155 c 29.258 78.155
 l 16.219 78.155 5.609 67.545 5.609 54.506 c 5.609 41.467 16.219 30.862 
29.258 30.862 c 33.254 30.862 l 42.098 12.682 l 50.277 30.862 l 80.324 30.862
 l 67.285 30.862 56.68 41.467 56.68 54.506 c h
56.68 54.506 m f
1 0.384314 0.654902 rg
356.73 346.678 m 272.133 346.678 l 259.535 346.678 249.285 356.924 249.285
 369.522 c 249.285 382.12 259.535 392.366 272.133 392.366 c 381.145 392.366
 l 393.742 392.366 403.988 382.12 403.988 369.522 c 403.988 356.924 393.742
 346.678 381.145 346.678 c 379.906 346.678 l 368.32 317.123 l h
356.73 346.678 m f
0.988235 0.329412 0.47451 rg
286.867 369.522 m 286.867 382.12 297.117 392.366 309.711 392.366 c 272.133
 392.366 l 259.535 392.366 249.285 382.12 249.285 369.522 c 249.285 356.924
 259.535 346.678 272.133 346.678 c 309.711 346.678 l 297.117 346.678 286.867
 356.924 286.867 369.522 c h
286.867 369.522 m f
1 0.811765 0.34902 rg
25.062 361.104 m 23.246 361.104 l 13.523 361.104 5.609 369.014 5.609 378.741
 c 5.609 388.463 13.523 396.373 23.246 396.373 c 56.91 396.373 l 66.637 
396.373 74.547 388.463 74.547 378.741 c 74.547 369.014 66.637 361.104 56.91
 361.104 c 38.195 361.104 l 30.812 344.377 l h
25.062 361.104 m f
0.968627 0.639216 0.243137 rg
28.5 378.741 m 28.5 388.463 36.41 396.373 46.133 396.373 c 23.246 396.373
 l 13.523 396.373 5.609 388.463 5.609 378.741 c 5.609 369.014 13.523 361.104
 23.246 361.104 c 25.062 361.104 l 30.812 344.377 l 38.195 361.104 l 46.133
 361.104 l 36.41 361.104 28.5 369.014 28.5 378.741 c h
28.5 378.741 m f
1 0.811765 0.34902 rg
288.816 297.901 m 113.176 297.901 l 113.211 254.28 l 113.184 247.979 l 
113.18 247.85 113.176 247.717 113.176 247.588 c 113.176 132.639 l 113.176
 127.873 118.629 125.166 122.426 128.041 c 166.859 161.725 l 288.816 161.725
 l 316.602 161.725 339.129 184.248 339.129 212.038 c 339.129 247.588 l 339.129
 275.373 316.602 297.901 288.816 297.901 c h
288.816 297.901 m f
0.968627 0.639216 0.243137 rg
220.406 297.901 m 113.176 297.901 l 113.211 254.28 l 113.184 247.979 l 
113.18 247.85 113.176 247.717 113.176 247.588 c 113.176 132.639 l 113.176
 127.873 118.629 125.166 122.426 128.041 c 140.336 141.62 l 140.336 199.901
 l 140.336 222.854 158.941 241.455 181.891 241.455 c 206.316 226.854 l 209.086
 225.198 212.234 224.323 215.434 224.323 c 225.25 224.323 233.234 232.307
 233.234 242.12 c 233.234 297.901 l h
220.406 297.901 m f
1 0.384314 0.654902 rg
185.211 253.479 m 103.797 253.479 l 85.172 253.479 70.07 268.577 70.07 
287.205 c 70.07 310.944 l 70.07 329.573 85.172 344.674 103.797 344.674 c
 187.48 344.674 l 206.109 344.674 221.207 329.573 221.207 310.944 c 221.207
 242.12 l 221.207 237.643 216.328 234.873 212.484 237.17 c h
185.211 253.479 m f
185.211 253.479 m 103.797 253.479 l 85.172 253.479 70.07 268.577 70.07 
287.205 c 70.07 310.944 l 70.07 329.573 85.172 344.674 103.797 344.674 c
 187.48 344.674 l 206.109 344.674 221.207 329.573 221.207 310.944 c 221.207
 242.12 l 221.207 237.643 216.328 234.873 212.484 237.17 c h
185.211 253.479 m f
0.988235 0.329412 0.47451 rg
121.52 287.205 m 121.52 310.944 l 121.52 329.541 136.648 344.674 155.246
 344.674 c 103.797 344.674 l 85.199 344.674 70.07 329.541 70.07 310.944 
c 70.07 287.205 l 70.07 268.608 85.199 253.479 103.797 253.479 c 155.246
 253.479 l 136.648 253.479 121.52 268.608 121.52 287.205 c h
121.52 287.205 m f
0 g
288.816 303.51 m 226.82 303.51 l 226.82 310.944 l 226.82 332.635 209.172
 350.284 187.48 350.284 c 103.797 350.284 l 82.105 350.284 64.461 332.635
 64.461 310.944 c 64.461 287.205 l 64.461 265.514 82.105 247.866 103.797
 247.866 c 107.57 247.866 l 107.57 247.776 107.566 247.682 107.566 247.588
 c 107.566 121.838 l 107.566 119.553 108.859 117.467 110.902 116.455 c 111.75
 116.034 112.664 115.827 113.578 115.827 c 114.863 115.827 116.145 116.241
 117.211 117.045 c 168.746 156.112 l 288.816 156.112 l 319.652 156.112 344.742
 181.198 344.742 212.034 c 344.742 247.588 l 344.738 278.424 319.652 303.51
 288.816 303.51 c h
332.715 212.034 m 332.715 187.791 313.062 168.135 288.816 168.135 c 166.723
 168.135 l 165.41 168.135 164.137 167.705 163.094 166.913 c 119.59 133.94
 l 119.59 247.588 l 119.871 247.87 l 127.402 247.87 l 130.723 247.87 133.414
 250.561 133.414 253.881 c 133.414 257.202 130.723 259.893 127.402 259.893
 c 103.797 259.893 l 88.711 259.893 76.48 272.123 76.48 287.205 c 76.48 
310.948 l 76.48 326.034 88.711 338.264 103.797 338.264 c 187.48 338.264 
l 202.566 338.264 214.797 326.034 214.797 310.948 c 214.797 243.264 l 188.406
 259.041 l 187.477 259.596 186.41 259.893 185.324 259.893 c 166.52 259.893
 l 163.199 259.893 160.508 257.202 160.508 253.881 c 160.508 250.561 163.199
 247.87 166.52 247.87 c 183.66 247.87 l 217.723 227.502 l 218.672 226.936
 219.738 226.651 220.809 226.651 c 221.898 226.651 222.988 226.944 223.953
 227.538 c 225.789 228.663 226.82 230.748 226.82 232.901 c 226.82 291.487
 l 288.816 291.487 l 313.062 291.487 332.715 271.83 332.715 247.588 c h
332.715 212.034 m f
381.145 397.979 m 272.133 397.979 l 256.441 397.979 243.676 385.213 243.676
 369.522 c 243.676 353.83 256.441 341.069 272.133 341.069 c 352.902 341.069
 l 362.723 316.03 l 363.625 313.725 365.848 312.209 368.32 312.209 c 370.793
 312.209 373.012 313.725 373.918 316.03 c 383.785 341.19 l 398.242 342.522
 409.602 354.721 409.602 369.522 c 409.602 385.213 396.836 397.979 381.145
 397.979 c h
381.145 353.088 m 379.637 353.088 l 377.164 353.088 374.941 351.573 374.039
 349.272 c 368.32 334.69 l 362.602 349.272 l 361.699 351.577 359.477 353.088
 357.004 353.088 c 272.133 353.088 l 263.07 353.088 255.699 360.459 255.699
 369.522 c 255.699 378.58 263.07 385.955 272.133 385.955 c 381.145 385.955
 l 390.203 385.955 397.574 378.58 397.574 369.522 c 397.574 360.459 390.207
 353.088 381.145 353.088 c h
381.145 353.088 m f
111.016 83.764 m 29.258 83.764 l 13.125 83.764 0 70.639 0 54.506 c 0 38.373
 13.125 25.248 29.258 25.248 c 29.742 25.248 l 36.676 10.998 l 37.684 8.924
 39.781 7.616 42.082 7.616 c 42.109 7.616 42.141 7.616 42.172 7.616 c 44.504
 7.651 46.605 9.034 47.562 11.159 c 53.902 25.248 l 111.016 25.248 l 127.145
 25.248 140.27 38.373 140.27 54.506 c 140.273 70.639 127.148 83.764 111.016
 83.764 c h
111.016 37.272 m 50.02 37.272 l 47.652 37.272 45.508 35.885 44.535 33.729
 c 41.871 27.807 l 38.91 33.893 l 37.902 35.959 35.805 37.272 33.504 37.272
 c 29.258 37.272 l 19.754 37.272 12.023 45.002 12.023 54.506 c 12.023 64.01
 19.754 71.741 29.258 71.741 c 111.02 71.741 l 120.52 71.741 128.25 64.01
 128.25 54.506 c 128.25 45.002 120.52 37.272 111.016 37.272 c h
111.016 37.272 m f
345.316 122.237 m 332.145 122.237 l 328.824 122.237 326.133 119.545 326.133
 116.225 c 326.133 112.905 328.824 110.213 332.145 110.213 c 345.453 110.213
 l 354.785 110.213 362.742 102.971 363.098 93.647 c 363.469 83.842 355.598
 75.748 345.875 75.748 c 344.914 75.748 l 342.547 75.748 340.402 74.362 
339.434 72.202 c 336.047 64.678 l 332.305 72.366 l 331.297 74.436 329.199
 75.748 326.898 75.748 c 264.539 75.748 l 255.207 75.748 247.25 82.991 246.898
 92.315 c 246.527 102.12 254.395 110.213 264.117 110.213 c 293.027 110.213
 l 296.348 110.213 299.039 112.905 299.039 116.225 c 299.039 119.545 296.348
 122.237 293.027 122.237 c 264.668 122.237 l 248.691 122.237 235.246 109.659
 234.871 93.686 c 234.48 77.233 247.75 63.725 264.117 63.725 c 323.141 63.725
 l 330.855 47.87 l 331.859 45.795 333.961 44.487 336.258 44.487 c 336.32
 44.487 l 338.664 44.514 340.781 45.893 341.742 48.03 c 348.871 63.877 l
 363.406 65.362 374.828 77.53 375.129 92.381 c 375.457 108.799 361.734 122.237
 345.316 122.237 c h
345.316 122.237 m f
21.023 355.6 m 25.176 343.522 l 25.977 341.182 28.133 339.573 30.605 339.467
 c 30.691 339.463 30.773 339.463 30.859 339.463 c 33.234 339.463 35.395 
340.862 36.359 343.049 c 41.852 355.495 l 56.91 355.495 l 69.727 355.495
 80.156 365.92 80.156 378.741 c 80.156 391.557 69.73 401.987 56.91 401.987
 c 23.246 401.987 l 10.426 401.987 0 391.557 0 378.741 c 0 366.67 9.242 
356.721 21.023 355.6 c h
23.246 389.963 m 56.91 389.963 l 63.098 389.963 68.133 384.928 68.133 378.741
 c 68.133 372.553 63.098 367.518 56.91 367.518 c 37.934 367.518 l 35.551
 367.518 33.395 366.112 32.434 363.932 c 31.559 361.944 l 31.035 363.459
 l 30.203 365.889 27.918 367.518 25.352 367.518 c 23.246 367.518 l 17.059
 367.518 12.023 372.553 12.023 378.741 c 12.023 384.928 17.059 389.963 23.246
 389.963 c h
23.246 389.963 m f
Q Q
showpage
%%Trailer
end restore
%%EOF
