%!PS-Adobe-3.0 EPSF-3.0
%%Creator: cairo 1.14.2 (http://cairographics.org)
%%CreationDate: Mon Feb 19 09:15:05 2018
%%Pages: 1
%%DocumentData: Clean7Bit
%%LanguageLevel: 2
%%BoundingBox: 0 11 410 398
%%EndComments
%%BeginProlog
save
50 dict begin
/q { gsave } bind def
/Q { grestore } bind def
/cm { 6 array astore concat } bind def
/w { setlinewidth } bind def
/J { setlinecap } bind def
/j { setlinejoin } bind def
/M { setmiterlimit } bind def
/d { setdash } bind def
/m { moveto } bind def
/l { lineto } bind def
/c { curveto } bind def
/h { closepath } bind def
/re { exch dup neg 3 1 roll 5 3 roll moveto 0 rlineto
      0 exch rlineto 0 rlineto closepath } bind def
/S { stroke } bind def
/f { fill } bind def
/f* { eofill } bind def
/n { newpath } bind def
/W { clip } bind def
/W* { eoclip } bind def
/BT { } bind def
/ET { } bind def
/pdfmark where { pop globaldict /?pdfmark /exec load put }
    { globaldict begin /?pdfmark /pop load def /pdfmark
    /cleartomark load def end } ifelse
/BDC { mark 3 1 roll /BDC pdfmark } bind def
/EMC { mark /EMC pdfmark } bind def
/cairo_store_point { /cairo_point_y exch def /cairo_point_x exch def } def
/Tj { show currentpoint cairo_store_point } bind def
/TJ {
  {
    dup
    type /stringtype eq
    { show } { -0.001 mul 0 cairo_font_matrix dtransform rmoveto } ifelse
  } forall
  currentpoint cairo_store_point
} bind def
/cairo_selectfont { cairo_font_matrix aload pop pop pop 0 0 6 array astore
    cairo_font exch selectfont cairo_point_x cairo_point_y moveto } bind def
/Tf { pop /cairo_font exch def /cairo_font_matrix where
      { pop cairo_selectfont } if } bind def
/Td { matrix translate cairo_font_matrix matrix concatmatrix dup
      /cairo_font_matrix exch def dup 4 get exch 5 get cairo_store_point
      /cairo_font where { pop cairo_selectfont } if } bind def
/Tm { 2 copy 8 2 roll 6 array astore /cairo_font_matrix exch def
      cairo_store_point /cairo_font where { pop cairo_selectfont } if } bind def
/g { setgray } bind def
/rg { setrgbcolor } bind def
/d1 { setcachedevice } bind def
%%EndProlog
%%BeginSetup
%%EndSetup
%%Page: 1 1
%%BeginPageSetup
%%PageBoundingBox: 0 11 410 398
%%EndPageSetup
q 0 11 410 387 rectclip q
1 0.811765 0.34902 rg
28.023 25.385 m 21.348 26.545 16.52 32.272 16.508 39.073 c 16.496 46.741
 23.141 53.01 30.809 53.01 c 104.562 53.01 l 112.348 53.01 118.977 46.643
 118.848 38.858 c 118.723 31.295 112.527 25.178 104.934 25.178 c 39.441 
25.178 l 35.5 20.186 l 34.457 18.87 32.438 18.936 31.488 20.323 c h
28.023 25.385 m f
1 0.709804 0.360784 rg
37.695 29.573 m 37.684 37.241 44.328 43.51 51.996 43.51 c 118.074 43.51
 l 116.133 49.026 110.719 53.01 104.562 53.01 c 30.809 53.01 l 23.141 53.01
 16.496 46.741 16.508 39.073 c 16.516 32.272 21.348 26.545 28.02 25.389 
c 31.488 20.323 l 32.438 18.936 34.457 18.87 35.5 20.186 c 38.742 24.295
 l 38.074 25.928 37.699 27.705 37.695 29.573 c h
37.695 29.573 m f
1 0.811765 0.34902 rg
363.012 50.791 m 357.539 50.791 l 347.027 50.791 338.148 59.393 338.324
 69.905 c 338.5 80.116 346.859 88.37 357.113 88.37 c 382.27 88.37 l 392.781
 88.37 401.664 79.768 401.484 69.26 c 401.312 59.045 392.953 50.791 382.699
 50.791 c 376.629 50.791 l 372.777 42.311 l 371.418 39.323 367.121 39.491
 366 42.577 c h
363.012 50.791 m f
1 0.709804 0.360784 rg
358.754 58.647 m 358.926 68.862 367.289 77.116 377.543 77.116 c 399.836
 77.116 l 396.816 83.737 389.984 88.37 382.273 88.37 c 357.113 88.37 l 346.859
 88.37 338.5 80.116 338.328 69.905 c 338.148 59.393 347.027 50.791 357.539
 50.791 c 360.402 50.791 l 359.305 53.194 358.707 55.854 358.754 58.647 
c h
358.754 58.647 m f
1 0.384314 0.654902 rg
268.227 350.788 m 258.223 352.483 250.992 361.088 251.059 371.284 c 251.129
 382.713 260.746 391.799 272.176 391.799 c 382.91 391.799 l 394.148 391.799
 403.66 383.002 403.992 371.768 c 404.34 360.096 394.945 350.491 383.348
 350.491 c 285.121 350.491 l 277.953 341.409 l 277.074 340.295 275.367 340.354
 274.562 341.522 c h
268.227 350.788 m f
0.988235 0.329412 0.47451 rg
278.672 356.08 m 278.746 367.51 288.363 376.596 299.793 376.596 c 403.258
 376.596 l 400.789 385.42 392.477 391.799 382.91 391.799 c 272.176 391.799
 l 260.746 391.799 251.129 382.713 251.059 371.284 c 250.992 361.088 258.223
 352.483 268.227 350.788 c 274.566 341.526 l 275.367 340.354 277.074 340.295
 277.953 341.409 c 281.359 345.721 l 279.625 348.78 278.648 352.319 278.672
 356.08 c h
278.672 356.08 m f
1 0.811765 0.34902 rg
53.59 337.03 m 48.117 337.03 l 37.605 337.03 28.727 345.631 28.902 356.139
 c 29.074 366.354 37.438 374.608 47.691 374.608 c 72.848 374.608 l 83.359
 374.608 92.238 366.006 92.062 355.495 c 91.891 345.284 83.527 337.03 73.273
 337.03 c 67.207 337.03 l 61.773 325.073 l 60.996 323.354 58.527 323.452
 57.883 325.221 c h
53.59 337.03 m f
1 0.709804 0.360784 rg
46.734 341.713 m 46.906 351.924 55.27 360.178 65.523 360.178 c 90.68 360.178
 l 90.969 360.178 91.25 360.17 91.535 360.159 c 89.484 368.436 81.754 374.608
 72.848 374.608 c 47.691 374.608 l 37.438 374.608 29.074 366.354 28.902 
356.143 c 28.73 345.916 37.129 337.502 47.262 337.053 c 46.895 338.545 46.707
 340.104 46.734 341.713 c h
46.734 341.713 m f
1 0.811765 0.34902 rg
276.941 74.588 m 255.039 61.635 229.961 54.791 204.402 54.791 c 125.586
 54.791 61.488 119.01 61.684 197.87 c 61.879 276.12 125.789 340.03 204.039
 340.229 c 282.898 340.424 347.121 276.327 347.121 197.51 c 347.121 160.44
 332.977 125.327 307.289 98.612 c 317.23 64.522 l 318.375 60.6 314.363 57.159
 310.66 58.881 c h
276.941 74.588 m f
0.929412 0.686275 0.141176 rg
150.746 213.022 m 150.746 267.233 181.125 314.475 225.754 338.631 c 218.785
 339.678 211.656 340.229 204.398 340.229 c 125.703 340.229 61.68 276.205
 61.68 197.51 c 61.68 118.815 125.703 54.791 204.398 54.791 c 228.121 54.791
 251.422 60.698 272.16 71.897 c 203.535 82.209 150.746 141.565 150.746 213.022
 c h
150.746 213.022 m f
0.192157 0.823529 0.968627 rg
204.398 81.975 m 140.695 81.975 88.867 133.803 88.867 197.506 c 88.867 
261.213 140.695 313.041 204.398 313.041 c 268.105 313.041 319.934 261.213
 319.934 197.51 c 319.934 133.803 268.105 81.975 204.398 81.975 c h
204.398 81.975 m f
0.0745098 0.67451 0.909804 rg
172.934 224.202 m 172.934 259.651 188.988 291.413 214.195 312.623 c 210.965
 312.897 207.699 313.045 204.398 313.045 c 140.695 313.045 88.867 261.217
 88.867 197.51 c 88.867 133.803 140.695 81.975 204.398 81.975 c 232.66 81.975
 258.574 92.178 278.672 109.088 c 219.535 114.077 172.934 163.795 172.934
 224.202 c h
172.934 224.202 m f
0.764706 0.854902 0.25098 rg
204.355 119.049 m 204.68 121.143 205.703 123.104 207.234 124.573 c 224.91
 141.498 l 226.73 143.241 229.117 144.202 231.625 144.202 c 233.75 144.202
 235.852 143.483 237.547 142.182 c 247.266 134.709 l 250.73 132.045 251.992
 127.358 250.324 123.311 c 244.336 108.788 l 265.188 98.409 l 253.184 92.795
 l 238.395 85.877 222.574 82.245 206.168 81.995 c 198.586 81.881 l h
204.355 119.049 m f
0.627451 0.843137 0.333333 rg
244.34 108.788 m 247.402 116.221 l 236.262 120.471 225.945 126.397 216.758
 133.69 c 207.234 124.573 l 205.703 123.104 204.68 121.143 204.355 119.049
 c 198.625 82.12 l 200.539 82.026 202.465 81.975 204.398 81.975 c 204.82
 81.975 205.238 81.983 205.656 81.991 c 206.168 81.998 l 210.188 82.057 
214.168 82.327 218.109 82.791 c 218.348 82.819 218.586 82.85 218.824 82.877
 c 219.496 82.963 220.168 83.053 220.836 83.147 c 221.191 83.198 221.543
 83.252 221.895 83.303 c 222.441 83.385 222.98 83.475 223.527 83.565 c 223.949
 83.639 224.371 83.705 224.793 83.784 c 225.242 83.862 225.691 83.948 226.141
 84.034 c 226.629 84.127 227.117 84.217 227.602 84.319 c 227.672 84.33 227.738
 84.346 227.805 84.362 c 229.164 84.643 230.512 84.952 231.852 85.28 c 232.141
 85.35 232.426 85.416 232.711 85.487 c 233.262 85.627 233.812 85.776 234.363
 85.924 c 234.707 86.014 235.055 86.108 235.398 86.205 c 235.914 86.35 236.43
 86.498 236.941 86.647 c 237.336 86.764 237.727 86.881 238.113 87.002 c 
238.586 87.147 239.059 87.291 239.527 87.44 c 240.02 87.6 240.512 87.764
 241 87.928 c 241.367 88.053 241.738 88.17 242.102 88.299 c 242.969 88.6
 243.836 88.909 244.699 89.233 c 244.816 89.276 244.93 89.323 245.047 89.366
 c 245.832 89.663 246.617 89.967 247.395 90.28 c 247.586 90.358 247.773 
90.436 247.961 90.514 c 248.688 90.811 249.406 91.112 250.125 91.424 c 250.301
 91.502 250.477 91.577 250.652 91.655 c 251.418 91.991 252.18 92.334 252.938
 92.686 c 253.16 92.788 253.383 92.889 253.605 92.995 c 253.844 93.104 l
 257.465 94.827 260.98 96.733 264.383 98.811 c h
244.34 108.788 m f
129.164 109.901 m 112.172 124.514 99.863 143.526 93.562 164.885 c 91.148
 173.08 l 124.938 173.12 l 127.812 173.12 130.629 172.151 132.887 170.389
 c 150.059 156.987 l 153.145 154.577 154.957 150.944 155.02 147.026 c 155.078
 143.108 153.391 139.42 150.379 136.913 c 148.801 135.6 147.578 133.893 
146.84 131.979 c 136.035 103.991 l h
129.164 109.901 m f
0.764706 0.854902 0.25098 rg
184.227 234.592 m 179.961 234.592 175.953 236.268 172.945 239.303 c 169.629
 242.655 167.98 247.264 168.418 251.959 c 168.68 254.76 168.156 257.573 
166.898 260.088 c 155.539 282.881 l 141.027 294.541 l 149.477 299.127 l 
165.008 307.553 181.855 312.198 199.551 312.932 c 208.73 313.315 l 200.754
 288.67 l 204.84 286.522 l 211.641 282.948 214.906 275.03 212.605 267.702
 c 210.258 260.221 l 209.633 258.233 209.43 256.174 209.648 254.104 c 209.766
 253.01 l 210.219 248.741 208.969 244.565 206.25 241.248 c 203.531 237.932
 199.676 235.893 195.406 235.502 c 185.574 234.651 l 185.113 234.612 184.668
 234.592 184.227 234.592 c h
184.227 234.592 m f
0.627451 0.843137 0.333333 rg
155.539 282.881 m 166.898 260.088 l 168.156 257.573 168.68 254.76 168.418
 251.959 c 167.98 247.268 169.633 242.655 172.945 239.307 c 173.227 239.022
 173.527 238.76 173.828 238.498 c 177.023 264.272 188.738 287.432 206.066
 305.08 c 208.613 312.959 l 207.215 313.01 205.812 313.041 204.398 313.041
 c 202.785 313.041 201.18 312.998 199.582 312.936 c 199.551 312.932 l 195.203
 312.752 190.906 312.33 186.668 311.682 c 186.133 311.6 185.602 311.506 
185.066 311.416 c 184.633 311.342 184.203 311.272 183.773 311.194 c 183.066
 311.069 182.363 310.932 181.664 310.791 c 181.418 310.741 181.172 310.694
 180.93 310.643 c 180.145 310.479 179.367 310.311 178.59 310.131 c 178.441
 310.096 178.293 310.065 178.145 310.03 c 177.305 309.834 176.469 309.631
 175.633 309.416 c 175.574 309.401 175.516 309.385 175.457 309.37 c 171.094
 308.241 166.836 306.858 162.691 305.248 c 162.426 305.143 162.16 305.045
 161.898 304.94 c 161.375 304.733 160.859 304.518 160.34 304.303 c 159.863
 304.104 159.387 303.909 158.914 303.702 c 158.523 303.534 158.137 303.362
 157.746 303.19 c 157.109 302.909 156.473 302.62 155.84 302.323 c 155.586
 302.205 155.328 302.088 155.078 301.967 c 154.227 301.561 153.375 301.151
 152.531 300.721 c 152.477 300.694 152.422 300.666 152.367 300.639 c 151.398
 300.147 150.438 299.643 149.48 299.127 c 149.004 298.87 l 146.391 297.436
 143.84 295.901 141.355 294.276 c h
155.539 282.881 m f
0.764706 0.854902 0.25098 rg
304.836 187.623 m 294.668 192.897 l 292.555 193.991 290.301 194.545 287.973
 194.545 c 283.355 194.545 279.125 192.381 276.363 188.6 c 270.395 180.448
 l 267.719 176.791 263.59 174.526 259.062 174.237 c 258.738 174.213 258.406
 174.205 258.082 174.205 c 253.926 174.205 249.898 175.936 247.031 178.959
 c 234.527 192.139 l 231.371 195.467 229.891 199.979 230.457 204.526 c 233.988
 232.756 l 234.734 238.733 238.941 243.717 244.703 245.459 c 269.734 253.03
 l 289.715 275.698 l 294.477 269.772 l 310.891 249.35 319.934 223.686 319.934
 197.51 c 319.934 193.323 319.699 189.061 319.234 184.842 c 316.75 162.198
 l h
304.836 187.623 m f
1 0.384314 0.654902 rg
124.477 201.776 m 26.691 201.776 l 15.453 201.776 5.941 210.573 5.605 221.803
 c 5.258 233.479 14.656 243.084 26.25 243.084 c 137.422 243.084 l 148.852
 243.084 158.469 233.998 158.543 222.569 c 158.609 212.373 151.379 203.772
 141.371 202.073 c 136.168 194.463 l 134.805 192.471 131.898 192.373 130.402
 194.268 c h
124.477 201.776 m f
0.988235 0.329412 0.47451 rg
23.031 206.186 m 22.684 217.858 32.078 227.463 43.676 227.463 c 154.844
 227.463 l 155.902 227.463 156.941 227.385 157.961 227.237 c 155.719 236.373
 147.242 243.084 137.422 243.084 c 26.25 243.084 l 14.652 243.084 5.258 
233.479 5.605 221.803 c 5.91 211.62 13.758 203.44 23.598 202.002 c 23.266
 203.346 23.07 204.745 23.031 206.186 c h
23.031 206.186 m f
0 g
264.859 345.799 m 271.254 336.452 l 272.332 334.877 274.094 333.909 276
 333.842 c 276.066 333.842 276.137 333.842 276.203 333.842 c 278.035 333.842
 279.77 334.678 280.91 336.123 c 287.836 344.893 l 383.352 344.893 l 397.824
 344.893 409.602 356.67 409.602 371.143 c 409.602 385.62 397.824 397.397
 383.348 397.397 c 271.711 397.397 l 257.234 397.393 245.461 385.62 245.461
 371.143 c 245.461 359.104 253.473 348.842 264.859 345.799 c h
271.711 385.401 m 383.348 385.401 l 391.211 385.401 397.605 379.006 397.605
 371.143 c 397.605 363.28 391.211 356.885 383.348 356.885 c 284.93 356.885
 l 283.094 356.885 281.359 356.045 280.223 354.604 c 276.547 349.952 l 273.406
 354.538 l 272.48 355.893 271.035 356.811 269.414 357.073 c 262.484 358.19
 257.453 364.108 257.453 371.143 c 257.453 379.006 263.848 385.401 271.711
 385.401 c h
271.711 385.401 m f
104.934 58.608 m 30.426 58.608 l 19.664 58.608 10.91 49.854 10.91 39.096
 c 10.91 30.401 16.531 22.955 24.609 20.459 c 28.473 14.815 l 29.551 13.241
 31.312 12.272 33.219 12.209 c 33.289 12.205 33.355 12.205 33.426 12.205
 c 35.258 12.205 36.992 13.041 38.133 14.487 c 42.156 19.58 l 104.934 19.58
 l 115.695 19.58 124.445 28.334 124.445 39.096 c 124.445 49.854 115.691 
58.608 104.934 58.608 c h
104.934 31.573 m 39.246 31.573 l 37.41 31.573 35.68 30.733 34.539 29.291
 c 33.77 28.315 l 33.203 29.139 l 32.277 30.495 30.832 31.409 29.211 31.67
 c 25.559 32.26 22.902 35.381 22.902 39.096 c 22.902 43.241 26.277 46.616
 30.426 46.616 c 104.934 46.616 l 109.078 46.616 112.453 43.241 112.453 
39.096 c 112.453 34.948 109.078 31.573 104.934 31.573 c h
104.934 31.573 m f
313.555 97.108 m 338.836 124.561 352.715 160.073 352.715 197.51 c 352.715
 279.291 286.184 345.823 204.402 345.823 c 140.598 345.823 86.082 305.323
 65.195 248.678 c 26.25 248.678 l 11.777 248.678 0 236.905 0 222.428 c 0
 207.955 11.777 196.178 26.25 196.178 c 56.102 196.178 l 56.82 115.006 123.062
 49.194 204.402 49.194 c 229.969 49.194 255.074 55.784 277.219 68.284 c 
317.004 49.752 l 317.812 49.377 318.676 49.194 319.535 49.194 c 320.941 
49.194 322.332 49.69 323.441 50.639 c 325.227 52.17 325.953 54.608 325.293
 56.87 c h
26.25 208.17 m 18.391 208.17 11.992 214.569 11.992 222.428 c 11.992 230.291
 18.387 236.686 26.25 236.686 c 137.891 236.686 l 145.75 236.686 152.148
 230.291 152.148 222.428 c 152.148 215.393 147.117 209.475 140.184 208.358
 c 138.562 208.096 137.117 207.182 136.191 205.827 c 133.051 201.237 l 129.379
 205.893 l 128.242 207.33 126.504 208.174 124.672 208.174 c h
279.453 80.475 m 277.656 81.307 275.562 81.205 273.859 80.194 c 252.902
 67.76 228.887 61.186 204.402 61.186 c 129.676 61.186 68.812 121.623 68.098
 196.178 c 83.289 196.178 l 83.379 187.772 84.328 179.569 86.059 171.655
 c 86.086 171.491 86.121 171.327 86.164 171.166 c 92.539 142.53 109.074 
117.678 131.789 100.612 c 132.16 100.252 132.586 99.94 133.059 99.678 c 
151.352 86.303 173.52 77.924 197.539 76.577 c 197.738 76.522 197.941 76.479
 198.148 76.448 c 198.461 76.401 198.77 76.377 199.074 76.377 c 199.414 
76.377 199.746 76.409 200.07 76.463 c 201.508 76.413 202.949 76.377 204.398
 76.377 c 235.574 76.377 264.031 88.217 285.52 107.635 c 288.164 110.022
 287.953 114.135 285.184 116.381 c 285.102 116.448 285.023 116.514 284.945
 116.58 c 282.766 118.432 279.57 118.409 277.445 116.491 c 273.023 112.498
 268.273 108.862 263.242 105.627 c 251.5 111.475 l 255.5 121.178 l 258.125
 127.553 256.145 134.944 250.676 139.147 c 240.953 146.62 l 234.918 151.26
 226.539 150.807 221.039 145.541 c 203.363 128.62 l 200.934 126.291 199.34
 123.233 198.824 119.909 c 194.008 88.87 l 175.328 90.643 158.004 97.135
 143.254 107.151 c 152.059 129.963 l 152.457 130.991 153.113 131.909 153.961
 132.612 c 158.277 136.209 160.703 141.498 160.613 147.116 c 160.523 152.733
 157.93 157.94 153.5 161.397 c 136.328 174.799 l 133.078 177.338 129.07 
178.713 124.949 178.713 c 124.93 178.713 l 96.891 178.686 l 95.898 184.377
 95.352 190.221 95.277 196.178 c 121.766 196.178 l 128.625 187.487 l 129.801
 185.998 131.594 185.096 133.492 185.127 c 133.512 185.127 133.531 185.127
 133.547 185.127 c 135.496 185.174 137.293 186.198 138.395 187.803 c 144.742
 197.08 l 156.207 200.143 164.25 210.526 164.141 222.674 c 164.008 237.155
 151.887 248.678 137.406 248.678 c 108.047 248.678 l 116.148 263.873 127.734
 276.932 141.734 286.791 c 151.078 279.288 l 161.891 257.592 l 162.664 256.034
 163.023 254.291 162.855 252.561 c 162.234 246.19 164.465 239.916 168.965
 235.366 c 173.027 231.264 178.508 228.995 184.223 228.995 c 184.816 228.995
 185.414 229.022 186.012 229.069 c 195.914 229.932 l 201.566 230.444 206.676
 233.096 210.34 237.413 c 214.246 242.014 215.918 248.108 215.277 254.112
 c 215.215 254.686 l 215.078 255.987 215.207 257.299 215.598 258.541 c 217.945
 266.026 l 221.047 275.905 216.668 286.573 207.531 291.428 c 212.359 306.354
 l 239.23 304.409 263.434 292.694 281.426 274.752 c 266.594 257.924 l 243.086
 250.815 l 235.207 248.436 229.457 241.62 228.438 233.452 c 224.906 205.217
 l 224.133 199.026 226.172 192.815 230.469 188.288 c 242.699 175.397 l 246.395
 171.498 251.391 168.979 256.754 168.647 c 263.961 168.205 270.734 171.428
 274.914 177.143 c 280.879 185.295 l 283.477 188.842 288.191 189.948 292.094
 187.928 c 300.578 183.53 l 308.855 165.866 l 306.652 158.608 303.711 151.674
 300.125 145.143 c 298.727 142.6 299.363 139.432 301.637 137.631 c 301.672
 137.608 301.703 137.58 301.734 137.553 c 304.594 135.248 308.855 136.123
 310.625 139.338 c 314.953 147.205 318.43 155.604 320.934 164.405 c 321.012
 164.631 321.07 164.858 321.121 165.088 c 323.992 175.413 325.531 186.284
 325.531 197.51 c 325.531 228.534 313.801 256.87 294.551 278.323 c 294.273
 278.729 293.949 279.112 293.562 279.452 c 293.52 279.491 293.469 279.526
 293.422 279.565 c 272.211 302.553 242.242 317.334 208.863 318.549 c 208.496
 318.6 208.133 318.612 207.77 318.592 c 206.652 318.623 205.531 318.639 
204.402 318.639 c 180.465 318.639 158.129 311.659 139.324 299.627 c 138.918
 299.424 138.535 299.182 138.18 298.885 c 119.395 286.573 104.227 269.182
 94.633 248.682 c 78.059 248.682 l 98.234 298.307 146.82 333.471 203.523
 333.83 c 278.031 334.303 338.727 275.643 340.672 201.159 c 341.637 164.338
 327.996 129.299 302.52 102.885 c 301.027 101.338 300.477 99.108 301.078
 97.045 c 310.07 66.213 l h
99.699 166.694 m 124.941 166.721 l 124.949 166.721 l 126.395 166.721 127.812
 166.233 128.949 165.346 c 146.121 151.944 l 147.68 150.729 148.59 148.897
 148.621 146.924 c 148.652 144.948 147.801 143.092 146.285 141.827 c 143.871
 139.819 142 137.205 140.871 134.28 c 133.332 114.752 l 117.578 128.299 
105.723 146.26 99.699 166.694 c h
241.156 103.229 m 250.473 98.588 l 236.941 92.26 221.91 88.631 206.07 88.393
 c 210.676 118.069 l 210.785 118.784 211.137 119.455 211.656 119.955 c 229.332
 136.877 l 230.523 138.018 232.34 138.116 233.645 137.112 c 243.363 129.639
 l 244.547 128.729 244.98 127.127 244.41 125.748 c 238.281 110.881 l 237.082
 107.971 238.336 104.631 241.156 103.229 c h
197.48 283.163 m 201.863 280.858 l 205.926 278.725 207.879 273.995 206.504
 269.616 c 204.156 262.135 l 203.27 259.307 202.977 256.377 203.289 253.428
 c 203.406 252.33 l 203.676 249.784 202.93 247.288 201.305 245.307 c 199.68
 243.327 197.379 242.108 194.828 241.873 c 185.02 241.022 l 182.215 240.788
 179.473 241.803 177.492 243.803 c 175.508 245.803 174.523 248.561 174.785
 251.362 c 175.16 255.354 174.41 259.358 172.625 262.944 c 161.223 285.815
 l 160.836 286.588 160.289 287.272 159.613 287.815 c 152.535 293.502 l 166.707
 301.19 182.758 305.838 199.812 306.545 c 194.562 290.319 l 193.668 287.541
 194.898 284.522 197.48 283.163 c h
289.492 265.764 m 304.527 247.061 313.539 223.319 313.539 197.51 c 313.539
 193.463 313.309 189.471 312.879 185.538 c 310.57 190.459 l 310.012 191.655
 309.074 192.631 307.902 193.237 c 297.613 198.573 l 288.422 203.338 277.312
 200.733 271.199 192.377 c 265.234 184.225 l 263.68 182.1 261.281 180.788
 258.656 180.62 c 256.023 180.448 253.484 181.452 251.676 183.362 c 239.168
 196.541 l 237.336 198.475 236.477 201.092 236.805 203.733 c 240.336 231.963
 l 240.77 235.432 243.211 238.327 246.555 239.334 c 271.699 246.936 l 272.766
 247.26 273.723 247.873 274.461 248.713 c h
289.492 265.764 m f
47.691 331.432 m 49.668 331.432 l 54.047 319.389 l 54.879 317.1 57.016 
315.541 59.449 315.448 c 59.531 315.444 59.605 315.44 59.688 315.44 c 62.027
 315.44 64.168 316.811 65.145 318.955 c 70.812 331.432 l 73.277 331.432 
l 86.723 331.432 97.664 342.37 97.664 355.819 c 97.664 369.264 86.723 380.205
 73.277 380.205 c 47.691 380.205 l 34.246 380.205 23.305 369.264 23.305 
355.819 c 23.305 342.37 34.242 331.432 47.691 331.432 c h
47.691 368.209 m 73.273 368.209 l 80.109 368.209 85.668 362.651 85.668 
355.819 c 85.668 348.987 80.109 343.424 73.273 343.424 c 66.953 343.424 
l 64.602 343.424 62.465 342.053 61.492 339.913 c 60.301 337.288 l 59.504
 339.479 l 58.645 341.846 56.391 343.424 53.871 343.424 c 47.691 343.424
 l 40.855 343.424 35.297 348.987 35.297 355.819 c 35.297 362.651 40.855 
368.209 47.691 368.209 c h
47.691 368.209 m f
382.699 93.967 m 357.113 93.967 l 343.668 93.967 332.727 83.03 332.727 
69.58 c 332.727 56.135 343.664 45.194 357.113 45.194 c 359.09 45.194 l 363.469
 33.151 l 364.305 30.862 366.438 29.303 368.871 29.209 c 368.953 29.205 
369.031 29.205 369.109 29.205 c 371.453 29.205 373.59 30.573 374.566 32.721
 c 380.234 45.194 l 382.699 45.194 l 396.145 45.194 407.086 56.135 407.086
 69.58 c 407.086 83.03 396.145 93.967 382.699 93.967 c h
382.699 57.19 m 376.375 57.19 l 374.023 57.19 371.891 55.815 370.914 53.674
 c 369.723 51.053 l 368.93 53.241 l 368.066 55.612 365.812 57.19 363.293
 57.19 c 357.113 57.19 l 350.277 57.19 344.719 62.748 344.719 69.58 c 344.719
 76.416 350.277 81.975 357.113 81.975 c 382.699 81.975 l 389.531 81.975 
395.09 76.416 395.09 69.58 c 395.09 62.748 389.531 57.19 382.699 57.19 c
 h
382.699 57.19 m f
Q Q
showpage
%%Trailer
end restore
%%EOF
