%!PS-Adobe-3.0 EPSF-3.0
%%Creator: cairo 1.14.2 (http://cairographics.org)
%%CreationDate: Mon Feb 19 09:15:05 2018
%%Pages: 1
%%DocumentData: Clean7Bit
%%LanguageLevel: 2
%%BoundingBox: 0 46 410 363
%%EndComments
%%BeginProlog
save
50 dict begin
/q { gsave } bind def
/Q { grestore } bind def
/cm { 6 array astore concat } bind def
/w { setlinewidth } bind def
/J { setlinecap } bind def
/j { setlinejoin } bind def
/M { setmiterlimit } bind def
/d { setdash } bind def
/m { moveto } bind def
/l { lineto } bind def
/c { curveto } bind def
/h { closepath } bind def
/re { exch dup neg 3 1 roll 5 3 roll moveto 0 rlineto
      0 exch rlineto 0 rlineto closepath } bind def
/S { stroke } bind def
/f { fill } bind def
/f* { eofill } bind def
/n { newpath } bind def
/W { clip } bind def
/W* { eoclip } bind def
/BT { } bind def
/ET { } bind def
/pdfmark where { pop globaldict /?pdfmark /exec load put }
    { globaldict begin /?pdfmark /pop load def /pdfmark
    /cleartomark load def end } ifelse
/BDC { mark 3 1 roll /BDC pdfmark } bind def
/EMC { mark /EMC pdfmark } bind def
/cairo_store_point { /cairo_point_y exch def /cairo_point_x exch def } def
/Tj { show currentpoint cairo_store_point } bind def
/TJ {
  {
    dup
    type /stringtype eq
    { show } { -0.001 mul 0 cairo_font_matrix dtransform rmoveto } ifelse
  } forall
  currentpoint cairo_store_point
} bind def
/cairo_selectfont { cairo_font_matrix aload pop pop pop 0 0 6 array astore
    cairo_font exch selectfont cairo_point_x cairo_point_y moveto } bind def
/Tf { pop /cairo_font exch def /cairo_font_matrix where
      { pop cairo_selectfont } if } bind def
/Td { matrix translate cairo_font_matrix matrix concatmatrix dup
      /cairo_font_matrix exch def dup 4 get exch 5 get cairo_store_point
      /cairo_font where { pop cairo_selectfont } if } bind def
/Tm { 2 copy 8 2 roll 6 array astore /cairo_font_matrix exch def
      cairo_store_point /cairo_font where { pop cairo_selectfont } if } bind def
/g { setgray } bind def
/rg { setrgbcolor } bind def
/d1 { setcachedevice } bind def
%%EndProlog
%%BeginSetup
%%EndSetup
%%Page: 1 1
%%BeginPageSetup
%%PageBoundingBox: 0 46 410 363
%%EndPageSetup
q 0 46 410 317 rectclip q
1 0.811765 0.34902 rg
266.895 299.784 m 244.469 299.784 l 231.637 299.784 220.777 309.827 220.398
 322.651 c 220 335.979 230.727 346.944 243.969 346.944 c 379.352 346.944
 l 392.18 346.944 403.043 336.905 403.422 324.077 c 403.82 310.752 393.094
 299.784 379.852 299.784 c 279.406 299.784 l 275.02 289.135 l 274.461 287.784
 272.562 287.737 271.941 289.061 c h
266.895 299.784 m f
1 0.384314 0.654902 rg
122.203 309.377 m 79.809 309.377 l 66.977 309.377 56.117 319.416 55.734
 332.245 c 55.34 345.569 66.066 356.538 79.305 356.538 c 157.137 356.538
 l 169.969 356.538 180.828 346.495 181.211 333.67 c 181.605 320.342 170.879
 309.377 157.641 309.377 c 134.711 309.377 l 129.668 298.655 l 129.043 297.33
 127.145 297.373 126.586 298.729 c h
122.203 309.377 m f
0.976471 0.631373 0.254902 rg
243.18 305.901 m 242.781 319.225 253.508 330.194 266.746 330.194 c 402.133
 330.194 l 402.223 330.194 402.312 330.19 402.402 330.186 c 399.387 339.952
 390.059 346.944 379.352 346.944 c 243.969 346.944 l 230.727 346.944 220.004
 335.979 220.398 322.651 c 220.777 309.916 231.484 299.932 244.195 299.791
 c 243.598 301.729 243.242 303.776 243.18 305.901 c h
243.18 305.901 m f
0.988235 0.329412 0.47451 rg
78.516 315.491 m 78.121 328.819 88.848 339.788 102.086 339.788 c 179.918
 339.788 l 180.012 339.788 180.102 339.78 180.191 339.78 c 177.172 349.545
 167.844 356.538 157.137 356.538 c 79.305 356.538 l 66.066 356.538 55.34
 345.569 55.734 332.245 c 56.113 319.51 66.824 309.526 79.535 309.381 c 
78.938 311.323 78.578 313.366 78.516 315.491 c h
78.516 315.491 m f
0.764706 0.854902 0.25098 rg
156.156 53.065 m 144.422 53.065 134.918 62.784 135.266 74.596 c 135.605
 85.963 145.23 94.862 156.602 94.862 c 169.348 94.862 l 174.074 103.811 
l 174.422 104.471 175.367 104.471 175.711 103.811 c 180.434 94.862 l 218.629
 94.862 l 230 94.862 239.625 85.963 239.961 74.596 c 240.312 62.784 230.805
 53.065 219.07 53.065 c h
156.156 53.065 m f
0.678431 0.737255 0.0823529 rg
235.855 62.12 m 172.945 62.12 l 161.211 62.12 151.703 71.842 152.055 83.651
 c 152.176 87.819 153.555 91.655 155.805 94.842 c 144.785 94.436 135.598
 85.694 135.27 74.592 c 134.918 62.78 144.426 53.061 156.16 53.061 c 219.07
 53.061 l 226.203 53.061 232.512 56.659 236.285 62.131 c 236.141 62.127 
236 62.12 235.855 62.12 c h
235.855 62.12 m f
0.980392 0.827451 0.576471 rg
323.941 78.463 m 323.941 117.319 l 296.09 117.319 l 280.547 117.319 267.945
 129.916 267.945 145.459 c 267.945 166.518 l 261.027 167.088 l 258.188 167.323
 255.59 168.963 254.355 171.534 c 253.043 174.256 253.355 177.342 255.172
 179.733 c 267.945 196.608 l 267.945 210.373 l 267.945 246.17 296.965 275.19
 332.762 275.19 c 348.348 275.19 l 379.086 275.19 404.004 250.272 404.004
 219.534 c 404.004 165.198 l 404.004 155.276 400.988 145.756 395.277 137.655
 c 395.277 78.463 l 395.277 73.01 390.859 68.592 385.41 68.592 c 333.809
 68.592 l 328.359 68.596 323.941 73.014 323.941 78.463 c h
323.941 78.463 m f
14.324 78.463 m 14.324 137.659 l 8.613 145.756 5.594 155.28 5.594 165.202
 c 5.594 219.534 l 5.594 250.272 30.512 275.19 61.254 275.19 c 76.84 275.19
 l 112.637 275.19 141.656 246.174 141.656 210.373 c 141.656 196.608 l 154.43
 179.733 l 156.242 177.342 156.555 174.256 155.242 171.534 c 154.004 168.963
 151.41 167.323 148.57 167.088 c 141.656 166.518 l 141.656 145.459 l 141.656
 129.916 129.055 117.319 113.512 117.319 c 85.66 117.319 l 85.66 78.463 
l 85.66 73.014 81.242 68.596 75.793 68.596 c 24.191 68.596 l 18.738 68.596
 14.324 73.014 14.324 78.463 c h
14.324 78.463 m f
0.929412 0.717647 0.411765 rg
294.586 131.553 m 294.586 196.467 l 294.586 232.264 323.602 261.284 359.402
 261.284 c 374.988 261.284 l 378.91 261.284 382.738 260.873 386.434 260.1
 c 376.473 269.452 363.086 275.19 348.348 275.19 c 332.762 275.19 l 296.965
 275.19 267.945 246.174 267.945 210.373 c 267.945 196.608 l 255.168 179.733
 l 253.355 177.342 253.043 174.26 254.355 171.534 c 255.59 168.967 258.188
 167.323 261.027 167.088 c 267.945 166.522 l 267.945 145.459 l 267.945 129.916
 280.547 117.319 296.086 117.319 c 298.453 117.319 l 296 121.495 294.586
 126.358 294.586 131.553 c h
294.586 131.553 m f
40.961 123.752 m 35.25 131.85 32.234 141.373 32.234 151.295 c 32.234 205.627
 l 32.234 236.366 57.152 261.284 87.891 261.284 c 103.477 261.284 l 108.93
 261.284 114.227 260.604 119.285 259.334 c 107.914 269.205 93.078 275.19
 76.84 275.19 c 61.254 275.19 l 30.512 275.19 5.594 250.272 5.594 219.534
 c 5.594 165.202 l 5.594 155.28 8.613 145.756 14.324 137.659 c 14.324 78.463
 l 14.324 73.014 18.742 68.596 24.191 68.596 c 40.961 68.596 l h
40.961 123.752 m f
0 g
158.891 183.108 m 147.25 198.487 l 147.25 210.373 l 147.25 222.709 144.059
 234.319 138.461 244.413 c 136.527 247.901 131.785 248.569 128.965 245.748
 c 127.062 243.846 126.676 240.92 127.98 238.569 c 132.613 230.205 135.258
 220.596 135.258 210.373 c 135.258 196.475 l 135.258 195.166 135.688 193.897
 136.473 192.858 c 149.332 175.873 l 149.773 175.291 149.672 174.729 149.504
 174.358 c 149.34 173.991 148.992 173.538 148.262 173.479 c 140.762 172.862
 l 137.652 172.604 135.258 170.006 135.258 166.885 c 135.258 145.459 l 135.258
 133.448 125.523 123.709 113.512 123.709 c 91.258 123.709 l 91.258 128.373
 l 91.258 131.659 88.727 134.518 85.445 134.616 c 82.051 134.717 79.266 
131.998 79.266 128.623 c 79.266 74.991 l 20.719 74.991 l 20.719 137.784 
l 20.719 139.01 20.352 140.209 19.641 141.209 c 14.637 148.256 11.988 156.553
 11.988 165.202 c 11.988 219.538 l 11.988 246.741 34.047 268.799 61.254 
268.799 c 76.84 268.799 l 85.941 268.799 94.559 266.694 102.242 262.963 
c 104.547 261.842 107.301 262.299 109.113 264.108 c 109.117 264.112 l 112.047
 267.041 111.188 271.967 107.461 273.776 c 98.195 278.268 87.805 280.788
 76.84 280.788 c 61.254 280.788 l 27.426 280.788 0 253.362 0 219.534 c 0
 165.198 l 0 154.725 3.012 144.651 8.727 135.936 c 8.727 68.995 l 8.727 
65.686 11.41 62.998 14.723 62.998 c 85.262 62.998 l 88.57 62.998 91.258 
65.682 91.258 68.995 c 91.258 111.721 l 113.512 111.721 l 132.145 111.721
 147.25 126.827 147.25 145.459 c 147.25 161.366 l 148.938 161.502 l 153.004
 161.838 156.816 163.846 159.16 167.186 c 162.598 172.092 162.383 178.502
 158.891 183.108 c h
158.891 183.108 m f
348.348 280.788 m 332.762 280.788 l 293.938 280.788 262.352 249.198 262.352
 210.373 c 262.352 198.487 l 250.707 183.108 l 247.738 179.186 247.141 173.959
 249.148 169.467 c 251.156 164.971 255.449 161.932 260.355 161.53 c 262.352
 161.366 l 262.352 145.459 l 262.352 126.858 277.484 111.721 296.09 111.721
 c 318.344 111.721 l 318.344 68.995 l 318.344 65.682 321.027 62.998 324.34
 62.998 c 394.879 62.998 l 398.191 62.998 400.875 65.682 400.875 68.995 
c 400.875 135.936 l 406.59 144.651 409.602 154.725 409.602 165.202 c 409.602
 219.534 l 409.602 253.307 382.121 280.788 348.348 280.788 c h
397.609 165.202 m 397.609 156.569 394.973 148.288 389.988 141.252 c 389.27
 140.237 388.883 139.026 388.883 137.784 c 388.883 74.991 l 330.336 74.991
 l 330.336 128.623 l 330.336 131.936 327.652 134.62 324.34 134.62 c 321.027
 134.62 318.344 131.936 318.344 128.623 c 318.344 123.709 l 296.09 123.709
 l 284.098 123.709 274.34 133.467 274.34 145.459 c 274.34 166.885 l 274.34
 170.006 271.945 172.604 268.836 172.862 c 261.336 173.479 l 260.609 173.538
 260.258 173.991 260.094 174.358 c 259.93 174.729 259.824 175.288 260.266
 175.873 c 273.125 192.858 l 273.91 193.897 274.34 195.17 274.34 196.475
 c 274.34 210.373 l 274.34 242.588 300.547 268.795 332.762 268.795 c 348.348
 268.795 l 375.508 268.795 397.609 246.698 397.609 219.534 c h
397.609 165.202 m f
243.969 294.19 m 263.344 294.19 l 268.117 284.045 l 269.109 281.94 271.227
 280.6 273.543 280.6 c 273.59 280.6 273.641 280.604 273.691 280.604 c 276.066
 280.663 278.18 282.12 279.086 284.315 c 283.152 294.19 l 379.855 294.19
 l 395.941 294.19 409.027 307.28 409.027 323.366 c 409.027 339.452 395.941
 352.541 379.855 352.541 c 243.969 352.541 l 227.879 352.541 214.793 339.452
 214.793 323.366 c 214.793 307.28 227.879 294.19 243.969 294.19 c h
243.969 340.549 m 379.852 340.549 l 389.328 340.549 397.039 332.842 397.039
 323.366 c 397.039 313.889 389.328 306.178 379.852 306.178 c 279.137 306.178
 l 276.707 306.178 274.52 304.713 273.594 302.467 c 273.176 301.452 l 272.57
 302.737 l 271.582 304.838 269.469 306.178 267.148 306.178 c 243.969 306.178
 l 234.492 306.178 226.781 313.889 226.781 323.366 c 226.781 332.838 234.492
 340.549 243.969 340.549 c h
243.969 340.549 m f
79.305 303.78 m 118.457 303.78 l 122.523 293.905 l 123.426 291.709 125.543
 290.252 127.918 290.194 c 127.969 290.194 128.016 290.194 128.066 290.194
 c 130.383 290.194 132.5 291.53 133.488 293.635 c 138.266 303.78 l 157.641
 303.78 l 173.727 303.78 186.816 316.87 186.816 332.955 c 186.816 349.041
 173.727 362.131 157.641 362.131 c 79.305 362.131 l 63.219 362.131 50.133
 349.041 50.133 332.955 c 50.133 316.87 63.219 303.78 79.305 303.78 c h
79.305 350.143 m 157.641 350.143 l 167.113 350.143 174.824 342.432 174.824
 332.955 c 174.824 323.479 167.113 315.772 157.641 315.772 c 134.457 315.772
 l 132.137 315.772 130.023 314.428 129.035 312.33 c 128.43 311.045 l 128.012
 312.061 l 127.09 314.307 124.898 315.772 122.469 315.772 c 79.305 315.772
 l 69.828 315.772 62.121 323.483 62.121 332.959 c 62.121 342.432 69.828 
350.143 79.305 350.143 c h
79.305 350.143 m f
219.07 100.455 m 183.996 100.455 l 179.961 109.034 l 178.949 111.182 176.762
 112.518 174.391 112.471 c 172.016 112.413 169.898 110.959 168.992 108.76
 c 165.574 100.455 l 156.16 100.455 l 141.547 100.455 129.664 88.573 129.664
 73.963 c 129.664 59.354 141.547 47.467 156.16 47.467 c 219.07 47.467 l 
233.68 47.467 245.566 59.354 245.566 73.963 c 245.566 88.569 233.68 100.455
 219.07 100.455 c h
219.07 59.459 m 156.156 59.459 l 148.16 59.459 141.652 65.963 141.652 73.963
 c 141.652 81.959 148.16 88.467 156.156 88.467 c 169.59 88.467 l 171.828
 88.467 173.859 89.709 174.891 91.663 c 175.926 89.705 177.961 88.467 180.191
 88.467 c 219.07 88.467 l 227.07 88.467 233.574 81.959 233.574 73.963 c 
233.574 65.963 227.07 59.459 219.07 59.459 c h
219.07 59.459 m f
Q Q
showpage
%%Trailer
end restore
%%EOF
