%!PS-Adobe-3.0 EPSF-3.0
%%Creator: cairo 1.14.2 (http://cairographics.org)
%%CreationDate: Mon Feb 19 09:15:05 2018
%%Pages: 1
%%DocumentData: Clean7Bit
%%LanguageLevel: 2
%%BoundingBox: 0 5 410 404
%%EndComments
%%BeginProlog
save
50 dict begin
/q { gsave } bind def
/Q { grestore } bind def
/cm { 6 array astore concat } bind def
/w { setlinewidth } bind def
/J { setlinecap } bind def
/j { setlinejoin } bind def
/M { setmiterlimit } bind def
/d { setdash } bind def
/m { moveto } bind def
/l { lineto } bind def
/c { curveto } bind def
/h { closepath } bind def
/re { exch dup neg 3 1 roll 5 3 roll moveto 0 rlineto
      0 exch rlineto 0 rlineto closepath } bind def
/S { stroke } bind def
/f { fill } bind def
/f* { eofill } bind def
/n { newpath } bind def
/W { clip } bind def
/W* { eoclip } bind def
/BT { } bind def
/ET { } bind def
/pdfmark where { pop globaldict /?pdfmark /exec load put }
    { globaldict begin /?pdfmark /pop load def /pdfmark
    /cleartomark load def end } ifelse
/BDC { mark 3 1 roll /BDC pdfmark } bind def
/EMC { mark /EMC pdfmark } bind def
/cairo_store_point { /cairo_point_y exch def /cairo_point_x exch def } def
/Tj { show currentpoint cairo_store_point } bind def
/TJ {
  {
    dup
    type /stringtype eq
    { show } { -0.001 mul 0 cairo_font_matrix dtransform rmoveto } ifelse
  } forall
  currentpoint cairo_store_point
} bind def
/cairo_selectfont { cairo_font_matrix aload pop pop pop 0 0 6 array astore
    cairo_font exch selectfont cairo_point_x cairo_point_y moveto } bind def
/Tf { pop /cairo_font exch def /cairo_font_matrix where
      { pop cairo_selectfont } if } bind def
/Td { matrix translate cairo_font_matrix matrix concatmatrix dup
      /cairo_font_matrix exch def dup 4 get exch 5 get cairo_store_point
      /cairo_font where { pop cairo_selectfont } if } bind def
/Tm { 2 copy 8 2 roll 6 array astore /cairo_font_matrix exch def
      cairo_store_point /cairo_font where { pop cairo_selectfont } if } bind def
/g { setgray } bind def
/rg { setrgbcolor } bind def
/d1 { setcachedevice } bind def
%%EndProlog
%%BeginSetup
%%EndSetup
%%Page: 1 1
%%BeginPageSetup
%%PageBoundingBox: 0 5 410 404
%%EndPageSetup
q 0 5 410 399 rectclip q
0.764706 0.854902 0.25098 rg
50.957 11.854 m 45.961 11.854 41.898 15.916 41.898 20.913 c 41.898 35.588
 l 41.898 57.03 59.34 74.475 80.785 74.475 c 152.688 74.475 l 174.129 74.475
 191.574 57.03 191.574 35.588 c 191.574 20.913 l 191.574 15.916 187.512 
11.854 182.52 11.854 c h
50.957 11.854 m f
0.678431 0.737255 0.0823529 rg
136.078 74.471 m 80.785 74.471 l 59.309 74.471 41.898 57.065 41.898 35.584
 c 41.898 20.909 l 41.898 15.909 45.953 11.854 50.953 11.854 c 93.52 11.854
 l 88.523 11.854 84.461 15.916 84.461 20.909 c 84.461 35.584 l 84.461 38.397
 84.762 41.139 85.332 43.78 c 86.711 50.166 94.129 53.108 99.52 49.42 c 
104.426 46.061 110.355 44.096 116.734 44.096 c 133.531 44.096 147.203 57.705
 147.312 74.471 c h
136.078 74.471 m f
0.207843 g
214.586 293.702 m 214.32 294.834 214.016 296.022 213.629 297.428 c 214.27
 299.725 214.594 302.092 214.594 304.471 c 214.594 312.498 210.902 320.116
 204.453 325.409 c 202.531 327.061 l 138.504 364.182 l 129.32 357.311 l 
126.707 355.268 124.508 352.928 122.777 350.354 c 122.117 349.373 121.117
 348.78 119.965 348.686 c 119.863 348.678 119.758 348.674 119.656 348.674
 c 118.645 348.674 117.699 349.084 116.996 349.83 c 106.062 361.424 89.777
 368.073 72.32 368.073 c 40.758 368.073 15.078 346.26 15.078 319.448 c 15.078
 318.502 15.121 317.514 15.207 316.397 c 15.121 315.19 15.078 314.123 15.078
 313.139 c 15.078 306.729 16.426 300.448 19.074 294.475 c 18.754 293.147
 18.461 291.83 18.207 290.561 c 16.922 284.112 16.266 277.475 16.266 270.846
 c 16.266 220.889 l 217.207 220.545 l 217.207 270.846 l 217.207 278.561 
216.324 286.248 214.586 293.702 c h
214.586 293.702 m f
0.188235 0.164706 0.129412 rg
103.98 220.889 m 103.98 270.846 l 103.98 277.475 104.633 284.108 105.922
 290.561 c 106.176 291.83 106.469 293.147 106.789 294.475 c 104.137 300.448
 102.793 306.729 102.793 313.139 c 102.793 314.123 102.836 315.19 102.922
 316.397 c 102.836 317.514 102.793 318.502 102.793 319.448 c 102.793 331.315
 107.832 342.198 116.176 350.651 c 105.258 361.729 89.355 368.073 72.32 
368.073 c 40.758 368.073 15.078 346.26 15.078 319.448 c 15.078 318.502 15.121
 317.514 15.207 316.397 c 15.121 315.19 15.078 314.123 15.078 313.139 c 
15.078 306.729 16.422 300.448 19.074 294.475 c 18.754 293.147 18.461 291.83
 18.207 290.561 c 16.918 284.112 16.266 277.475 16.266 270.846 c 16.266 
220.889 l h
103.98 220.889 m f
1 0.384314 0.654902 rg
167.547 326.752 m 150.043 329.663 137.41 344.78 137.715 362.631 c 138.047
 382.225 154.445 397.748 174.039 397.748 c 367.625 397.748 l 387.625 397.748
 404.34 381.381 403.996 361.381 c 403.664 341.959 387.762 326.26 368.262
 326.26 c 196.711 326.26 l 184.406 310.674 l 182.848 308.702 179.828 308.807
 178.406 310.877 c h
167.547 326.752 m f
0.988235 0.329412 0.47451 rg
156.59 340.03 m 156.922 359.623 173.32 375.147 192.914 375.147 c 386.504
 375.147 l 392.293 375.147 397.809 373.764 402.715 371.33 c 398.469 386.53
 384.18 397.748 367.625 397.748 c 174.039 397.748 l 154.445 397.748 138.043
 382.225 137.711 362.631 c 137.469 348.276 145.59 335.698 157.883 329.803
 c 156.988 333.057 156.531 336.491 156.59 340.03 c h
156.59 340.03 m f
0.858824 0.682353 0.431373 rg
195.617 178.127 m 195.617 228.291 l 202.793 228.291 l 216.621 228.291 227.875
 217.041 227.875 203.209 c 227.875 189.377 216.621 178.127 202.793 178.127
 c h
195.617 178.127 m f
0.980392 0.827451 0.576471 rg
116.738 61.916 m 104.828 61.916 95.145 71.604 95.145 83.51 c 95.145 116.807
 l 102.676 115.448 l 107.305 114.612 112.035 114.19 116.738 114.19 c 121.441
 114.19 126.168 114.612 130.797 115.448 c 138.332 116.807 l 138.332 83.51
 l 138.332 71.604 128.645 61.916 116.738 61.916 c h
116.738 61.916 m f
0.929412 0.717647 0.411765 rg
116.738 83.51 m 116.738 114.19 l 112.035 114.19 107.305 114.612 102.676
 115.448 c 95.145 116.807 l 95.145 83.51 l 95.145 71.604 104.828 61.916 
116.738 61.916 c 120.668 61.916 124.355 62.979 127.535 64.823 c 121.086 
68.561 116.738 75.534 116.738 83.51 c h
116.738 83.51 m f
0.980392 0.827451 0.576471 rg
116.738 103.92 m 72.801 103.92 37.059 139.666 37.059 183.6 c 37.059 279.053
 l 46.367 274.288 l 56.539 269.084 68.223 266.334 80.156 266.334 c 103.023
 266.334 123.652 276.014 135.328 292.229 c 138.086 296.057 l 142.559 294.553
 l 144.84 293.788 147.27 293.401 149.77 293.401 c 152.223 293.401 154.609
 293.776 156.859 294.514 c 160.695 295.776 l 163.484 292.854 l 168.945 287.135
 176.773 283.858 184.965 283.858 c 186.371 283.858 187.781 283.952 189.156
 284.139 c 196.418 285.127 l 196.418 183.6 l 196.414 139.666 160.672 103.92
 116.738 103.92 c h
116.738 103.92 m f
0.929412 0.717647 0.411765 rg
184.965 283.858 m 176.773 283.858 168.941 287.135 163.484 292.854 c 160.695
 295.776 l 156.859 294.514 l 154.605 293.776 152.223 293.401 149.766 293.401
 c 147.266 293.401 144.84 293.788 142.555 294.553 c 138.086 296.057 l 135.328
 292.229 l 123.652 276.014 103.023 266.334 80.152 266.334 c 68.223 266.334
 56.539 269.084 46.367 274.288 c 37.055 279.053 l 37.055 184.623 l 37.055
 140.846 72.867 103.967 116.648 103.92 c 125.168 103.909 133.375 105.252
 141.078 107.729 c 111.27 119.846 90.195 149.123 90.195 183.233 c 90.195
 220.159 l 90.195 228.827 95.656 236.655 103.891 239.37 c 117.008 243.698
 128.203 251.506 135.746 261.979 c 138.562 265.893 l 143.137 264.358 l 145.473
 263.573 147.953 263.174 150.508 263.174 c 153.02 263.174 155.457 263.561
 157.758 264.315 c 161.684 265.608 l 164.535 262.62 l 170.117 256.772 178.121
 253.42 186.496 253.42 c 187.934 253.42 189.375 253.514 190.785 253.709 
c 196.414 254.475 l 196.414 285.127 l 189.156 284.139 l 187.777 283.952 
186.367 283.858 184.965 283.858 c h
184.965 283.858 m f
0.192157 0.823529 0.968627 rg
325.457 120.647 m 252.461 120.647 l 238.133 120.647 226.473 132.307 226.473
 146.639 c 226.473 160.967 238.133 172.627 252.461 172.627 c 357.223 172.627
 l 371.551 172.627 383.211 160.967 383.211 146.639 c 383.211 132.307 371.551
 120.647 357.223 120.647 c 341.004 120.647 l 333.23 99.916 l h
325.457 120.647 m f
0.0745098 0.67451 0.909804 rg
247.703 126.842 m 247.703 141.17 259.363 152.83 273.695 152.83 c 378.453
 152.83 l 379.84 152.83 381.203 152.721 382.531 152.506 c 379.863 164.018
 369.531 172.627 357.223 172.627 c 252.461 172.627 l 238.133 172.627 226.473
 160.967 226.473 146.635 c 226.473 133.694 235.98 122.936 248.383 120.971
 c 247.941 122.858 247.703 124.823 247.703 126.842 c h
247.703 126.842 m f
332.879 100.854 m 333.23 99.916 l 333.582 100.854 l h
332.879 100.854 m f
0.858824 0.682353 0.431373 rg
30.68 178.127 m 16.852 178.127 5.598 189.377 5.598 203.209 c 5.598 217.041
 16.848 228.295 30.68 228.295 c 37.855 228.295 l 37.855 178.127 l h
30.68 178.127 m f
0 g
367.566 403.342 m 173.449 403.342 l 151.941 403.342 134.223 386.827 132.293
 365.811 c 127.152 363.182 122.77 359.604 119.453 355.315 c 107.516 367.006
 90.477 373.67 72.316 373.67 c 37.668 373.67 9.477 349.346 9.477 319.448
 c 9.477 318.487 9.516 317.495 9.59 316.362 c 9.516 315.194 9.477 314.135
 9.477 313.139 c 9.477 306.573 10.73 300.135 13.207 293.975 c 13.031 293.19
 12.867 292.416 12.719 291.659 c 11.355 284.846 10.664 277.846 10.664 270.846
 c 10.664 226.436 l 3.934 220.623 -0.262 211.952 0.012 202.323 c 0.488 185.635
 14.535 172.53 31.223 172.53 c 32.176 172.53 l 36.426 139.901 59.188 113.01
 89.543 102.768 c 89.543 82.838 l 89.543 81.905 89.59 80.979 89.684 80.069
 c 80.781 80.069 l 56.215 80.069 36.297 60.155 36.297 35.584 c 36.297 20.909
 l 36.297 12.819 42.859 6.256 50.953 6.256 c 182.516 6.256 l 190.609 6.256
 197.172 12.819 197.172 20.909 c 197.172 35.584 l 197.172 60.155 177.254
 80.069 152.688 80.069 c 143.785 80.069 l 143.879 80.979 143.926 81.905 
143.926 82.838 c 143.926 102.768 l 174.281 113.006 197.043 139.901 201.293
 172.53 c 202.242 172.53 l 218.934 172.53 232.98 185.635 233.457 202.319
 c 233.73 211.948 229.535 220.623 222.801 226.432 c 222.801 270.846 l 222.801
 278.987 221.871 287.104 220.035 294.975 c 219.848 295.768 219.645 296.584
 219.41 297.479 c 219.926 299.776 220.188 302.12 220.188 304.471 c 220.188
 310.213 218.629 315.764 215.762 320.663 c 287.945 320.663 l 291.258 320.663
 293.945 323.35 293.945 326.663 c 293.945 329.975 291.258 332.659 287.945
 332.659 c 196.516 332.659 l 194.68 332.659 192.945 331.819 191.809 330.377
 c 181.633 317.491 l 172.727 330.506 l 171.812 331.838 170.41 332.776 168.816
 333.03 c 154.695 335.264 144.387 347.166 144.109 361.413 c 143.785 377.936
 157.469 391.35 173.992 391.35 c 367.707 391.35 l 383.73 391.35 397.215 
378.733 397.594 362.713 c 397.984 346.209 384.672 332.659 368.258 332.659
 c 326.973 332.659 l 323.66 332.659 320.977 329.975 320.977 326.663 c 320.977
 323.35 323.66 320.666 326.973 320.666 c 368.258 320.666 l 391.32 320.666
 410.027 339.643 409.59 362.803 c 409.164 385.436 390.203 403.342 367.566
 403.342 c h
31.457 184.526 m 30.68 184.526 l 20.375 184.526 11.996 192.905 11.996 203.209
 c 11.996 213.514 20.375 221.897 30.68 221.897 c 31.457 221.897 l h
152.688 68.077 m 170.602 68.077 185.176 53.498 185.176 35.584 c 185.176
 20.909 l 185.176 19.444 183.984 18.252 182.52 18.252 c 50.957 18.252 l 
49.488 18.252 48.293 19.444 48.293 20.909 c 48.293 35.584 l 48.293 53.498
 62.871 68.077 80.785 68.077 c 93.918 68.077 l 98.77 60.604 107.18 55.647
 116.734 55.647 c 126.289 55.647 134.703 60.604 139.555 68.077 c h
101.539 82.838 m 101.539 99.682 l 106.473 98.791 111.551 98.323 116.734
 98.323 c 121.922 98.323 127 98.791 131.934 99.682 c 131.934 82.838 l 131.934
 74.459 125.113 67.643 116.734 67.643 c 108.355 67.643 101.539 74.459 101.539
 82.838 c h
190.02 183.6 m 190.02 143.194 157.145 110.319 116.734 110.319 c 76.328 
110.319 43.453 143.194 43.453 183.6 c 43.453 268.592 l 54.441 262.971 67.125
 259.936 80.152 259.936 c 105.133 259.936 127.742 270.756 140.52 288.491
 c 146.363 286.53 152.969 286.502 158.855 288.44 c 165.484 281.495 174.926
 277.459 184.961 277.459 c 186.664 277.459 188.352 277.577 190.016 277.803
 c 190.016 183.6 l h
221.477 203.209 m 221.477 192.905 213.098 184.526 202.793 184.526 c 202.016
 184.526 l 202.016 221.893 l 202.793 221.893 l 213.098 221.897 221.477 213.514
 221.477 203.209 c h
164.219 321.702 m 176.34 303.987 l 177.418 302.413 179.18 301.444 181.086
 301.377 c 181.156 301.377 181.223 301.377 181.293 301.377 c 183.125 301.377
 184.859 302.213 186 303.659 c 199.426 320.666 l 200.16 320.666 l 200.199
 320.631 200.238 320.592 200.277 320.557 c 205.309 316.487 208.195 310.623
 208.195 304.471 c 208.195 302.647 207.941 300.827 207.441 299.061 c 207.145
 298.006 207.141 296.889 207.434 295.834 c 207.812 294.459 208.105 293.319
 208.355 292.248 c 209.984 285.272 210.809 278.073 210.809 270.846 c 210.809
 232.823 l 208.254 233.514 205.566 233.893 202.793 233.893 c 202.012 233.893
 l 202.012 283.709 l 202.012 284.006 201.984 284.295 201.941 284.58 c 202.098
 285.577 202.004 286.627 201.617 287.635 c 200.434 290.725 196.961 292.272
 193.871 291.088 c 191.047 290.006 188.051 289.455 184.961 289.455 c 177.102
 289.455 169.828 293.088 165.508 299.17 c 163.758 301.639 160.438 302.416
 157.77 300.975 c 155.352 299.67 152.586 298.979 149.77 298.979 c 146.766
 298.979 143.844 299.76 141.312 301.229 c 138.465 302.889 134.805 301.936
 133.129 299.092 c 123.406 282.592 102.613 271.932 80.152 271.932 c 65.676
 271.932 51.766 276.264 40.984 284.123 c 38.309 286.077 34.559 285.487 32.605
 282.811 c 31.562 281.381 31.254 279.643 31.59 278.038 c 31.504 277.631 
31.457 277.213 31.457 276.784 c 31.457 233.893 l 30.68 233.893 l 27.906 
233.893 25.219 233.514 22.66 232.823 c 22.66 270.846 l 22.66 277.061 23.273
 283.272 24.48 289.311 c 24.723 290.534 25.004 291.807 25.32 293.1 c 25.637
 294.389 25.512 295.752 24.969 296.963 c 22.648 302.151 21.473 307.592 21.473
 313.143 c 21.473 313.975 21.512 314.893 21.586 315.944 c 21.605 316.237
 21.605 316.526 21.586 316.819 c 21.508 317.834 21.473 318.67 21.473 319.452
 c 21.473 342.737 44.281 361.678 72.316 361.678 c 88.023 361.678 102.609
 355.76 112.34 345.444 c 114.457 343.202 117.422 342.065 120.484 342.315
 c 123.574 342.569 126.344 344.202 128.086 346.791 c 129.457 348.838 131.211
 350.678 133.258 352.276 c 136.863 337.182 148.68 325.221 164.219 321.702
 c h
164.219 321.702 m f
357.223 178.225 m 252.461 178.225 l 235.047 178.225 220.875 164.057 220.875
 146.639 c 220.875 129.221 235.047 115.053 252.461 115.053 c 321.578 115.053
 l 327.613 98.952 l 328.492 96.612 330.73 95.061 333.23 95.061 c 335.73 
95.061 337.969 96.608 338.844 98.952 c 344.883 115.053 l 357.223 115.053
 l 374.637 115.053 388.809 129.221 388.809 146.639 c 388.809 164.057 374.637
 178.225 357.223 178.225 c h
357.223 127.045 m 340.727 127.045 l 338.227 127.045 335.988 125.495 335.113
 123.155 c 333.23 118.135 l 331.348 123.155 l 330.469 125.495 328.234 127.045
 325.734 127.045 c 252.461 127.045 l 241.66 127.045 232.871 135.834 232.871
 146.639 c 232.871 157.44 241.66 166.229 252.461 166.229 c 357.223 166.229
 l 368.023 166.229 376.812 157.44 376.812 146.639 c 376.812 135.834 368.023
 127.045 357.223 127.045 c h
357.223 127.045 m f
Q Q
showpage
%%Trailer
end restore
%%EOF
