%!PS-Adobe-3.0 EPSF-3.0
%%Creator: cairo 1.14.2 (http://cairographics.org)
%%CreationDate: Mon Feb 19 09:15:05 2018
%%Pages: 1
%%DocumentData: Clean7Bit
%%LanguageLevel: 2
%%BoundingBox: 0 70 410 340
%%EndComments
%%BeginProlog
save
50 dict begin
/q { gsave } bind def
/Q { grestore } bind def
/cm { 6 array astore concat } bind def
/w { setlinewidth } bind def
/J { setlinecap } bind def
/j { setlinejoin } bind def
/M { setmiterlimit } bind def
/d { setdash } bind def
/m { moveto } bind def
/l { lineto } bind def
/c { curveto } bind def
/h { closepath } bind def
/re { exch dup neg 3 1 roll 5 3 roll moveto 0 rlineto
      0 exch rlineto 0 rlineto closepath } bind def
/S { stroke } bind def
/f { fill } bind def
/f* { eofill } bind def
/n { newpath } bind def
/W { clip } bind def
/W* { eoclip } bind def
/BT { } bind def
/ET { } bind def
/pdfmark where { pop globaldict /?pdfmark /exec load put }
    { globaldict begin /?pdfmark /pop load def /pdfmark
    /cleartomark load def end } ifelse
/BDC { mark 3 1 roll /BDC pdfmark } bind def
/EMC { mark /EMC pdfmark } bind def
/cairo_store_point { /cairo_point_y exch def /cairo_point_x exch def } def
/Tj { show currentpoint cairo_store_point } bind def
/TJ {
  {
    dup
    type /stringtype eq
    { show } { -0.001 mul 0 cairo_font_matrix dtransform rmoveto } ifelse
  } forall
  currentpoint cairo_store_point
} bind def
/cairo_selectfont { cairo_font_matrix aload pop pop pop 0 0 6 array astore
    cairo_font exch selectfont cairo_point_x cairo_point_y moveto } bind def
/Tf { pop /cairo_font exch def /cairo_font_matrix where
      { pop cairo_selectfont } if } bind def
/Td { matrix translate cairo_font_matrix matrix concatmatrix dup
      /cairo_font_matrix exch def dup 4 get exch 5 get cairo_store_point
      /cairo_font where { pop cairo_selectfont } if } bind def
/Tm { 2 copy 8 2 roll 6 array astore /cairo_font_matrix exch def
      cairo_store_point /cairo_font where { pop cairo_selectfont } if } bind def
/g { setgray } bind def
/rg { setrgbcolor } bind def
/d1 { setcachedevice } bind def
%%EndProlog
%%BeginSetup
%%EndSetup
%%Page: 1 1
%%BeginPageSetup
%%PageBoundingBox: 0 70 410 340
%%EndPageSetup
q 0 70 410 270 rectclip q
1 0.811765 0.34902 rg
135.73 293.143 m 15.98 293.143 l 10.262 293.143 5.621 288.506 5.621 282.788
 c 5.621 117.979 l 5.621 112.256 10.262 107.62 15.98 107.62 c 49.145 107.62
 l 64.188 80.975 l 65.469 78.702 68.723 78.643 70.09 80.87 c 86.484 107.62
 l 264.312 107.62 l 270.035 107.62 274.672 112.256 274.672 117.979 c 274.672
 293.143 l h
135.73 293.143 m f
1 0.709804 0.360784 rg
117.258 293.143 m 117.258 156.291 l 117.258 141.854 129.004 130.108 143.441
 130.108 c 274.672 130.108 l 274.672 293.143 l h
117.258 293.143 m f
0.909804 0.882353 0.839216 rg
339.469 147.776 m 143.441 147.776 l 138.738 147.776 134.926 151.588 134.926
 156.291 c 134.926 324.788 l 134.926 329.491 138.738 333.303 143.441 333.303
 c 395.465 333.303 l 400.168 333.303 403.977 329.491 403.977 324.788 c 403.977
 156.291 l 403.977 151.588 400.168 147.776 395.465 147.776 c 372.914 147.776
 l 359.461 104.37 l 358.465 101.155 353.914 101.155 352.918 104.37 c h
339.469 147.776 m f
339.469 147.776 m 143.441 147.776 l 138.738 147.776 134.926 151.588 134.926
 156.291 c 134.926 324.788 l 134.926 329.491 138.738 333.303 143.441 333.303
 c 395.465 333.303 l 400.168 333.303 403.977 329.491 403.977 324.788 c 403.977
 156.291 l 403.977 151.588 400.168 147.776 395.465 147.776 c 372.914 147.776
 l 359.461 104.37 l 358.465 101.155 353.914 101.155 352.918 104.37 c h
339.469 147.776 m f
0.886275 0.8 0.686275 rg
182.301 156.291 m 182.301 324.788 l 182.301 329.491 186.113 333.303 190.816
 333.303 c 143.441 333.303 l 138.738 333.303 134.926 329.491 134.926 324.788
 c 134.926 156.291 l 134.926 151.588 138.738 147.776 143.441 147.776 c 190.816
 147.776 l 186.113 147.776 182.301 151.588 182.301 156.291 c h
182.301 156.291 m f
0.192157 0.823529 0.968627 rg
163.289 240.139 m 159.164 240.139 155.809 243.495 155.809 247.62 c 155.809
 272.815 l 155.809 276.94 159.164 280.295 163.289 280.295 c 374.008 280.295
 l 378.133 280.295 381.488 276.94 381.488 272.815 c 381.488 247.62 l 381.488
 243.495 378.133 240.139 374.008 240.139 c h
163.289 240.139 m f
0.0745098 0.67451 0.909804 rg
163.289 280.295 m 159.164 280.295 155.809 276.94 155.809 272.815 c 155.809
 247.62 l 155.809 243.495 159.164 240.139 163.289 240.139 c 182.301 240.139
 l 182.301 280.295 l h
163.289 280.295 m f
1 0.811765 0.34902 rg
163.84 175.889 m 159.855 175.889 156.613 179.131 156.613 183.116 c 156.613
 208.01 l 156.613 211.998 159.855 215.241 163.84 215.241 c 208.012 215.241
 l 211.996 215.241 215.242 211.998 215.242 208.01 c 215.242 183.116 l 215.242
 179.131 211.996 175.889 208.012 175.889 c h
163.84 175.889 m f
1 0.709804 0.360784 rg
163.84 215.241 m 159.855 215.241 156.613 211.998 156.613 208.01 c 156.613
 183.116 l 156.613 179.131 159.855 175.889 163.84 175.889 c 182.301 175.889
 l 182.301 215.241 l h
163.84 215.241 m f
1 0.384314 0.654902 rg
134.926 306.104 m 134.926 324.788 l 134.926 329.483 138.746 333.303 143.441
 333.303 c 395.465 333.303 l 400.16 333.303 403.98 329.483 403.98 324.788
 c 403.98 306.104 l h
134.926 306.104 m f
0.988235 0.329412 0.47451 rg
190.816 333.303 m 143.441 333.303 l 138.746 333.303 134.926 329.483 134.926
 324.788 c 134.926 306.104 l 182.301 306.104 l 182.301 324.788 l 182.301
 329.483 186.121 333.303 190.816 333.303 c h
190.816 333.303 m f
0 g
395.465 338.924 m 143.441 338.924 l 135.645 338.924 129.305 332.58 129.305
 324.788 c 129.305 298.768 l 15.98 298.768 l 7.168 298.768 0 291.596 0 282.788
 c 0 117.979 l 0 109.166 7.168 101.998 15.98 101.998 c 45.863 101.998 l 
61.816 73.737 l 62.867 71.881 64.82 70.713 66.953 70.678 c 66.988 70.674
 67.027 70.674 67.062 70.674 c 69.156 70.674 71.102 71.764 72.199 73.553
 c 89.633 101.998 l 264.312 101.998 l 273.125 101.998 280.297 109.166 280.297
 117.979 c 280.297 142.155 l 335.324 142.155 l 350.438 93.389 l 351.223 
90.866 353.551 89.147 356.191 89.147 c 358.832 89.147 361.164 90.866 361.945
 93.389 c 377.059 142.155 l 395.465 142.155 l 403.258 142.155 409.602 148.498
 409.602 156.291 c 409.602 324.788 l 409.602 332.58 403.258 338.924 395.465
 338.924 c h
397.555 156.291 m 397.555 155.135 396.617 154.202 395.465 154.202 c 372.621
 154.202 l 369.98 154.202 367.648 152.483 366.867 149.963 c 356.191 115.518
 l 345.516 149.963 l 344.734 152.483 342.402 154.202 339.762 154.202 c 143.441
 154.202 l 142.289 154.202 141.352 155.139 141.352 156.291 c 141.352 202.077
 l 141.352 205.405 138.656 208.1 135.328 208.1 c 132.004 208.1 129.305 205.405
 129.305 202.077 c 129.305 156.291 l 129.305 148.483 135.633 142.155 143.441
 142.155 c 268.246 142.155 l 268.246 117.979 l 268.246 115.807 266.488 114.045
 264.312 114.045 c 86.258 114.045 l 84.164 114.045 82.219 112.955 81.125
 111.17 c 67.273 88.577 l 54.625 110.983 l 53.559 112.873 51.555 114.045
 49.379 114.045 c 15.98 114.045 l 13.809 114.045 12.047 115.807 12.047 117.979
 c 12.047 282.788 l 12.047 284.959 13.809 286.721 15.98 286.721 c 129.305
 286.721 l 129.305 241.272 l 129.305 237.944 132 235.248 135.328 235.248
 c 138.652 235.248 141.352 237.944 141.352 241.272 c 141.352 300.483 l 397.551
 300.483 l 397.551 156.291 l h
397.555 312.53 m 141.352 312.53 l 141.352 324.788 l 141.352 325.94 142.289
 326.877 143.441 326.877 c 395.465 326.877 l 396.617 326.877 397.555 325.94
 397.555 324.788 c h
397.555 312.53 m f
374.008 285.916 m 163.289 285.916 l 156.055 285.916 150.188 280.049 150.188
 272.815 c 150.188 247.62 l 150.188 240.381 156.055 234.518 163.289 234.518
 c 298.902 234.518 l 302.23 234.518 304.926 237.213 304.926 240.541 c 304.926
 243.866 302.23 246.565 298.902 246.565 c 163.289 246.565 l 162.707 246.565
 162.234 247.038 162.234 247.62 c 162.234 272.815 l 162.234 273.397 162.707
 273.87 163.289 273.87 c 374.008 273.87 l 374.594 273.87 375.062 273.397
 375.062 272.815 c 375.062 247.62 l 375.062 247.034 374.59 246.565 374.008
 246.565 c 338.098 246.565 l 334.773 246.565 332.074 243.866 332.074 240.541
 c 332.074 237.213 334.773 234.518 338.098 234.518 c 374.008 234.518 l 381.246
 234.518 387.109 240.381 387.109 247.62 c 387.109 272.815 l 387.113 280.049
 381.246 285.916 374.008 285.916 c h
374.008 285.916 m f
208.012 220.862 m 163.84 220.862 l 156.754 220.862 150.988 215.096 150.988
 208.01 c 150.988 183.116 l 150.988 176.03 156.754 170.264 163.84 170.264
 c 208.012 170.264 l 215.098 170.264 220.863 176.03 220.863 183.116 c 220.863
 208.01 l 220.863 215.096 215.098 220.862 208.012 220.862 c h
208.816 183.116 m 208.816 182.674 208.457 182.311 208.012 182.311 c 163.84
 182.311 l 163.398 182.311 163.035 182.674 163.035 183.116 c 163.035 208.01
 l 163.035 208.455 163.398 208.815 163.84 208.815 c 208.012 208.815 l 208.457
 208.815 208.816 208.455 208.816 208.01 c h
208.816 183.116 m f
377.875 215.241 m 232.508 215.241 l 229.18 215.241 226.484 212.545 226.484
 209.217 c 226.484 205.893 229.18 203.194 232.508 203.194 c 377.875 203.194
 l 381.203 203.194 383.898 205.893 383.898 209.217 c 383.898 212.545 381.203
 215.241 377.875 215.241 c h
377.875 215.241 m f
305.594 190.342 m 232.508 190.342 l 229.18 190.342 226.484 187.647 226.484
 184.319 c 226.484 180.995 229.18 178.295 232.508 178.295 c 305.594 178.295
 l 308.922 178.295 311.617 180.995 311.617 184.319 c 311.617 187.647 308.922
 190.342 305.594 190.342 c h
305.594 190.342 m f
369.844 190.342 m 328.887 190.342 l 325.559 190.342 322.863 187.647 322.863
 184.319 c 322.863 180.995 325.559 178.295 328.887 178.295 c 369.844 178.295
 l 373.172 178.295 375.867 180.995 375.867 184.319 c 375.867 187.647 373.172
 190.342 369.844 190.342 c h
369.844 190.342 m f
Q Q
showpage
%%Trailer
end restore
%%EOF
