%!PS-Adobe-3.0 EPSF-3.0
%%Creator: cairo 1.14.2 (http://cairographics.org)
%%CreationDate: Mon Feb 19 09:15:05 2018
%%Pages: 1
%%DocumentData: Clean7Bit
%%LanguageLevel: 2
%%BoundingBox: 0 5 410 404
%%EndComments
%%BeginProlog
save
50 dict begin
/q { gsave } bind def
/Q { grestore } bind def
/cm { 6 array astore concat } bind def
/w { setlinewidth } bind def
/J { setlinecap } bind def
/j { setlinejoin } bind def
/M { setmiterlimit } bind def
/d { setdash } bind def
/m { moveto } bind def
/l { lineto } bind def
/c { curveto } bind def
/h { closepath } bind def
/re { exch dup neg 3 1 roll 5 3 roll moveto 0 rlineto
      0 exch rlineto 0 rlineto closepath } bind def
/S { stroke } bind def
/f { fill } bind def
/f* { eofill } bind def
/n { newpath } bind def
/W { clip } bind def
/W* { eoclip } bind def
/BT { } bind def
/ET { } bind def
/pdfmark where { pop globaldict /?pdfmark /exec load put }
    { globaldict begin /?pdfmark /pop load def /pdfmark
    /cleartomark load def end } ifelse
/BDC { mark 3 1 roll /BDC pdfmark } bind def
/EMC { mark /EMC pdfmark } bind def
/cairo_store_point { /cairo_point_y exch def /cairo_point_x exch def } def
/Tj { show currentpoint cairo_store_point } bind def
/TJ {
  {
    dup
    type /stringtype eq
    { show } { -0.001 mul 0 cairo_font_matrix dtransform rmoveto } ifelse
  } forall
  currentpoint cairo_store_point
} bind def
/cairo_selectfont { cairo_font_matrix aload pop pop pop 0 0 6 array astore
    cairo_font exch selectfont cairo_point_x cairo_point_y moveto } bind def
/Tf { pop /cairo_font exch def /cairo_font_matrix where
      { pop cairo_selectfont } if } bind def
/Td { matrix translate cairo_font_matrix matrix concatmatrix dup
      /cairo_font_matrix exch def dup 4 get exch 5 get cairo_store_point
      /cairo_font where { pop cairo_selectfont } if } bind def
/Tm { 2 copy 8 2 roll 6 array astore /cairo_font_matrix exch def
      cairo_store_point /cairo_font where { pop cairo_selectfont } if } bind def
/g { setgray } bind def
/rg { setrgbcolor } bind def
/d1 { setcachedevice } bind def
%%EndProlog
%%BeginSetup
%%EndSetup
%%Page: 1 1
%%BeginPageSetup
%%PageBoundingBox: 0 5 410 404
%%EndPageSetup
q 0 5 410 399 rectclip q
0.207843 g
228.945 114.491 m 222.586 133.194 218.613 153.166 217.145 173.854 c 216.605
 181.455 l 217.773 224.479 l 217.773 270.924 l 217.773 278.647 216.891 286.346
 215.152 293.803 c 214.895 294.901 214.59 296.092 214.191 297.538 c 214.832
 299.838 215.156 302.209 215.156 304.592 c 215.156 312.631 211.461 320.256
 205.004 325.553 c 203.078 327.209 l 202.016 327.209 l 140.836 363.084 l
 131.578 358.213 l 129.398 357.069 127.395 355.592 125.75 353.76 c 125.738
 353.752 125.73 353.741 125.719 353.729 c 124.18 352.014 121.973 351.03 
119.66 351.03 c 117.672 351.03 115.762 351.756 114.289 353.077 c 103.516
 362.733 88.359 368.268 72.711 368.268 c 41.109 368.268 15.402 346.428 15.402
 319.584 c 15.402 318.639 15.441 317.651 15.531 316.53 c 15.441 315.323 
15.402 314.256 15.402 313.268 c 15.402 306.85 16.746 300.565 19.402 294.58
 c 19.078 293.252 18.789 291.936 18.535 290.663 c 17.242 284.205 16.59 277.561
 16.59 270.924 c 16.59 224.479 l 18.887 180.901 l 18.359 173.596 l 16.875
 152.995 12.91 133.112 6.578 114.491 c 4.68 108.916 5.602 102.963 9.109 
98.198 c 12.551 93.526 18.141 90.92 23.941 90.92 c 211.578 90.92 l 217.383
 90.92 222.973 93.526 226.414 98.198 c 229.922 102.963 230.844 108.916 228.945
 114.491 c h
196.16 284.487 m 196.055 284.62 195.953 284.76 195.848 284.901 c 195.949
 284.936 196.055 284.967 196.156 285.002 c 196.156 284.975 196.156 284.944
 196.16 284.916 c h
196.16 284.487 m f
0.188235 0.164706 0.129412 rg
83.367 98.198 m 79.863 102.963 78.941 108.916 80.836 114.495 c 87.172 133.112
 91.137 152.995 92.621 173.596 c 93.145 180.901 l 90.848 224.483 l 90.848
 270.924 l 90.848 277.565 91.504 284.205 92.793 290.666 c 93.047 291.936
 93.34 293.252 93.66 294.584 c 91.008 300.565 89.66 306.85 89.66 313.268
 c 89.66 314.256 89.703 315.323 89.789 316.534 c 89.703 317.651 89.66 318.639
 89.66 319.584 c 89.66 334.409 97.512 347.702 109.855 356.635 c 99.551 364.077
 86.32 368.268 72.711 368.268 c 41.109 368.268 15.402 346.432 15.402 319.584
 c 15.402 318.639 15.441 317.651 15.531 316.534 c 15.441 315.323 15.402 
314.256 15.402 313.268 c 15.402 306.85 16.746 300.565 19.402 294.584 c 19.078
 293.252 18.789 291.936 18.535 290.666 c 17.242 284.205 16.59 277.565 16.59
 270.924 c 16.59 224.483 l 18.887 180.901 l 18.359 173.596 l 16.875 152.995
 12.91 133.112 6.578 114.495 c 4.68 108.916 5.602 102.963 9.109 98.198 c
 12.551 93.526 18.141 90.92 23.941 90.92 c 98.203 90.92 l 92.398 90.92 86.809
 93.526 83.367 98.198 c h
83.367 98.198 m f
1 0.384314 0.654902 rg
153.176 74.315 m 81.188 74.315 l 59.719 74.315 42.254 56.846 42.254 35.377
 c 42.254 20.686 l 42.254 15.686 46.32 11.62 51.32 11.62 c 183.043 11.62
 l 188.043 11.62 192.109 15.686 192.109 20.686 c 192.109 35.377 l 192.113
 56.85 174.645 74.315 153.176 74.315 c h
153.176 74.315 m f
0.988235 0.329412 0.47451 rg
136.547 74.315 m 81.188 74.315 l 59.684 74.315 42.254 56.881 42.254 35.377
 c 42.254 20.686 l 42.254 15.678 46.312 11.62 51.32 11.62 c 89.934 11.62
 l 84.934 11.62 80.863 15.686 80.863 20.686 c 80.863 35.377 l 80.863 35.455
 80.863 35.53 80.863 35.604 c 80.91 43.83 90.367 48.538 97.016 43.694 c 
102.82 39.467 109.988 37.01 117.73 37.131 c 136.582 37.428 151.523 53.221
 151.523 72.077 c 151.523 74.311 l 136.547 74.311 l h
136.547 74.315 m f
0.764706 0.854902 0.25098 rg
167.254 326.901 m 149.934 329.78 137.379 344.596 137.379 362.194 c 137.379
 381.928 153.43 397.979 173.164 397.979 c 368.211 397.979 l 387.941 397.979
 403.996 381.928 403.996 362.194 c 403.996 342.463 387.941 326.409 368.211
 326.409 c 196.453 326.409 l 180.992 306.823 l h
167.254 326.901 m f
0.678431 0.737255 0.0823529 rg
158.996 335.577 m 158.996 355.311 175.047 371.362 194.781 371.362 c 389.828
 371.362 l 394.629 371.362 399.207 370.405 403.395 368.686 c 400.332 385.327
 385.727 397.979 368.211 397.979 c 173.164 397.979 l 153.43 397.979 137.379
 381.928 137.379 362.194 c 137.379 347.319 146.348 334.436 159.582 329.061
 c 159.199 331.178 158.996 333.354 158.996 335.577 c h
158.996 335.577 m f
0.858824 0.682353 0.431373 rg
31.023 178.092 m 17.176 178.092 5.91 189.358 5.91 203.205 c 5.91 217.057
 17.176 228.319 31.023 228.319 c 38.207 228.319 l 38.207 178.092 l h
31.023 178.092 m f
196.16 178.092 m 196.16 228.319 l 203.344 228.319 l 217.191 228.319 228.457
 217.053 228.457 203.205 c 228.457 189.358 217.191 178.092 203.344 178.092
 c h
196.16 178.092 m f
0.980392 0.827451 0.576471 rg
117.18 61.069 m 105.262 61.069 95.562 70.768 95.562 82.69 c 95.562 115.225
 l 103.105 113.862 l 107.727 113.03 112.461 112.604 117.18 112.604 c 121.902
 112.604 126.641 113.03 131.258 113.862 c 138.801 115.225 l 138.801 82.69
 l 138.801 70.768 129.102 61.069 117.18 61.069 c h
117.18 61.069 m f
0.929412 0.717647 0.411765 rg
117.18 82.69 m 117.18 112.604 l 112.461 112.604 107.723 113.026 103.105
 113.862 c 95.562 115.225 l 95.562 82.69 l 95.562 70.768 105.262 61.069 
117.18 61.069 c 121.117 61.069 124.809 62.131 127.992 63.975 c 121.535 67.721
 117.18 74.705 117.18 82.69 c h
117.18 82.69 m f
0.980392 0.827451 0.576471 rg
117.18 103.795 m 73.191 103.795 37.406 139.584 37.406 183.573 c 37.406 
283.428 l 48.461 271.748 l 51.012 269.057 54.012 266.526 57.387 264.229 
c 69.871 255.729 86.48 251.049 104.152 251.049 c 132.637 251.049 158.547
 263.959 167.16 282.448 c 169.633 287.748 l 175.137 285.768 l 178.484 284.561
 181.969 283.952 185.492 283.952 c 186.898 283.952 188.312 284.045 189.691
 284.233 c 196.961 285.221 l 196.961 183.573 l 196.957 139.584 161.172 103.795
 117.18 103.795 c h
117.18 103.795 m f
0.929412 0.717647 0.411765 rg
189.691 284.237 m 188.312 284.049 186.898 283.952 185.492 283.952 c 181.969
 283.952 178.484 284.565 175.137 285.768 c 169.633 287.752 l 167.16 282.448
 l 158.547 263.963 132.637 251.053 104.152 251.053 c 86.48 251.053 69.871
 255.733 57.387 264.233 c 54.012 266.53 51.012 269.057 48.461 271.752 c 
37.402 283.432 l 37.402 184.534 l 37.402 140.459 72.742 103.998 116.816 
103.799 c 128.914 103.745 140.398 106.405 150.695 111.194 c 123.406 123.881
 104.434 151.553 104.434 183.577 c 104.434 202.952 l 104.434 214.733 112.645
 224.901 124.152 227.436 c 144.152 231.842 160.629 242.655 167.16 256.67
 c 168.559 259.674 172.02 261.112 175.137 259.991 c 178.484 258.788 181.969
 258.174 185.492 258.174 c 186.898 258.174 188.309 258.268 189.688 258.455
 c 196.957 259.448 l 196.957 285.229 l h
189.691 284.237 m f
0.192157 0.823529 0.968627 rg
341.367 120.545 m 268.285 120.545 l 253.938 120.545 242.266 132.221 242.266
 146.565 c 242.266 160.913 253.938 172.588 268.285 172.588 c 373.172 172.588
 l 387.52 172.588 399.191 160.913 399.191 146.565 c 399.191 132.221 387.52
 120.545 373.172 120.545 c 356.934 120.545 l 349.152 99.791 l h
341.367 120.545 m f
0.0745098 0.67451 0.909804 rg
263.648 126.545 m 263.648 140.897 275.32 152.569 289.668 152.569 c 394.555
 152.569 l 395.914 152.569 397.25 152.463 398.559 152.26 c 395.953 163.877
 385.562 172.588 373.172 172.588 c 268.285 172.588 l 253.938 172.588 242.266
 160.913 242.266 146.569 c 242.266 133.58 251.828 122.788 264.281 120.854
 c 263.871 122.686 263.648 124.592 263.648 126.545 c h
263.648 126.545 m f
348.875 100.526 m 349.152 99.788 l 349.426 100.526 l h
348.875 100.526 m f
0 g
367.516 403.584 m 173.164 403.584 l 151.477 403.584 133.648 386.819 131.922
 365.569 c 127.934 363.416 124.445 360.705 121.547 357.471 c 120.621 356.44
 119.043 356.342 118.027 357.252 c 106.066 367.971 89.969 373.873 72.707
 373.873 c 38.02 373.873 9.793 349.522 9.793 319.588 c 9.793 318.623 9.828
 317.631 9.906 316.495 c 9.832 315.327 9.793 314.268 9.793 313.268 c 9.793
 306.694 11.047 300.252 13.527 294.08 c 13.352 293.295 13.188 292.522 13.035
 291.764 c 11.672 284.944 10.98 277.932 10.98 270.924 c 10.98 226.459 l 
4.449 220.823 0.305 212.491 0.305 203.205 c 0.305 192.979 5.332 183.909 
13.043 178.323 c 11.863 156.663 7.906 135.795 1.273 116.299 c -1.164 109.139
 -0.066 101.506 4.277 95.323 c 8.762 88.936 16.238 85.319 24.043 85.319 
c 89.957 85.319 l 89.957 82.69 l 89.957 81.756 90.004 80.83 90.098 79.92
 c 81.188 79.92 l 56.59 79.92 36.648 59.979 36.648 35.381 c 36.648 20.69
 l 36.648 12.584 43.219 6.014 51.32 6.014 c 183.043 6.014 l 191.145 6.014
 197.715 12.584 197.715 20.69 c 197.715 35.381 l 197.715 59.979 177.777 
79.92 153.176 79.92 c 144.266 79.92 l 144.359 80.83 144.406 81.756 144.406
 82.69 c 144.406 85.319 l 211.48 85.319 l 219.285 85.319 226.762 88.932 
231.246 95.319 c 235.594 101.506 236.691 109.139 234.254 116.299 c 227.57
 135.94 223.598 156.975 222.453 178.811 c 222.445 178.928 222.43 179.041
 222.414 179.155 c 229.504 184.788 234.062 193.475 234.062 203.209 c 234.062
 212.495 229.914 220.823 223.379 226.463 c 223.379 270.928 l 223.379 279.08
 222.449 287.209 220.609 295.08 c 220.426 295.87 220.223 296.69 219.984 
297.592 c 220.5 299.893 220.762 302.241 220.762 304.596 c 220.762 310.342
 219.199 315.905 216.328 320.807 c 292.566 320.807 l 295.883 320.807 298.57
 323.495 298.57 326.811 c 298.57 330.127 295.883 332.819 292.566 332.819
 c 196.262 332.819 l 194.422 332.819 192.684 331.975 191.547 330.534 c 181.359
 317.627 l 172.441 330.663 l 171.531 331.995 170.125 332.932 168.527 333.186
 c 154.391 335.424 144.066 347.338 143.789 361.604 c 143.469 378.147 157.168
 391.577 173.711 391.577 c 367.66 391.577 l 383.703 391.577 397.203 378.944
 397.582 362.905 c 397.973 346.381 384.645 332.819 368.211 332.819 c 331.637
 332.819 l 328.324 332.819 325.633 330.127 325.633 326.811 c 325.633 323.495
 328.324 320.807 331.637 320.807 c 368.211 320.807 l 391.297 320.807 410.031
 339.811 409.594 362.998 c 409.164 385.655 390.18 403.584 367.516 403.584
 c h
12.312 203.205 m 12.312 213.522 20.707 221.916 31.023 221.916 c 31.801 
221.916 l 31.801 184.498 l 31.023 184.498 l 20.707 184.498 12.312 192.893
 12.312 203.205 c h
89.957 97.327 m 23.512 97.327 l 19.762 97.327 16.355 99.077 14.172 102.127
 c 12 105.159 11.441 108.913 12.641 112.432 c 19.164 131.6 23.227 151.998
 24.746 173.135 c 26.773 172.713 28.871 172.491 31.02 172.491 c 32.52 172.491
 l 36.77 139.823 59.562 112.897 89.957 102.643 c h
153.176 67.909 m 171.113 67.909 185.707 53.315 185.707 35.381 c 185.707
 20.686 l 185.707 19.221 184.512 18.026 183.043 18.026 c 51.32 18.026 l 
49.852 18.026 48.656 19.217 48.656 20.686 c 48.656 35.381 l 48.656 53.315
 63.25 67.909 81.188 67.909 c 94.336 67.909 l 99.191 60.428 107.617 55.463
 117.18 55.463 c 126.746 55.463 135.168 60.428 140.027 67.909 c h
101.969 82.69 m 101.969 99.553 l 106.906 98.659 111.992 98.194 117.18 98.194
 c 122.371 98.194 127.457 98.659 132.398 99.553 c 132.398 82.69 l 132.398
 74.299 125.57 67.475 117.18 67.475 c 108.793 67.475 101.969 74.299 101.969
 82.69 c h
117.18 110.202 m 76.727 110.202 43.809 143.116 43.809 183.573 c 43.809 
267.346 l 46.664 264.33 49.996 261.514 53.781 258.936 c 67.32 249.721 85.207
 244.643 104.152 244.643 c 135.68 244.643 163.34 259.08 172.965 279.741 
c 176.949 278.307 181.191 277.545 185.492 277.545 c 187.199 277.545 188.887
 277.663 190.551 277.889 c 190.551 183.573 l 190.555 143.116 157.637 110.202
 117.18 110.202 c h
222.883 112.428 m 224.078 108.913 223.523 105.159 221.352 102.127 c 219.168
 99.077 215.766 97.327 212.012 97.327 c 144.406 97.327 l 144.406 102.643
 l 174.801 112.893 197.59 139.819 201.844 172.487 c 203.34 172.487 l 205.898
 172.487 208.379 172.807 210.758 173.397 c 212.266 152.166 216.336 131.674
 222.883 112.428 c h
222.051 203.205 m 222.051 192.893 213.656 184.498 203.344 184.498 c 202.562
 184.498 l 202.562 221.916 l 203.344 221.916 l 213.656 221.916 222.051 213.522
 222.051 203.205 c h
163.922 321.846 m 176.059 304.108 l 177.137 302.53 178.902 301.561 180.809
 301.495 c 180.879 301.495 180.945 301.495 181.016 301.495 c 182.848 301.495
 184.586 302.33 185.727 303.776 c 199.172 320.803 l 200.707 320.803 l 200.746
 320.768 200.785 320.729 200.828 320.698 c 205.863 316.623 208.754 310.752
 208.754 304.592 c 208.754 302.764 208.5 300.94 208 299.174 c 207.699 298.12
 207.695 297.002 207.988 295.944 c 208.371 294.549 208.668 293.405 208.91
 292.35 c 210.543 285.37 211.371 278.159 211.371 270.924 c 211.371 232.854
 l 208.809 233.545 206.121 233.924 203.344 233.924 c 202.562 233.924 l 202.562
 285.08 l 202.562 285.143 202.555 285.205 202.555 285.268 c 202.598 286.084
 202.477 286.92 202.168 287.733 c 200.98 290.83 197.504 292.377 194.41 291.19
 c 191.586 290.108 188.586 289.557 185.492 289.557 c 181.855 289.557 178.285
 290.346 175.066 291.834 c 174.266 293.276 172.887 294.385 171.152 294.78
 c 167.922 295.514 164.703 293.491 163.969 290.256 c 163.871 289.83 163.766
 289.405 163.648 288.987 c 161.223 280.323 154.168 272.295 143.785 266.389
 c 132.758 260.112 118.684 256.655 104.152 256.655 c 87.594 256.655 72.105
 260.991 60.543 268.866 c 49.793 276.182 43.824 285.659 43.707 295.58 c 
43.703 295.92 l 43.688 299.225 41 301.893 37.699 301.893 c 37.68 301.893
 l 34.371 301.881 31.695 299.198 31.695 295.889 c 31.695 295.748 31.695 
295.608 31.695 295.467 c 31.801 276.866 l 31.801 233.924 l 31.023 233.924
 l 28.246 233.924 25.555 233.549 22.996 232.854 c 22.996 270.924 l 22.996
 277.143 23.605 283.366 24.816 289.413 c 25.059 290.635 25.344 291.909 25.656
 293.202 c 25.973 294.498 25.848 295.858 25.305 297.073 c 22.984 302.264
 21.805 307.713 21.805 313.272 c 21.805 314.104 21.844 315.022 21.918 316.077
 c 21.938 316.366 21.938 316.659 21.918 316.952 c 21.84 317.967 21.805 318.807
 21.805 319.588 c 21.805 342.901 44.641 361.866 72.711 361.866 c 86.805 
361.866 100.398 356.924 110.016 348.307 c 115.961 342.979 125.148 343.495
 130.492 349.455 c 131.277 350.33 132.137 351.151 133.055 351.916 c 136.809
 337.061 148.547 325.327 163.922 321.846 c h
163.922 321.846 m f
373.172 178.194 m 268.285 178.194 l 250.848 178.194 236.66 164.006 236.66
 146.565 c 236.66 129.127 250.848 114.94 268.285 114.94 c 337.484 114.94
 l 343.527 98.823 l 344.406 96.479 346.648 94.924 349.152 94.924 c 351.652
 94.924 353.895 96.479 354.773 98.823 c 360.816 114.94 l 373.172 114.94 
l 390.609 114.94 404.797 129.127 404.797 146.565 c 404.797 164.006 390.609
 178.194 373.172 178.194 c h
373.172 126.952 m 356.656 126.952 l 354.152 126.952 351.914 125.397 351.035
 123.053 c 349.152 118.03 l 347.266 123.053 l 346.387 125.397 344.148 126.952
 341.645 126.952 c 268.285 126.952 l 257.469 126.952 248.668 135.752 248.668
 146.565 c 248.668 157.381 257.469 166.182 268.285 166.182 c 373.168 166.182
 l 383.988 166.182 392.785 157.381 392.785 146.565 c 392.785 135.752 383.988
 126.952 373.172 126.952 c h
373.172 126.952 m f
Q Q
showpage
%%Trailer
end restore
%%EOF
