%!PS-Adobe-3.0 EPSF-3.0
%%Creator: cairo 1.14.2 (http://cairographics.org)
%%CreationDate: Mon Feb 19 09:15:05 2018
%%Pages: 1
%%DocumentData: Clean7Bit
%%LanguageLevel: 2
%%BoundingBox: 0 36 410 373
%%EndComments
%%BeginProlog
save
50 dict begin
/q { gsave } bind def
/Q { grestore } bind def
/cm { 6 array astore concat } bind def
/w { setlinewidth } bind def
/J { setlinecap } bind def
/j { setlinejoin } bind def
/M { setmiterlimit } bind def
/d { setdash } bind def
/m { moveto } bind def
/l { lineto } bind def
/c { curveto } bind def
/h { closepath } bind def
/re { exch dup neg 3 1 roll 5 3 roll moveto 0 rlineto
      0 exch rlineto 0 rlineto closepath } bind def
/S { stroke } bind def
/f { fill } bind def
/f* { eofill } bind def
/n { newpath } bind def
/W { clip } bind def
/W* { eoclip } bind def
/BT { } bind def
/ET { } bind def
/pdfmark where { pop globaldict /?pdfmark /exec load put }
    { globaldict begin /?pdfmark /pop load def /pdfmark
    /cleartomark load def end } ifelse
/BDC { mark 3 1 roll /BDC pdfmark } bind def
/EMC { mark /EMC pdfmark } bind def
/cairo_store_point { /cairo_point_y exch def /cairo_point_x exch def } def
/Tj { show currentpoint cairo_store_point } bind def
/TJ {
  {
    dup
    type /stringtype eq
    { show } { -0.001 mul 0 cairo_font_matrix dtransform rmoveto } ifelse
  } forall
  currentpoint cairo_store_point
} bind def
/cairo_selectfont { cairo_font_matrix aload pop pop pop 0 0 6 array astore
    cairo_font exch selectfont cairo_point_x cairo_point_y moveto } bind def
/Tf { pop /cairo_font exch def /cairo_font_matrix where
      { pop cairo_selectfont } if } bind def
/Td { matrix translate cairo_font_matrix matrix concatmatrix dup
      /cairo_font_matrix exch def dup 4 get exch 5 get cairo_store_point
      /cairo_font where { pop cairo_selectfont } if } bind def
/Tm { 2 copy 8 2 roll 6 array astore /cairo_font_matrix exch def
      cairo_store_point /cairo_font where { pop cairo_selectfont } if } bind def
/g { setgray } bind def
/rg { setrgbcolor } bind def
/d1 { setcachedevice } bind def
%%EndProlog
%%BeginSetup
%%EndSetup
%%Page: 1 1
%%BeginPageSetup
%%PageBoundingBox: 0 36 410 373
%%EndPageSetup
q 0 36 410 337 rectclip q
0.909804 0.882353 0.839216 rg
391.348 296.6 m 18.254 296.6 l 11.277 296.6 5.602 290.924 5.602 283.948
 c 5.602 55.651 l 5.602 48.674 11.277 42.998 18.254 42.998 c 391.348 42.998
 l 398.324 42.998 404 48.674 404 55.651 c 404 283.948 l 404 290.924 398.324
 296.6 391.348 296.6 c h
391.348 296.6 m f
0.886275 0.8 0.686275 rg
166.398 82.998 m 153.824 82.998 143.633 93.42 144.012 106.077 c 144.371
 118.26 154.688 127.799 166.875 127.799 c 314.387 127.799 l 316.891 127.799
 317.914 124.584 315.871 123.135 c 300 111.893 l 300 105.401 l 300 93.03
 289.973 82.998 277.602 82.998 c h
166.398 82.998 m f
133.723 169.401 m 121.352 169.401 111.324 179.428 111.324 191.799 c 111.324
 197.725 l 95.508 208.928 l 93.199 210.565 94.355 214.202 97.188 214.202
 c 193.246 214.202 l 205.434 214.202 215.75 204.663 216.113 192.479 c 216.488
 179.819 206.301 169.401 193.723 169.401 c h
133.723 169.401 m f
230.066 216.202 m 290.938 216.202 l 300.844 216.202 308.902 224.26 308.902
 234.163 c 308.902 296.6 l 212.102 296.6 l 212.102 234.163 l 212.102 224.26
 220.16 216.202 230.066 216.202 c h
230.066 216.202 m f
0.764706 0.854902 0.25098 rg
371.859 116.135 m 368.918 120.709 l 348.688 120.713 l 345.738 116.155 l
 344.117 113.647 343.262 110.737 343.262 107.733 c 343.262 105.248 l 343.262
 103.327 344.602 101.663 346.48 101.256 c 348.305 100.862 l 351.965 100.069
 355.625 99.666 359.188 99.666 c 362.848 99.666 366.348 100.1 369.586 100.963
 c 371.305 101.42 l 373.094 101.897 374.34 103.514 374.34 105.37 c 374.34
 107.733 l 374.34 110.702 373.48 113.608 371.859 116.135 c h
371.859 116.135 m f
358.801 116.295 m 351 116.295 344.652 122.639 344.652 130.44 c 344.652 
138.241 351 144.588 358.801 144.588 c 366.602 144.588 372.945 138.241 372.945
 130.44 c 372.945 122.643 366.602 116.295 358.801 116.295 c h
358.801 116.295 m f
0.917647 0.231373 0.219608 rg
61.457 203.334 m 58.52 207.909 l 38.285 207.913 l 35.34 203.354 l 33.719
 200.846 32.859 197.936 32.859 194.932 c 32.859 192.448 l 32.859 190.526
 34.203 188.862 36.082 188.455 c 37.906 188.061 l 41.566 187.268 45.227 
186.866 48.789 186.866 c 52.449 186.866 55.949 187.299 59.188 188.163 c 
60.906 188.62 l 62.695 189.096 63.941 190.717 63.941 192.569 c 63.941 194.932
 l 63.938 197.905 63.082 200.807 61.457 203.334 c h
61.457 203.334 m f
48.398 203.276 m 40.48 203.276 34.035 209.721 34.035 217.643 c 34.035 225.561
 40.48 232.006 48.398 232.006 c 56.32 232.006 62.766 225.561 62.766 217.643
 c 62.766 209.721 56.32 203.276 48.398 203.276 c h
48.398 203.276 m f
0.192157 0.823529 0.968627 rg
172 98.998 m 159.422 98.998 149.234 109.42 149.609 122.077 c 149.973 134.26
 160.289 143.799 172.477 143.799 c 319.988 143.799 l 322.492 143.799 323.516
 140.584 321.473 139.135 c 305.602 127.893 l 305.602 121.401 l 305.602 109.03
 295.57 98.998 283.199 98.998 c h
172 98.998 m f
1 0.811765 0.34902 rg
128 183.799 m 115.629 183.799 105.602 193.83 105.602 206.202 c 105.602 
212.127 l 89.785 223.327 l 87.477 224.963 88.633 228.6 91.465 228.6 c 187.523
 228.6 l 199.711 228.6 210.027 219.061 210.391 206.877 c 210.766 194.217
 200.578 183.799 188 183.799 c h
128 183.799 m f
1 0.384314 0.654902 rg
391.348 296.6 m 18.254 296.6 l 11.277 296.6 5.602 290.924 5.602 283.948
 c 5.602 265.401 l 404 265.401 l 404 283.948 l 404 290.924 398.324 296.6
 391.348 296.6 c h
391.348 296.6 m f
0.988235 0.329412 0.47451 rg
230.398 265.401 m 308.902 265.401 l 308.902 296.6 l 212.102 296.6 l 212.102
 265.401 l h
230.398 265.401 m f
0.192157 0.823529 0.968627 rg
245.965 230.998 m 236.043 230.998 228 239.041 228 248.963 c 228 341.834
 l 228 351.756 236.043 359.799 245.965 359.799 c 336.902 359.799 l 341.133
 359.799 343.203 354.639 340.145 351.717 c 324.801 337.038 l 324.801 248.963
 l 324.801 239.041 316.758 230.998 306.836 230.998 c h
245.965 230.998 m f
1 0.384314 0.654902 rg
18.254 42.998 m 11.277 42.998 5.602 48.674 5.602 55.651 c 5.602 73.401 
l 404 73.401 l 404 55.651 l 404 48.674 398.324 42.998 391.348 42.998 c h
18.254 42.998 m f
0.764706 0.854902 0.25098 rg
378.801 338.459 m 370.871 338.459 364.418 344.913 364.418 352.842 c 364.418
 360.772 370.871 367.221 378.801 367.221 c 386.73 367.221 393.18 360.772
 393.18 352.842 c 393.18 344.913 386.73 338.459 378.801 338.459 c h
378.801 338.459 m f
391.859 338.534 m 388.918 343.108 l 368.688 343.112 l 365.738 338.553 l
 364.117 336.049 363.262 333.135 363.262 330.131 c 363.262 326.756 l 363.262
 325.354 364.238 324.143 365.605 323.846 c 368.305 323.26 l 371.965 322.467
 375.625 322.065 379.188 322.065 c 382.852 322.065 386.348 322.502 389.586
 323.362 c 392.129 324.038 l 393.434 324.385 394.34 325.565 394.34 326.916
 c 394.34 330.131 l 394.34 333.104 393.48 336.006 391.859 338.534 c h
391.859 338.534 m f
0.678431 0.737255 0.0823529 rg
361.078 100.862 m 359.254 101.256 l 357.375 101.663 356.031 103.327 356.031
 105.248 c 356.031 107.733 l 356.031 110.733 356.891 113.647 358.512 116.155
 c 361.457 120.709 l 348.684 120.709 l 345.738 116.155 l 344.117 113.647
 343.262 110.733 343.262 107.729 c 343.262 105.245 l 343.262 103.323 344.602
 101.663 346.48 101.256 c 348.305 100.858 l 351.965 100.065 355.625 99.663
 359.188 99.663 c 361.32 99.663 363.387 99.83 365.391 100.123 c 363.957 
100.315 362.52 100.545 361.078 100.862 c h
361.078 100.862 m f
357.426 130.44 m 357.426 135.944 360.59 140.709 365.188 143.045 c 363.266
 144.026 361.098 144.588 358.801 144.588 c 351 144.588 344.652 138.241 344.652
 130.44 c 344.652 122.643 351 116.295 358.801 116.295 c 361.098 116.295 
363.266 116.858 365.188 117.834 c 360.59 120.174 357.426 124.94 357.426 
130.44 c h
357.426 130.44 m f
0.894118 0.00392157 0.211765 rg
50.676 188.061 m 48.852 188.455 l 46.973 188.862 45.633 190.526 45.633 
192.448 c 45.633 194.932 l 45.633 197.936 46.488 200.846 48.109 203.354 
c 51.055 207.909 l 38.285 207.909 l 35.336 203.354 l 33.719 200.846 32.859
 197.932 32.859 194.932 c 32.859 192.448 l 32.859 190.526 34.199 188.862
 36.078 188.455 c 37.906 188.061 l 41.566 187.264 45.227 186.862 48.785 
186.862 c 50.922 186.862 52.988 187.03 54.992 187.323 c 53.555 187.514 52.117
 187.748 50.676 188.061 c h
50.676 188.061 m f
46.809 217.643 m 46.809 223.268 50.066 228.135 54.785 230.491 c 52.859 
231.452 50.695 232.006 48.398 232.006 c 40.48 232.006 34.035 225.561 34.035
 217.643 c 34.035 209.721 40.48 203.276 48.398 203.276 c 50.695 203.276 
52.859 203.83 54.785 204.795 c 50.066 207.151 46.809 212.014 46.809 217.643
 c h
46.809 217.643 m f
0.678431 0.737255 0.0823529 rg
377.191 352.842 m 377.191 358.475 380.457 363.35 385.188 365.709 c 383.258
 366.67 381.094 367.225 378.801 367.225 c 370.871 367.225 364.418 360.772
 364.418 352.842 c 364.418 344.913 370.871 338.463 378.801 338.463 c 381.094
 338.463 383.258 339.014 385.188 339.975 c 380.457 342.334 377.191 347.205
 377.191 352.842 c h
377.191 352.842 m f
381.078 323.26 m 378.379 323.846 l 377.012 324.143 376.031 325.354 376.031
 326.756 c 376.031 330.131 l 376.031 333.135 376.891 336.049 378.512 338.553
 c 381.457 343.108 l 368.684 343.112 l 365.738 338.553 l 364.117 336.045
 363.262 333.135 363.262 330.131 c 363.262 326.752 l 363.262 325.354 364.238
 324.139 365.605 323.842 c 368.305 323.26 l 371.965 322.467 375.625 322.065
 379.188 322.065 c 381.32 322.065 383.387 322.229 385.391 322.522 c 383.957
 322.713 382.516 322.948 381.078 323.26 c h
381.078 323.26 m f
0 g
361.598 319.307 m 362.07 319.131 369.52 316.467 379.164 316.467 c 384.469
 316.467 390.441 317.272 396.281 319.748 c 398.5 320.69 399.938 322.862 
399.938 325.272 c 399.938 330.131 l 399.938 334.858 398.336 339.405 395.5
 343.073 c 397.188 345.944 398.16 349.28 398.16 352.842 c 398.16 363.514
 389.473 372.202 378.801 372.202 c 368.125 372.202 359.441 363.514 359.441
 352.842 c 359.441 349.28 360.414 345.94 362.098 343.069 c 359.266 339.401
 357.66 334.85 357.66 330.131 c 357.66 324.94 l 357.66 322.424 359.23 320.174
 361.598 319.307 c h
387.938 329.545 m 380.941 327.686 373.887 328.596 369.66 329.514 c 369.66
 330.131 l 369.66 331.928 370.176 333.627 371.113 335.08 c 373.469 334.053
 376.07 333.483 378.801 333.483 c 381.527 333.483 384.121 334.053 386.473
 335.073 c 387.41 333.616 387.938 331.905 387.938 330.131 c h
378.801 360.202 m 382.859 360.202 386.16 356.901 386.16 352.842 c 386.16
 348.784 382.859 345.483 378.801 345.483 c 374.742 345.483 371.441 348.784
 371.441 352.842 c 371.441 356.901 374.742 360.202 378.801 360.202 c h
378.801 360.202 m f
67.758 217.643 m 67.758 228.315 59.074 236.998 48.398 236.998 c 37.727 
236.998 29.043 228.315 29.043 217.643 c 29.043 214.08 30.012 210.741 31.699
 207.87 c 28.867 204.202 27.262 199.651 27.262 194.932 c 27.262 189.741 
l 27.262 187.225 28.832 184.975 31.195 184.108 c 31.672 183.932 39.121 181.264
 48.766 181.264 c 54.07 181.264 60.039 182.073 65.879 184.549 c 68.098 185.487
 69.539 187.663 69.539 190.073 c 69.539 194.932 l 69.539 199.655 67.938 
204.205 65.102 207.873 c 66.789 210.741 67.758 214.08 67.758 217.643 c h
48.398 224.998 m 52.457 224.998 55.758 221.698 55.758 217.643 c 55.758 
213.584 52.457 210.284 48.398 210.284 c 44.344 210.284 41.043 213.584 41.043
 217.643 c 41.043 221.698 44.344 224.998 48.398 224.998 c h
57.539 194.346 m 50.543 192.487 43.488 193.397 39.262 194.315 c 39.262 
194.932 l 39.262 196.729 39.773 198.428 40.711 199.877 c 43.07 198.854 45.668
 198.284 48.398 198.284 c 51.125 198.284 53.719 198.854 56.074 199.873 c
 57.012 198.413 57.539 196.702 57.539 194.932 c h
57.539 194.346 m f
375.504 120.67 m 377.188 123.541 378.16 126.881 378.16 130.44 c 378.16 
141.116 369.477 149.799 358.801 149.799 c 348.125 149.799 339.441 141.116
 339.441 130.44 c 339.441 126.877 340.414 123.541 342.102 120.67 c 339.266
 117.002 337.66 112.452 337.66 107.733 c 337.66 102.541 l 337.66 100.022
 339.234 97.772 341.598 96.909 c 342.07 96.733 349.52 94.065 359.164 94.065
 c 364.473 94.065 370.441 94.873 376.281 97.346 c 378.5 98.288 379.941 100.463
 379.941 102.873 c 379.941 107.733 l 379.938 112.455 378.336 117.006 375.504
 120.67 c h
358.801 137.799 m 362.859 137.799 366.16 134.498 366.16 130.44 c 366.16
 126.385 362.859 123.084 358.801 123.084 c 354.742 123.084 351.441 126.385
 351.441 130.44 c 351.441 134.498 354.742 137.799 358.801 137.799 c h
367.938 107.147 m 360.941 105.288 353.887 106.198 349.66 107.116 c 349.66
 107.733 l 349.66 109.53 350.176 111.229 351.113 112.678 c 353.469 111.655
 356.07 111.084 358.801 111.084 c 361.527 111.084 364.121 111.651 366.473
 112.674 c 367.41 111.213 367.938 109.502 367.938 107.733 c h
367.938 107.147 m f
391.348 302.202 m 330.398 302.202 l 330.398 334.643 l 351.746 355.065 l
 353.52 356.76 354.082 359.362 353.168 361.635 c 352.254 363.909 350.051
 365.401 347.602 365.401 c 245.965 365.401 l 232.969 365.401 222.398 354.83
 222.398 341.834 c 222.398 302.202 l 18.254 302.202 l 8.188 302.202 0 294.01
 0 283.948 c 0 55.651 l 0 45.588 8.188 37.401 18.254 37.401 c 391.348 37.401
 l 401.41 37.401 409.602 45.588 409.602 55.651 c 409.602 283.948 l 409.602
 294.01 401.41 302.202 391.348 302.202 c h
234.398 341.834 m 234.398 348.213 239.586 353.401 245.965 353.401 c 332.648
 353.401 l 320.254 341.545 l 319.07 340.413 318.398 338.846 318.398 337.209
 c 318.398 248.963 l 318.398 242.588 313.211 237.401 306.836 237.401 c 245.965
 237.401 l 239.586 237.401 234.398 242.588 234.398 248.963 c h
397.602 55.651 m 397.602 52.205 394.797 49.401 391.348 49.401 c 18.254 
49.401 l 14.805 49.401 12 52.205 12 55.651 c 12 66.998 l 397.602 66.998 
l h
397.602 78.998 m 12 78.998 l 12 261.401 l 69.484 261.401 l 72.797 261.401
 75.484 264.088 75.484 267.401 c 75.484 270.713 72.797 273.401 69.484 273.401
 c 12 273.401 l 12 283.948 l 12 287.401 14.801 290.202 18.254 290.202 c 
222.398 290.202 l 222.398 273.401 l 108.523 273.401 l 105.211 273.401 102.523
 270.713 102.523 267.401 c 102.523 264.088 105.211 261.401 108.523 261.401
 c 222.398 261.401 l 222.398 248.963 l 222.398 235.952 232.949 225.401 245.965
 225.401 c 306.836 225.401 l 319.852 225.401 330.402 235.948 330.402 248.963
 c 330.402 261.401 l 397.602 261.401 l h
397.602 273.401 m 330.398 273.401 l 330.398 290.202 l 391.348 290.202 l
 394.797 290.202 397.602 287.397 397.602 283.948 c h
397.602 273.401 m f
216 206.202 m 216 221.639 203.438 234.202 188 234.202 c 83.602 234.202 
l 80.988 234.202 78.676 232.51 77.883 230.022 c 77.09 227.53 78 224.815 
80.133 223.303 c 100 209.229 l 100 206.202 l 100 190.76 112.562 178.202 
128 178.202 c 188 178.202 l 203.438 178.202 216 190.76 216 206.202 c h
112 206.202 m 112 212.334 l 112 214.28 111.055 216.104 109.469 217.229 
c 102.453 222.202 l 188 222.202 l 196.824 222.202 204 215.022 204 206.202
 c 204 197.377 196.824 190.202 188 190.202 c 128 190.202 l 119.176 190.202
 112 197.377 112 206.202 c h
112 206.202 m f
326.801 149.401 m 172 149.401 l 156.562 149.401 144 136.838 144 121.401
 c 144 105.959 156.562 93.401 172 93.401 c 283.199 93.401 l 298.641 93.401
 311.199 105.959 311.199 121.401 c 311.199 124.998 l 330.27 138.502 l 332.398
 140.014 333.309 142.729 332.52 145.221 c 331.727 147.709 329.414 149.401
 326.801 149.401 c h
301.73 132.995 m 300.145 131.87 299.199 130.045 299.199 128.1 c 299.199
 121.401 l 299.199 112.577 292.023 105.401 283.199 105.401 c 172 105.401
 l 163.176 105.401 156 112.577 156 121.401 c 156 130.221 163.176 137.401
 172 137.401 c 307.949 137.401 l h
301.73 132.995 m f
248.398 326.202 m 301.199 326.202 l 304.512 326.202 307.199 328.885 307.199
 332.202 c 307.199 335.514 304.512 338.202 301.199 338.202 c 248.398 338.202
 l 245.086 338.202 242.398 335.514 242.398 332.202 c 242.398 328.885 245.086
 326.202 248.398 326.202 c h
248.398 326.202 m f
248.398 302.202 m 262.801 302.202 l 266.113 302.202 268.801 304.885 268.801
 308.202 c 268.801 311.514 266.113 314.202 262.801 314.202 c 248.398 314.202
 l 245.086 314.202 242.398 311.514 242.398 308.202 c 242.398 304.885 245.086
 302.202 248.398 302.202 c h
248.398 302.202 m f
301.199 314.202 m 286.801 314.202 l 283.488 314.202 280.801 311.514 280.801
 308.202 c 280.801 304.885 283.488 302.202 286.801 302.202 c 301.199 302.202
 l 304.512 302.202 307.199 304.885 307.199 308.202 c 307.199 311.514 304.512
 314.202 301.199 314.202 c h
301.199 314.202 m f
301.199 290.202 m 262 290.202 l 258.688 290.202 256 287.514 256 284.202
 c 256 280.885 258.688 278.202 262 278.202 c 301.199 278.202 l 304.512 278.202
 307.199 280.885 307.199 284.202 c 307.199 287.514 304.512 290.202 301.199
 290.202 c h
301.199 290.202 m f
248.398 254.202 m 284.398 254.202 l 287.715 254.202 290.398 256.885 290.398
 260.202 c 290.398 263.514 287.715 266.202 284.398 266.202 c 248.398 266.202
 l 245.086 266.202 242.398 263.514 242.398 260.202 c 242.398 256.885 245.086
 254.202 248.398 254.202 c h
248.398 254.202 m f
140 206.998 m 140 203.467 137.133 200.6 133.602 200.6 c 130.066 200.6 127.199
 203.467 127.199 206.998 c 127.199 210.534 130.066 213.401 133.602 213.401
 c 137.133 213.401 140 210.534 140 206.998 c h
140 206.998 m f
161.602 206.998 m 161.602 203.467 158.734 200.6 155.199 200.6 c 151.664
 200.6 148.801 203.467 148.801 206.998 c 148.801 210.534 151.664 213.401
 155.199 213.401 c 158.734 213.401 161.602 210.534 161.602 206.998 c h
161.602 206.998 m f
183.199 206.998 m 183.199 203.467 180.336 200.6 176.801 200.6 c 173.266
 200.6 170.398 203.467 170.398 206.998 c 170.398 210.534 173.266 213.401
 176.801 213.401 c 180.336 213.401 183.199 210.534 183.199 206.998 c h
183.199 206.998 m f
288 121.401 m 288 117.866 285.133 114.998 281.602 114.998 c 278.066 114.998
 275.199 117.866 275.199 121.401 c 275.199 124.936 278.066 127.799 281.602
 127.799 c 285.133 127.799 288 124.936 288 121.401 c h
288 121.401 m f
266.398 121.401 m 266.398 117.866 263.535 114.998 260 114.998 c 256.465
 114.998 253.602 117.866 253.602 121.401 c 253.602 124.936 256.465 127.799
 260 127.799 c 263.535 127.799 266.398 124.936 266.398 121.401 c h
266.398 121.401 m f
244.801 121.401 m 244.801 117.866 241.934 114.998 238.398 114.998 c 234.867
 114.998 232 117.866 232 121.401 c 232 124.936 234.867 127.799 238.398 127.799
 c 241.934 127.799 244.801 124.936 244.801 121.401 c h
244.801 121.401 m f
223.199 121.401 m 223.199 117.866 220.336 114.998 216.801 114.998 c 213.266
 114.998 210.398 117.866 210.398 121.401 c 210.398 124.936 213.266 127.799
 216.801 127.799 c 220.336 127.799 223.199 124.936 223.199 121.401 c h
223.199 121.401 m f
201.602 121.401 m 201.602 117.866 198.734 114.998 195.199 114.998 c 191.664
 114.998 188.801 117.866 188.801 121.401 c 188.801 124.936 191.664 127.799
 195.199 127.799 c 198.734 127.799 201.602 124.936 201.602 121.401 c h
201.602 121.401 m f
180 121.401 m 180 117.866 177.133 114.998 173.602 114.998 c 170.066 114.998
 167.199 117.866 167.199 121.401 c 167.199 124.936 170.066 127.799 173.602
 127.799 c 177.133 127.799 180 124.936 180 121.401 c h
180 121.401 m f
Q Q
showpage
%%Trailer
end restore
%%EOF
