---- Top row -------
#05338b   5,51,139
#5ebc4c   94,188,76
#63bf04	  99,191,4
#f29f05	  242,159,5
#b70d0e	  183,13,14

---- Bottom row -------
#000e00	  0,14,0
#062601	  6,38,1
#287800	  40,120,0
#d97803	  217,120,3
#8d0303	  141,3,3
