[gd_scene load_steps=3 format=2]

[ext_resource path="res://Assets/playerShip1_green.png" type="Texture" id=1]

[sub_resource type="RectangleShape2D" id=1]
extents = Vector2( 50.3306, 38.9876 )

[node name="GreenShip2D" type="Node2D"]

[node name="Sprite" type="Sprite" parent="."]
texture = ExtResource( 1 )

[node name="KinematicBody2D" type="KinematicBody2D" parent="."]

[node name="CollisionShape2D" type="CollisionShape2D" parent="KinematicBody2D"]
shape = SubResource( 1 )
