[gd_scene load_steps=6 format=2]

[ext_resource path="res://Assets/Fonts/Fonts/Kenney Mini Square.ttf" type="DynamicFontData" id=1]
[ext_resource path="res://Scripts/HowToPlay.gd" type="Script" id=2]
[ext_resource path="res://Assets/Fonts/Fonts/Kenney Pixel.ttf" type="DynamicFontData" id=3]


[sub_resource type="DynamicFont" id=1]
size = 100
font_data = ExtResource( 1 )

[sub_resource type="DynamicFont" id=2]
size = 100
font_data = ExtResource( 3 )

[node name="HowToPlay" type="RichTextLabel"]
margin_right = 1920.0
margin_bottom = 1024.0
custom_fonts/normal_font = SubResource( 1 )
text = "Controller :
P1/P2 ===== Action
Up/W		: Jump
Down/S	: Duck
Left/A	: Run left
Right/D	: Run right
Slash/C	: Throw ball

Get the white ball, but don't let the red-crossed ball hit you. Wait for the red-crossed ball to turn back to white to get it again.
You can only hold 1 ball.
Don't let Papa Gladiator hold you in the middle!
Beat your friend before the time runs out!"
script = ExtResource( 2 )

[node name="LinkButton" type="LinkButton" parent="."]
margin_left = 1720.0
margin_right = 1872.0
margin_bottom = 76.0
custom_fonts/font = SubResource( 2 )
text = "BACK"
[connection signal="pressed" from="LinkButton" to="." method="_on_LinkButton_pressed"]
