[gd_scene load_steps=5 format=2]

[ext_resource path="res://Scripts/BallR.gd" type="Script" id=1]
[ext_resource path="res://Assets/Sheets/Ball/Ball.png" type="Texture" id=2]


[sub_resource type="PhysicsMaterial" id=1]
bounce = 0.65

[sub_resource type="CircleShape2D" id=2]

[node name="Ball" type="RigidBody2D"]
physics_material_override = SubResource( 1 )
gravity_scale = 15.0
contacts_reported = 1
contact_monitor = true
script = ExtResource( 1 )

[node name="Sprite" type="Sprite" parent="."]
texture = ExtResource( 2 )

[node name="CollisionShape2D" type="CollisionShape2D" parent="."]
visible = false
scale = Vector2( 1.5, 1.5 )
shape = SubResource( 2 )

[node name="VisibilityNotifier2D" type="VisibilityNotifier2D" parent="."]
[connection signal="body_entered" from="." to="." method="_on_Ball_body_entered"]
[connection signal="screen_exited" from="VisibilityNotifier2D" to="." method="_on_VisibilityNotifier2D_screen_exited"]
