<svg xmlns="http://www.w3.org/2000/svg" width="93" height="97" viewBox="0 0 93 97">
  <defs>
    <style>
      .a {
        fill: #5d6d75;
        stroke: #fff;
        stroke-miterlimit: 10;
      }
    </style>
  </defs>
  <g>
    <path class="a" d="M75.1,40.5h4.8a1.6,1.6,0,0,0,1.6-1.6V34.1a1.6,1.6,0,1,0-3.2,0v3.2H75.1a1.6,1.6,0,1,0,0,3.2Z"/>
    <path class="a" d="M38,23.75A3.25,3.25,0,1,1,34.75,27,3.26,3.26,0,0,1,38,23.75Zm0,9.75A6.5,6.5,0,1,0,31.5,27,6.5,6.5,0,0,0,38,33.5Z"/>
    <path class="a" d="M3.89,28.57a1.59,1.59,0,0,1,.94-.8,1.6,1.6,0,0,1,1,3,1.6,1.6,0,0,1-1.92-2.24ZM23.3,21.3l1.85-3.2,5.69,2.13A1.57,1.57,0,0,0,32.35,20a10,10,0,0,1,1.95-1.13,1.61,1.61,0,0,0,1-1.21l1-6h3.69l1,6a1.61,1.61,0,0,0,1,1.21A9.71,9.71,0,0,1,43.83,20a1.6,1.6,0,0,0,1.52.22L51,18.1l1.85,3.2-4.69,3.85a1.63,1.63,0,0,0-.57,1.43,8.47,8.47,0,0,1,0,2.25,1.6,1.6,0,0,0,.57,1.42l4.69,3.85L51,37.3l-5.68-2.13a1.6,1.6,0,0,0-1.52.22,9.71,9.71,0,0,1-1.95,1.13,1.61,1.61,0,0,0-1,1.21l-1,6h-3.7l-1-6a1.59,1.59,0,0,0-1-1.21,9.64,9.64,0,0,1-1.94-1.13,1.6,1.6,0,0,0-1.52-.22L25.15,37.3,23.3,34.1,28,30.25l.08-.09.09-.09a1.57,1.57,0,0,0,.28-.44v0a1.5,1.5,0,0,0,.11-.55s0,0,0-.07,0,0,0-.06v-.11a8.47,8.47,0,0,1,0-2.25A1.6,1.6,0,0,0,28,25.15ZM40.53,3.7H53.34V6.9a1.6,1.6,0,0,0,1.6,1.6H65.1L60,15.57a1.63,1.63,0,0,0-.3.93H53.8l-.67-1.17a1.61,1.61,0,0,0-2-.7L45,16.94c-.35-.23-.7-.43-1.06-.62L42.87,9.84A1.59,1.59,0,0,0,41.29,8.5h-.76ZM69.86,7.34l3.42,1.71A24.6,24.6,0,0,1,87,31.17a9.28,9.28,0,0,1-2.73,6.6,1.61,1.61,0,0,0-.34,1.78L89.3,51.7H85.36a1.6,1.6,0,0,0-1.6,1.6v4.8h-.28a9.26,9.26,0,0,1-6.59-2.73,1.6,1.6,0,0,0-2.27,2.26,12.42,12.42,0,0,0,7,3.52l-.62.62a1.6,1.6,0,0,0-.46,1.13v8H72.7A85.4,85.4,0,0,1,62,65h0l-2.26-1.39V52.78l7-2.79a1.62,1.62,0,0,0,1-1.49V42.1a1.58,1.58,0,0,0-.32-1l-4.48-6V17ZM56.22,71.52,51.74,67V58.1h4.8v6.4a1.62,1.62,0,0,0,.76,1.36l1.7,1ZM63.88,93.3H51.74V78.9h3.2v4.8a1.61,1.61,0,0,0,.47,1.13Zm-43.49,0L32.06,81.63a1.61,1.61,0,0,0,.47-1.13V58.1h9.61V81.5l-3.21,3.66V77.3h-3.2V88.82L31.8,93.3Zm18.47-3.2h.07V90l6-6.87a1.56,1.56,0,0,0,.4-1.05V78.9h3.2V93.3H36.05ZM49,68.83l5.93,5.93v.94h-9.6V58.1h3.2v9.6A1.61,1.61,0,0,0,49,68.83ZM59.74,29.3v6.4H55.65l.68-1.17a1.6,1.6,0,0,0-.37-2l-3.88-3.2Zm-3.41-8.43-.68-1.17h4.09v6.4H52.08L56,22.9A1.6,1.6,0,0,0,56.33,20.87Zm-17.4,26h2.36a1.59,1.59,0,0,0,1.58-1.34L44,39.08c.36-.19.71-.39,1.06-.62l6.17,2.31a1.61,1.61,0,0,0,2-.7l.67-1.17h7.55a1.37,1.37,0,0,0,.34-.07l2.86,3.8V45.3H58.14v3.2h3.7l-4.29,1.71a1.62,1.62,0,0,0-1,1.49v3.2H38.93ZM10.12,6.9a1.6,1.6,0,1,1-1.6,1.6A1.6,1.6,0,0,1,10.12,6.9Zm0,43.2a1.6,1.6,0,1,1,1.6-1.6A1.6,1.6,0,0,1,10.12,50.1Zm-7-16.53a4.78,4.78,0,0,0,6.71-2.69l12.59-.19-2.2,1.81a1.61,1.61,0,0,0-.37,2l3,5.16.07,7.2h-8a1.4,1.4,0,0,0-.28.06,4.8,4.8,0,1,0,0,3.08,1.4,1.4,0,0,0,.28.06h9.61a1.61,1.61,0,0,0,1.13-.47,1.65,1.65,0,0,0,.47-1.14l-.08-8.11,5.13-1.92c.34.22.7.43,1,.61l1.08,6.49a1.61,1.61,0,0,0,1.58,1.34h.84v8h-4.8a1.6,1.6,0,0,0-1.6,1.6V79.84L15.39,93.77a1.6,1.6,0,0,0,1.13,2.73H67.75a1.6,1.6,0,0,0,1.13-2.73L58.14,83v-8.5l3.59-6c6,3.64,9.7,5.52,10.82,5.52h9.61a1.6,1.6,0,0,0,1.6-1.6V63.56l2.73-2.73A1.61,1.61,0,0,0,87,59.7V54.9H89.3a3.2,3.2,0,0,0,2.92-4.5l-5-11.2a12.41,12.41,0,0,0,2.91-8,27.76,27.76,0,0,0-15.45-25L70.07,3.87a1.61,1.61,0,0,0-2,.5l-.67.93H56.54V2.1A1.6,1.6,0,0,0,54.94.5h-16a1.6,1.6,0,0,0-1.6,1.6V8.5H34.89a1.61,1.61,0,0,0-1.58,1.34l-1.08,6.48c-.36.19-.71.39-1.06.62L25,14.63a1.6,1.6,0,0,0-2,.7l-1.62,2.79-.11,0H11.72V13a4.8,4.8,0,1,0-3.2,0V19.7a1.6,1.6,0,0,0,1.6,1.6H19.7a1.59,1.59,0,0,0,.52,1.6l5.08,4.18c0,.12,0,.24,0,.35l-15.47.24a4.8,4.8,0,1,0-6.7,5.9Z"/>
    <rect class="a" x="35.5" y="64.5" width="3" height="3"/>
    <rect class="a" x="35.5" y="71.5" width="3" height="3"/>
    <rect class="a" x="45.5" y="44.5" width="3" height="3"/>
    <rect class="a" x="51.5" y="44.5" width="3" height="3"/>
    <rect class="a" x="65.5" y="16.5" width="3" height="7"/>
    <rect class="a" x="65.5" y="25.5" width="3" height="3"/>
    <rect class="a" x="65.5" y="32.5" width="3" height="3"/>
  </g>
</svg>
