<?xml version="1.0" encoding="utf-8"?>
<!-- Generator: Adobe Illustrator 24.2.0, SVG Export Plug-In . SVG Version: 6.00 Build 0)  -->
<svg version="1.1" id="Capa_1" xmlns="http://www.w3.org/2000/svg" xmlns:xlink="http://www.w3.org/1999/xlink" x="0px" y="0px"
	 viewBox="0 0 512 512" style="enable-background:new 0 0 512 512;" xml:space="preserve">
<style type="text/css">
	.st0{fill:#404044;stroke:#FFFFFF;stroke-width:5;stroke-miterlimit:10;}
	.st1{fill:#007BFF;stroke:#FFFFFF;stroke-width:5;stroke-miterlimit:10;}
</style>
<g>
	<path class="st0" d="M306.3,438c-6.4-1.7-13-1.7-19.2-0.1l-27.6-47.9c11.6-11.8,14.4-30.2,5.8-45.2c-5-8.7-13.1-14.9-22.8-17.5
		c-6.4-1.7-13-1.7-19.2-0.1l-27.6-47.9c2.2-2.2,4.1-4.7,5.8-7.6c0,0,0,0,0,0c10.4-18,4.2-41-13.8-51.4c-17.9-10.4-41-4.2-51.4,13.8
		c-8.6,15-5.8,33.4,5.8,45.2l-27.6,47.9c-6.2-1.6-12.8-1.6-19.2,0.1c-9.7,2.6-17.8,8.8-22.8,17.5c-8.6,15-5.8,33.4,5.8,45.2
		L50.6,438c-16-4.1-33.4,2.6-42,17.6c-10.4,18-4.2,41,13.8,51.4c5.9,3.4,12.4,5,18.7,5c13,0,25.7-6.7,32.6-18.8c0,0,0,0,0,0
		c1.6-2.8,2.9-5.8,3.7-8.8h55.3c2.5,9.2,8.5,17.4,17.4,22.6c5.8,3.3,12.2,5.1,18.7,5.1c3.3,0,6.6-0.4,9.8-1.3
		c9.7-2.6,17.8-8.8,22.8-17.5c1.6-2.8,2.9-5.8,3.7-8.8h55.3c0.8,3,2.1,6,3.7,8.8c5,8.7,13.1,14.9,22.8,17.5c3.2,0.9,6.5,1.3,9.8,1.3
		c6.5,0,12.9-1.7,18.7-5.1c18-10.4,24.1-33.4,13.8-51.4C324.1,446.9,316,440.6,306.3,438L306.3,438z M56.3,483.2
		c-4.9,8.4-15.7,11.3-24.1,6.5c-8.4-4.9-11.3-15.6-6.4-24.1c3.3-5.6,9.2-8.8,15.3-8.8c3,0,6,0.8,8.8,2.3
		C58.3,464,61.2,474.8,56.3,483.2z M223.9,348.5C223.9,348.5,223.9,348.5,223.9,348.5C223.9,348.5,223.9,348.5,223.9,348.5
		c4.1-2.4,8.8-3,13.4-1.8c4.5,1.2,8.3,4.1,10.7,8.2c4.8,8.4,2,19.2-6.4,24.1c-8.4,4.8-19.2,2-24-6.4
		C212.6,364.1,215.5,353.3,223.9,348.5L223.9,348.5z M153.6,244.3c3.3-5.6,9.2-8.8,15.3-8.8c3,0,6,0.8,8.8,2.4
		c8.4,4.9,11.3,15.6,6.4,24.1c-4.9,8.4-15.6,11.3-24,6.4C151.6,263.4,148.7,252.6,153.6,244.3L153.6,244.3z M159.4,289.4
		c3.1,0.8,6.3,1.2,9.4,1.2c3.2,0,6.4-0.4,9.5-1.2l27.7,47.9c-4.6,4.6-7.8,10.3-9.4,16.4h-55.3c-1.7-6.1-4.9-11.8-9.4-16.4
		L159.4,289.4z M89.7,354.9c2.3-4.1,6.1-7,10.7-8.2c1.5-0.4,3.1-0.6,4.6-0.6c3.1,0,6.1,0.8,8.8,2.4c8.4,4.9,11.3,15.6,6.4,24.1
		c-2.3,4.1-6.1,7-10.7,8.2c-4.5,1.2-9.3,0.6-13.4-1.8C87.8,374.1,84.9,363.3,89.7,354.9L89.7,354.9z M136.3,455.6
		c-1.6,2.8-2.9,5.8-3.7,8.8H77.3c-1.7-6.1-4.9-11.8-9.4-16.4l27.6-47.9c3.1,0.8,6.2,1.2,9.4,1.2c3.2,0,6.4-0.4,9.5-1.2l27.6,47.9
		C139.9,450.2,137.9,452.7,136.3,455.6L136.3,455.6z M131.8,390.1c2.2-2.3,4.2-4.8,5.8-7.6c1.6-2.8,2.9-5.8,3.7-8.8h55.3
		c0.8,3,2.1,6,3.7,8.8c0,0,0,0,0,0c1.6,2.8,3.6,5.4,5.8,7.6L178.3,438c-6.3-1.6-12.8-1.6-18.9,0L131.8,390.1z M184.1,483.2
		C184.1,483.2,184.1,483.2,184.1,483.2c-2.4,4.1-6.1,7-10.7,8.2c-4.5,1.2-9.3,0.6-13.4-1.8c-8.4-4.9-11.3-15.7-6.5-24
		c3.3-5.6,9.2-8.8,15.3-8.8c3,0,6,0.8,8.7,2.3l0,0c0,0,0,0,0,0c4.1,2.4,7,6.1,8.2,10.7C187.1,474.4,186.4,479.1,184.1,483.2
		L184.1,483.2z M260.4,464.4h-55.3c-1.7-6.3-5-11.9-9.5-16.4l27.7-47.9c3.1,0.8,6.3,1.2,9.5,1.2c3.1,0,6.3-0.4,9.4-1.2l27.6,47.9
		C265.3,452.6,262.1,458.3,260.4,464.4L260.4,464.4z M305.4,489.6c-4.1,2.4-8.8,3-13.4,1.8c-4.5-1.2-8.3-4.1-10.7-8.2
		c-4.9-8.4-2-19.2,6.4-24.1c4.1-2.4,8.8-3,13.4-1.8c4.5,1.2,8.3,4.1,10.7,8.2C316.7,474,313.8,484.8,305.4,489.6z"/>
	<path class="st1" d="M445.3,137.3c0,5.5,4.5,10,10,10h0c5.5,0,10-4.5,10-10c0-21.3-5.9-40.9-16.9-56.8
		c-11.6-16.7-28.4-28.5-48.7-34.2c-5.3-1.5-10.8,1.6-12.3,6.9c-1.5,5.3,1.6,10.8,6.9,12.3C425.7,74.3,445.3,101.8,445.3,137.3
		L445.3,137.3z"/>
	<path class="st1" d="M508.5,137.5c0-39.4-13.8-73.8-39.9-99.4c-25-24.6-59.3-38.5-94.1-38c-14.7-0.2-29.4,2.1-43.6,7
		c-5.2,1.8-8,7.5-6.3,12.7c1.8,5.2,7.5,8,12.7,6.3c12.1-4.1,24.6-6.1,37-5.9c0.1,0,0.2,0,0.3,0c29.5-0.4,58.7,11.3,79.9,32.3
		c15.4,15.2,33.8,42.3,33.9,85.2c0.1,40.2-16,62-32.9,85.1c-12.8,17.5-26.1,35.5-32,61.3h-39v-76c13.9-4.3,24-17.2,24-32.5
		c0-18.7-15.2-34-34-34c-18.7,0-34,15.2-34,34c0,15.2,10.1,28.2,24,32.5v76h-39c-6-25.8-19.2-43.8-32.1-61.3
		c-17-23.1-33-44.9-32.9-85.1c0-24.7,6.1-46.8,18.2-65.8c3-4.7,1.6-10.8-3.1-13.8c-4.7-3-10.8-1.6-13.8,3.1
		c-14.1,22.2-21.3,48-21.3,76.5c-0.1,46.8,19.5,73.4,36.8,96.9c11.7,15.9,22.8,31.1,28.1,51.8c-12.2,4.8-20.9,16.7-20.9,30.7
		c0,15.4,10.6,28.4,24.9,31.9v19.1c0,21,17.1,38.1,38.1,38.1h53.9c21,0,38.1-17.1,38.1-38.1v-19.1c14.3-3.6,24.9-16.5,24.9-31.9
		c0-13.9-8.7-25.9-20.9-30.7c5.3-20.7,16.4-35.9,28.1-51.8C489,210.9,508.6,184.2,508.5,137.5L508.5,137.5z M360.6,175.4
		c0-7.7,6.3-14,14-14c7.7,0,14,6.3,14,14c0,7.7-6.3,14-14,14C366.8,189.4,360.6,183.1,360.6,175.4z M419.6,367.9
		c0,10-8.1,18.1-18.1,18.1h-53.9c-10,0-18.1-8.1-18.1-18.1v-18.1h90V367.9z M444.5,316.8c0,7.1-5.8,12.9-12.9,12.9h-114
		c-6.1,0-11.5-4.5-12.7-10.5c-1.2-6.1,2.3-12.3,8-14.5c2.5-1,5.2-1,7.8-0.9h107.7c0,0,3.5-0.1,5.7,0.3
		C440,305.3,444.5,310.6,444.5,316.8L444.5,316.8z"/>
	<path class="st1" d="M298.9,45.2c5.5,0,10-4.5,10-10s-4.5-10-10-10h0c-5.5,0-10,4.5-10,10S293.4,45.2,298.9,45.2z"/>
</g>
</svg>
