<?xml version="1.0" encoding="utf-8"?>
<!-- Generator: Adobe Illustrator 24.1.0, SVG Export Plug-In . SVG Version: 6.00 Build 0)  -->
<svg version="1.1" id="Layer_1" xmlns="http://www.w3.org/2000/svg" xmlns:xlink="http://www.w3.org/1999/xlink" x="0px" y="0px"
	 viewBox="0 0 1839 452" style="enable-background:new 0 0 1839 452;" xml:space="preserve">
<style type="text/css">
	.st0{stroke:#010101;stroke-width:9;stroke-miterlimit:10;}
</style>
<g>
	<g>
		<polygon points="408.2,192.9 434.6,182.9 449.8,149.4 39.9,303.3 50.7,308.2 8.6,324 42.1,339.2 403.3,203.6 		"/>
		<polygon points="400.6,144.1 442.7,128.3 409.2,113.1 46.5,249.2 41.6,260 15.2,269.9 0,303.4 411.4,149 		"/>
		<polygon points="338.4,115.8 380.5,100 347,84.8 74.8,187 69.9,197.7 43.5,207.6 28.3,241.1 349.1,120.7 		"/>
		<polygon points="276.1,87.5 318.2,71.7 284.7,56.5 103.1,124.7 98.2,135.5 71.7,145.4 56.5,178.9 286.9,92.4 		"/>
		<polygon points="213.9,59.3 256,43.5 222.5,28.3 131.3,62.5 126.4,73.2 100,83.2 84.8,116.7 224.7,64.2 		"/>
		<polygon points="151.7,31 193.8,15.2 160.3,0 159.6,0.3 146.7,28.7 128.9,20.7 128.3,20.9 113.1,54.4 162.4,35.9 		"/>
		<polygon points="299.6,421.3 257.5,437.1 290.5,452 303.6,423.1 321.8,431.3 336.8,398.4 288.8,416.4 		"/>
		<polygon points="237.4,393 195.3,408.8 228.8,424 318.5,390.3 323.4,379.6 349.8,369.6 365,336.2 226.6,388.1 		"/>
		<polygon points="175.1,364.7 133,380.5 166.5,395.7 346.8,328.1 351.6,317.3 378.1,307.4 393.3,273.9 164.4,359.8 		"/>
		<polygon points="112.9,336.5 70.8,352.3 104.3,367.5 375,265.9 379.9,255.1 406.3,245.2 421.6,211.7 102.1,331.6 		"/>
		<g>
			<path class="st0" d="M616.7,279.3l20,44.1h21.9l-84.4-185.7h-19.3l-84.3,185.7h21.9l19.7-44.1H616.7z M520.4,260.3l44-98.5
				l44,98.5H520.4z"/>
			<path class="st0" d="M754,137.8h-82.8v185.7h20.2v-62H754c19.2,0,35.3-6.7,46.7-19.4c10.1-11.2,15.6-26.3,15.6-42.4
				s-5.5-31.2-15.6-42.4C789.3,144.5,773.1,137.8,754,137.8z M785.6,229.3C778,238,767,242.6,754,242.6h-62.6v-85.8H754
				c29,0,42.3,22.2,42.3,42.9C796.2,211,792.5,221.5,785.6,229.3z"/>
			<path class="st0" d="M970.5,242c10.1-11.2,15.6-26.3,15.6-42.4s-5.5-31.2-15.6-42.4c-11.4-12.7-27.5-19.4-46.7-19.4h-82.8v185.7
				h20.2v-62h62.6C942.9,261.4,959.1,254.7,970.5,242z M955.4,229.3c-7.6,8.7-18.6,13.3-31.7,13.3h-62.6v-85.8h62.6
				c29,0,42.3,22.2,42.3,42.9C966,211,962.3,221.5,955.4,229.3z"/>
			<polygon class="st0" points="1133.3,304.2 1031,304.2 1031,137.8 1010.7,137.8 1010.7,323.4 1133.3,323.4 			"/>
			<polygon class="st0" points="1267.8,137.8 1246.6,137.8 1186.5,229.5 1126.6,137.8 1105.5,137.8 1105.5,142.1 1176.4,249.5 
				1176.4,323.4 1196.6,323.4 1196.6,249.5 1267.8,142.1 			"/>
		</g>
		<g>
			<polygon points="428.9,444.7 441.4,444.7 441.4,378.3 428.9,405.6 			"/>
			<polygon points="499.2,419.5 466.7,378.3 456.5,378.3 456.5,444.7 469,444.7 469,399.9 504,444.8 504,444.7 511.8,444.7 
				511.8,378.2 499.2,378.2 			"/>
			<path d="M521.7,389.7h21.1v55.1h12.5v-55.1h21.1v-11.4c-19.3,0-35.5,0-54.7,0V389.7z"/>
			<path d="M586.2,444.7H636v-12.3h-37.3v-15h36v-11.7h-36v-15.3H636v-12.2h-49.8C586.2,400.4,586.2,422.6,586.2,444.7z"/>
			<polygon points="660.6,378.3 648.1,378.3 648.1,444.7 694.8,444.7 694.8,433.2 660.6,433.2 			"/>
			<polygon points="718.5,378.3 706,378.3 706,444.7 752.7,444.7 752.7,433.2 718.5,433.2 			"/>
			<rect x="764" y="378.3" width="12.4" height="66.5"/>
			<path d="M821.1,417.5h17v11.8c-5.2,4.2-9.8,5.3-15,5.3c-16.5,0-22.9-11.3-22.9-22.2c0-13.7,8.6-24.5,22.9-24.5
				c5.8,0,12.4,2.4,16.9,6.6l7.8-8c-6.8-6.7-15.8-10.2-24.7-10.2c-23.5,0-35.1,17.3-35.1,36c0,17.5,10.2,33.9,35.1,33.9
				c11.7,0,19.9-4.5,26.5-12v-28h-28.5V417.5z"/>
			<path d="M862,444.7h49.8v-12.3h-37.3v-15h36v-11.7h-36v-15.3h37.3v-12.2H862C862,400.4,862,422.6,862,444.7z"/>
			<polygon points="967.5,419.5 935,378.3 924.8,378.3 924.8,444.7 937.3,444.7 937.3,399.9 972.3,444.8 972.3,444.7 980.1,444.7 
				980.1,378.2 967.5,378.2 			"/>
			<path d="M990.1,389.7h21.1v55.1h12.5v-55.1h21.1v-11.4c-19.3,0-35.5,0-54.7,0V389.7z"/>
			<path d="M1080.8,389.7h21.1v55.1h12.5v-55.1h21.1v-11.4c-19.3,0-35.5,0-54.7,0V389.7z"/>
			<path d="M1145.3,444.7h49.8v-12.3h-37.3v-15h36v-11.7h-36v-15.3h37.3v-12.2h-49.8C1145.3,400.4,1145.3,422.6,1145.3,444.7z"/>
			<path d="M1240.5,434.5c-16.4,0-22.8-11.5-22.9-22.5c-0.1-11.1,6.8-23.1,22.9-23.1c5.8,0,11.7,2,16,6.3l8.4-8.1
				c-6.8-6.7-15.4-10.2-24.4-10.2c-24,0-35.3,17.7-35.2,35c0.1,17.3,10.5,34.3,35.2,34.3c9.6,0,18.4-3.1,25.3-9.9l-8.5-8.6
				C1252.8,432.1,1246.3,434.5,1240.5,434.5z"/>
			<polygon points="1317.5,406.4 1284.8,406.4 1284.8,378.4 1272.3,378.4 1272.3,444.8 1284.8,444.8 1284.8,418 1317.5,418 
				1317.5,444.8 1329.9,444.8 1329.9,378.4 1317.5,378.4 			"/>
			<polygon points="1387.8,419.5 1355.2,378.3 1345,378.3 1345,444.7 1357.6,444.7 1357.6,399.9 1392.5,444.8 1392.5,444.7 
				1400.3,444.7 1400.3,378.2 1387.8,378.2 			"/>
			<path d="M1445.4,376.9c-23,0-34.2,17.6-34.2,35c0,17.5,10.8,34.3,34.2,34.3c23.4,0,33.9-17.2,34.1-34.4
				C1479.7,394.5,1468.3,376.9,1445.4,376.9z M1445.4,434.8c-15.7,0-21.6-11.7-21.8-22.6c-0.3-11.2,6.2-23.8,21.8-23.8
				c15.7,0,21.9,12.5,21.7,23.7C1467,423,1461.1,434.8,1445.4,434.8z"/>
			<polygon points="1503.6,378.3 1491.1,378.3 1491.1,444.7 1537.8,444.7 1537.8,433.2 1503.6,433.2 			"/>
			<path d="M1580.3,376.9c-23,0-34.2,17.6-34.2,35c0,17.5,10.8,34.3,34.2,34.3c23.4,0,33.9-17.2,34.1-34.4
				C1614.6,394.5,1603.2,376.9,1580.3,376.9z M1580.3,434.8c-15.7,0-21.6-11.7-21.8-22.6c-0.3-11.2,6.2-23.8,21.8-23.8
				c15.7,0,21.9,12.5,21.7,23.7C1601.8,423,1596,434.8,1580.3,434.8z"/>
			<path d="M1656.5,417.5h17v11.8c-5.2,4.2-9.8,5.3-15,5.3c-16.5,0-22.9-11.3-22.9-22.2c0-13.7,8.6-24.5,22.9-24.5
				c5.8,0,12.4,2.4,16.9,6.6l7.8-8c-6.8-6.7-15.8-10.2-24.7-10.2c-23.5,0-35.1,17.3-35.1,36c0,17.5,10.2,33.9,35.1,33.9
				c11.7,0,19.9-4.5,26.5-12v-28h-28.5V417.5z"/>
			<rect x="1697.7" y="378.3" width="12.4" height="66.5"/>
			<path d="M1724.1,444.7h49.8v-12.3h-37.3v-15h36v-11.7h-36v-15.3h37.3v-12.2h-49.8C1724.1,400.4,1724.1,422.6,1724.1,444.7z"/>
			<path d="M1812.2,404.1c-8-0.9-14.8-2.6-14.8-8.4c0-4.9,4.5-8.8,13.8-8.8c7.2,0,13.5,3.6,15.8,7.4l10-5.1
				c-5-10.3-15.8-13.2-26.1-13.2c-12.3,0.1-25.7,5.7-25.7,19.4c0,14.9,12.5,18.5,26.1,20.1c8.8,0.9,15.4,3.5,15.4,9.8
				c0,7.2-7.4,10-15.3,10c-8.1,0-15.8-3.2-18.7-10.5l-10.4,5.4c4.9,12.2,15.4,16.3,29,16.3c14.8,0,27.9-6.4,27.9-21.2
				C1839,409.4,1826.1,405.8,1812.2,404.1z"/>
		</g>
	</g>
</g>
</svg>
