-------------------------------------------------------------------------------
Test set: br.edu.unifacisa.lti.web.rest.LogsResourceIntTest
-------------------------------------------------------------------------------
Tests run: 2, Failures: 0, Errors: 0, Skipped: 0, Time elapsed: 0.154 sec - in br.edu.unifacisa.lti.web.rest.LogsResourceIntTest
