%YAML 1.1
%TAG !u! tag:unity3d.com,2011:
--- !u!114 &11400000
MonoBehaviour:
  m_ObjectHideFlags: 0
  m_CorrespondingSourceObject: {fileID: 0}
  m_PrefabInstance: {fileID: 0}
  m_PrefabAsset: {fileID: 0}
  m_GameObject: {fileID: 0}
  m_Enabled: 1
  m_EditorHideFlags: 0
  m_Script: {fileID: 11500000, guid: 2dfd41087fb65c4ba8cfb57a9a0bca31, type: 3}
  m_Name: StandingToUseItem
  m_EditorClassIdentifier: 
  priority: 0
  from: {fileID: 11400000, guid: 41f6342281e3b303f9e35699125c141a, type: 2}
  to: {fileID: 11400000, guid: 7b037a4eca0a7da66b07bd2c5a2344f6, type: 2}
