%YAML 1.1
%TAG !u! tag:unity3d.com,2011:
--- !u!114 &11400000
MonoBehaviour:
  m_ObjectHideFlags: 0
  m_CorrespondingSourceObject: {fileID: 0}
  m_PrefabInstance: {fileID: 0}
  m_PrefabAsset: {fileID: 0}
  m_GameObject: {fileID: 0}
  m_Enabled: 1
  m_EditorHideFlags: 0
  m_Script: {fileID: 11500000, guid: 5ce35649392b45dea4b6647edd3490e8, type: 3}
  m_Name: BasicShoot
  m_EditorClassIdentifier: 
  maxHull: 30
  rewardPoints: 5
  onDeathExplosion: {fileID: 2290740736791298978, guid: 4ce87c8f3f99769d2abe03cc3608dc06, type: 3}
  acceleration: 4
  deceleration: 4
  maxSpeed: 10
  mass: 1
  crashDamage: 5
  gravityScale: 1
  animator: {fileID: 9100000, guid: 04aaaa69fe64f1bfb960ec73900e06df, type: 2}
  movementAIs:
  - {fileID: 11400000, guid: e1799f784a4adba05a7e36b58d866801, type: 2}
  - {fileID: 11400000, guid: 1ed5088753ea2da92bd360d22737cf0c, type: 2}
  - {fileID: 11400000, guid: a5bf08337b93340789781b330a836a55, type: 2}
  timeToLookInFront: 1.5
  distanceFromPlanet: 0.75
  distanceFromPlayer: 2
  weapon: {fileID: 11400000, guid: e2832f9eb9298b91c9a2200f343436ca, type: 2}
  shootingAi: {fileID: 11400000, guid: a848d2d98d23cb7d3a07f5d2fcfb145f, type: 2}
  coins: 5
  lootData:
  - {fileID: 0}
  - {fileID: 11400000, guid: f52da95a5382c888fbd1fd9a228af62f, type: 2}
  - {fileID: 11400000, guid: 2cf4b3a140b00a158a365aac288241cd, type: 2}
  - {fileID: 11400000, guid: 873de226612c71fde9a84dcbdad041b4, type: 2}
  - {fileID: 11400000, guid: 13118f97e9715dee1b689472b46d0007, type: 2}
  - {fileID: 11400000, guid: 308ab979d6d339d74af2367271f4fdf4, type: 2}
  probabilityWeight: 060000000300000003000000010000000100000001000000
