%YAML 1.1
%TAG !u! tag:unity3d.com,2011:
--- !u!114 &11400000
MonoBehaviour:
  m_ObjectHideFlags: 0
  m_CorrespondingSourceObject: {fileID: 0}
  m_PrefabInstance: {fileID: 0}
  m_PrefabAsset: {fileID: 0}
  m_GameObject: {fileID: 0}
  m_Enabled: 1
  m_EditorHideFlags: 0
  m_Script: {fileID: 11500000, guid: a04437ff5b74a14389d3bb1ecaad1e42, type: 3}
  m_Name: OrbLoot
  m_EditorClassIdentifier: 
  lootDisplayer: {fileID: 8734296918599725157, guid: 5af9477c22012a8cd8e79860a1ff931e, type: 3}
  sprite: {fileID: 1733660088, guid: 4b4c257af25655f40a9e1c2e74ebb068, type: 3}
  timeToDespawn: 5
  weapon: {fileID: 11400000, guid: 831c7d4ba4473db4991b4341c4699a34, type: 2}
