%YAML 1.1
%TAG !u! tag:unity3d.com,2011:
--- !u!114 &11400000
MonoBehaviour:
  m_ObjectHideFlags: 0
  m_CorrespondingSourceObject: {fileID: 0}
  m_PrefabInstance: {fileID: 0}
  m_PrefabAsset: {fileID: 0}
  m_GameObject: {fileID: 0}
  m_Enabled: 1
  m_EditorHideFlags: 0
  m_Script: {fileID: 11500000, guid: 16a97aa42195475fae6b3418c6ac1725, type: 3}
  m_Name: Heal
  m_EditorClassIdentifier: 
  titleDefault: mi pona e sina
  titleEnglish: I will heal you
  textColor: {r: 0, g: 0, b: 0, a: 1}
  isTextLeft: 0
  banner: {fileID: 21300000, guid: cd1024d000a9827c2a211b8f8f0ed249, type: 3}
  photo: {fileID: 21300000, guid: 04f5c7985fc270a059f075a770a06818, type: 3}
  defaultText: sina jan utala. kon sina li pana ala pana e pilin ike tawa sina? mi
    pona e sina mute mute.
  englishText: You warrior, are you hurt? I can heal you and add to your hull {FIRST}
    points. It will cost you {SECOND}.
  options:
  - {fileID: 11400000, guid: f0471b0e2c8309a11bb6b218ee08e68b, type: 2}
  - {fileID: 11400000, guid: c9f5d7a46d301a59d8d1ee834b8d2932, type: 2}
  - {fileID: 11400000, guid: 965c31fce369a3bb68c91e0b94ed82be, type: 2}
  extraHull: 20
  cost: 30
