%YAML 1.1
%TAG !u! tag:unity3d.com,2011:
--- !u!114 &11400000
MonoBehaviour:
  m_ObjectHideFlags: 0
  m_CorrespondingSourceObject: {fileID: 0}
  m_PrefabInstance: {fileID: 0}
  m_PrefabAsset: {fileID: 0}
  m_GameObject: {fileID: 0}
  m_Enabled: 1
  m_EditorHideFlags: 0
  m_Script: {fileID: 11500000, guid: 5bb43451c2c04cb29983889d592e5717, type: 3}
  m_Name: PlayerDash
  m_EditorClassIdentifier: 
  skillName: Dash
  cost: 5
  energyCost: 40
  skillDuration: 1
  skillCooldown: 3
  canBeCanceled: 1
  inventoryIcon: {fileID: 21300000, guid: 4a1e656c8786f1ac58e7b6adfce4cb2b, type: 3}
  afterImage: {fileID: 7405995240334775252, guid: c453df78390c7c80ea1582b96db8856e, type: 3}
  afterImageCooldown: 0.15
  proportionOfMaxSpeedStartingDash: 1.3
  proportionOfMaxSpeedAfterDash: 0.5
