%YAML 1.1
%TAG !u! tag:unity3d.com,2011:
--- !u!114 &11400000
MonoBehaviour:
  m_ObjectHideFlags: 0
  m_CorrespondingSourceObject: {fileID: 0}
  m_PrefabInstance: {fileID: 0}
  m_PrefabAsset: {fileID: 0}
  m_GameObject: {fileID: 0}
  m_Enabled: 1
  m_EditorHideFlags: 0
  m_Script: {fileID: 11500000, guid: bbf55523b01d408896c80ae22f83ab87, type: 3}
  m_Name: BossWave
  m_EditorClassIdentifier: 
  title: Oh no the boss is here!
  hints: []
  minRadius: 15
  maxRadius: 25
  maxValue: 5
  listOfEnemies:
  - {fileID: 11400000, guid: 3608d86b6f28f102c864c09d26d4bc9a, type: 2}
  - {fileID: 11400000, guid: 3909537f7a52ad77bb39ccd5fe81cd87, type: 2}
  - {fileID: 11400000, guid: fc1061fbbfe73f87a91713aabc87cc4f, type: 2}
  - {fileID: 11400000, guid: 6da8585c7d78467568c409e1edf96abe, type: 2}
  - {fileID: 11400000, guid: 536a6ad8a06c530c5bbee672ea50241e, type: 2}
  - {fileID: 11400000, guid: 176d6cef642cd6d0aa6b0e0ff5b8bb0d, type: 2}
  listOfPrefabs:
  - {fileID: 7618708118428018753, guid: 4b4c2845b50f23f05922faef2d8da894, type: 3}
  - {fileID: 8026149403332787368, guid: 362ee817b849d562d9d2e6dedf62765b, type: 3}
  - {fileID: 2565965289943346801, guid: 2c13dd7f2007a42d89a48c60f45b42bc, type: 3}
  - {fileID: 8026149403332787368, guid: 362ee817b849d562d9d2e6dedf62765b, type: 3}
  - {fileID: 2565965289943346801, guid: 2c13dd7f2007a42d89a48c60f45b42bc, type: 3}
  - {fileID: 6006774149907583119, guid: 3a7f25b41829799899918c4e32c489e9, type: 3}
  listOfQuantities: 010000000300000003000000010000000100000001000000
  listOfValues: 030000000100000001000000020000000200000002000000
  listOfMeteorites:
  - {fileID: 4030741404286657173, guid: 457bc0e37216132049993b92834f71f2, type: 3}
  listOfMeteoriteData:
  - {fileID: 11400000, guid: b627116eb25fb52ec9c471aa76118e40, type: 2}
  timeBetweenMeteorites: 20
  listOfPrios: 00000000
