%YAML 1.1
%TAG !u! tag:unity3d.com,2011:
--- !u!114 &11400000
MonoBehaviour:
  m_ObjectHideFlags: 0
  m_CorrespondingSourceObject: {fileID: 0}
  m_PrefabInstance: {fileID: 0}
  m_PrefabAsset: {fileID: 0}
  m_GameObject: {fileID: 0}
  m_Enabled: 1
  m_EditorHideFlags: 0
  m_Script: {fileID: 11500000, guid: 4260d7f90244494fb612a43738b01f01, type: 3}
  m_Name: LandOnPlanet
  m_EditorClassIdentifier: 
  title: 
  hints: []
  sceneDuration: 5
  planetToLand: 0
  _timeToArrive: 0.5
