%YAML 1.1
%TAG !u! tag:unity3d.com,2011:
--- !u!114 &11400000
MonoBehaviour:
  m_ObjectHideFlags: 0
  m_CorrespondingSourceObject: {fileID: 0}
  m_PrefabInstance: {fileID: 0}
  m_PrefabAsset: {fileID: 0}
  m_GameObject: {fileID: 0}
  m_Enabled: 1
  m_EditorHideFlags: 0
  m_Script: {fileID: 11500000, guid: 5ce35649392b45dea4b6647edd3490e8, type: 3}
  m_Name: MachineGun
  m_EditorClassIdentifier: 
  maxHull: 50
  rewardPoints: 15
  onDeathExplosion: {fileID: 2290740736791298978, guid: 4ce87c8f3f99769d2abe03cc3608dc06, type: 3}
  acceleration: 3
  deceleration: 3
  maxSpeed: 7
  mass: 2
  crashDamage: 10
  gravityScale: 1
  animator: {fileID: 9100000, guid: 8226e2ab5889d9d4d9cb98e492826c40, type: 2}
  movementAIs:
  - {fileID: 11400000, guid: e1799f784a4adba05a7e36b58d866801, type: 2}
  - {fileID: 11400000, guid: 1ed5088753ea2da92bd360d22737cf0c, type: 2}
  - {fileID: 11400000, guid: f915ff49748d4a4fcb08b9e84284771b, type: 2}
  timeToLookInFront: 1.5
  distanceFromPlanet: 0.75
  distanceFromPlayer: 1.5
  weapon: {fileID: 11400000, guid: 27ee3dad78c24ba42b5649015b377c62, type: 2}
  shootingAi: {fileID: 11400000, guid: a848d2d98d23cb7d3a07f5d2fcfb145f, type: 2}
  coins: 35
  lootData:
  - {fileID: 11400000, guid: 47f9892d15005479bbd4b0d2f7c85e5e, type: 2}
  - {fileID: 11400000, guid: 5b574ff5a076e03e48146750ce394490, type: 2}
  - {fileID: 11400000, guid: a63485806201608909621cf87323bc6e, type: 2}
  - {fileID: 11400000, guid: f52da95a5382c888fbd1fd9a228af62f, type: 2}
  probabilityWeight: 02000000020000000100000002000000
