%YAML 1.1
%TAG !u! tag:unity3d.com,2011:
--- !u!114 &11400000
MonoBehaviour:
  m_ObjectHideFlags: 0
  m_CorrespondingSourceObject: {fileID: 0}
  m_PrefabInstance: {fileID: 0}
  m_PrefabAsset: {fileID: 0}
  m_GameObject: {fileID: 0}
  m_Enabled: 1
  m_EditorHideFlags: 0
  m_Script: {fileID: 11500000, guid: 5d5b6ae7c3f94b0fa4787c2ed13c4e32, type: 3}
  m_Name: BeRude
  m_EditorClassIdentifier: 
  defaultText: "Ich hab mich oft geb\xFCcket,"
  englishText: Are you dumb?
  offer: {fileID: 11400000, guid: 463c4274b6a849ef782eda2e26f44d7b, type: 2}
