%YAML 1.1
%TAG !u! tag:unity3d.com,2011:
--- !u!1001 &755032786011075670
PrefabInstance:
  m_ObjectHideFlags: 0
  serializedVersion: 2
  m_Modification:
    m_TransformParent: {fileID: 0}
    m_Modifications:
    - target: {fileID: 1162934723168542, guid: 80936324c84277d498ccd724f0e55e94, type: 3}
      propertyPath: m_Name
      value: fireball-blue-tail-small Variant
      objectReference: {fileID: 0}
    - target: {fileID: 4736677845459218, guid: 80936324c84277d498ccd724f0e55e94, type: 3}
      propertyPath: m_RootOrder
      value: 0
      objectReference: {fileID: 0}
    - target: {fileID: 4736677845459218, guid: 80936324c84277d498ccd724f0e55e94, type: 3}
      propertyPath: m_LocalPosition.x
      value: -13.02
      objectReference: {fileID: 0}
    - target: {fileID: 4736677845459218, guid: 80936324c84277d498ccd724f0e55e94, type: 3}
      propertyPath: m_LocalPosition.y
      value: -6.09
      objectReference: {fileID: 0}
    - target: {fileID: 4736677845459218, guid: 80936324c84277d498ccd724f0e55e94, type: 3}
      propertyPath: m_LocalPosition.z
      value: 0
      objectReference: {fileID: 0}
    - target: {fileID: 4736677845459218, guid: 80936324c84277d498ccd724f0e55e94, type: 3}
      propertyPath: m_LocalRotation.w
      value: 1
      objectReference: {fileID: 0}
    - target: {fileID: 4736677845459218, guid: 80936324c84277d498ccd724f0e55e94, type: 3}
      propertyPath: m_LocalRotation.x
      value: 0
      objectReference: {fileID: 0}
    - target: {fileID: 4736677845459218, guid: 80936324c84277d498ccd724f0e55e94, type: 3}
      propertyPath: m_LocalRotation.y
      value: 0
      objectReference: {fileID: 0}
    - target: {fileID: 4736677845459218, guid: 80936324c84277d498ccd724f0e55e94, type: 3}
      propertyPath: m_LocalRotation.z
      value: 0
      objectReference: {fileID: 0}
    - target: {fileID: 4736677845459218, guid: 80936324c84277d498ccd724f0e55e94, type: 3}
      propertyPath: m_LocalEulerAnglesHint.x
      value: 0
      objectReference: {fileID: 0}
    - target: {fileID: 4736677845459218, guid: 80936324c84277d498ccd724f0e55e94, type: 3}
      propertyPath: m_LocalEulerAnglesHint.y
      value: 0
      objectReference: {fileID: 0}
    - target: {fileID: 4736677845459218, guid: 80936324c84277d498ccd724f0e55e94, type: 3}
      propertyPath: m_LocalEulerAnglesHint.z
      value: 0
      objectReference: {fileID: 0}
    m_RemovedComponents: []
  m_SourcePrefab: {fileID: 100100000, guid: 80936324c84277d498ccd724f0e55e94, type: 3}
--- !u!1 &756125347592076616 stripped
GameObject:
  m_CorrespondingSourceObject: {fileID: 1162934723168542, guid: 80936324c84277d498ccd724f0e55e94,
    type: 3}
  m_PrefabInstance: {fileID: 755032786011075670}
  m_PrefabAsset: {fileID: 0}
--- !u!50 &3228228532238773932
Rigidbody2D:
  serializedVersion: 4
  m_ObjectHideFlags: 0
  m_CorrespondingSourceObject: {fileID: 0}
  m_PrefabInstance: {fileID: 0}
  m_PrefabAsset: {fileID: 0}
  m_GameObject: {fileID: 756125347592076616}
  m_BodyType: 0
  m_Simulated: 1
  m_UseFullKinematicContacts: 0
  m_UseAutoMass: 0
  m_Mass: 1
  m_LinearDrag: 0
  m_AngularDrag: 0.05
  m_GravityScale: 0
  m_Material: {fileID: 0}
  m_Interpolate: 0
  m_SleepingMode: 1
  m_CollisionDetection: 0
  m_Constraints: 0
--- !u!61 &1861135172445569246
BoxCollider2D:
  m_ObjectHideFlags: 0
  m_CorrespondingSourceObject: {fileID: 0}
  m_PrefabInstance: {fileID: 0}
  m_PrefabAsset: {fileID: 0}
  m_GameObject: {fileID: 756125347592076616}
  m_Enabled: 1
  m_Density: 1
  m_Material: {fileID: 0}
  m_IsTrigger: 1
  m_UsedByEffector: 0
  m_UsedByComposite: 0
  m_Offset: {x: -0.0014552306, y: 0.024739683}
  m_SpriteTilingProperty:
    border: {x: 0, y: 0, z: 0, w: 0}
    pivot: {x: 0.5291046, y: 0.27509376}
    oldSize: {x: 0.05, y: 0.11}
    newSize: {x: 0.05, y: 0.11}
    adaptiveTilingThreshold: 0.5
    drawMode: 0
    adaptiveTiling: 0
  m_AutoTiling: 0
  serializedVersion: 2
  m_Size: {x: 0.05, y: 0.11}
  m_EdgeRadius: 0
--- !u!114 &7493353499386511163
MonoBehaviour:
  m_ObjectHideFlags: 0
  m_CorrespondingSourceObject: {fileID: 0}
  m_PrefabInstance: {fileID: 0}
  m_PrefabAsset: {fileID: 0}
  m_GameObject: {fileID: 756125347592076616}
  m_Enabled: 1
  m_EditorHideFlags: 0
  m_Script: {fileID: 11500000, guid: 153b092d24bbb12419d465052eb41b83, type: 3}
  m_Name: 
  m_EditorClassIdentifier: 
  _speed: 5
