%YAML 1.1
%TAG !u! tag:unity3d.com,2011:
--- !u!1045 &1
EditorBuildSettings:
  m_ObjectHideFlags: 0
  serializedVersion: 2
  m_Scenes:
  - enabled: 1
    path: Assets/START.unity
    guid: c18b7944a2a5f5543857a3a7b4b962bc
  - enabled: 1
    path: Assets/M17UF1-Prova.unity
    guid: 9a736e86abb7448989e07a825d65a290
  m_configObjects: {}
