%YAML 1.1
%TAG !u! tag:unity3d.com,2011:
--- !u!29 &1
OcclusionCullingSettings:
  m_ObjectHideFlags: 0
  serializedVersion: 2
  m_OcclusionBakeSettings:
    smallestOccluder: 5
    smallestHole: 0.25
    backfaceThreshold: 100
  m_SceneGUID: 00000000000000000000000000000000
  m_OcclusionCullingData: {fileID: 0}
--- !u!104 &2
RenderSettings:
  m_ObjectHideFlags: 0
  serializedVersion: 9
  m_Fog: 0
  m_FogColor: {r: 0.5, g: 0.5, b: 0.5, a: 1}
  m_FogMode: 3
  m_FogDensity: 0.01
  m_LinearFogStart: 0
  m_LinearFogEnd: 300
  m_AmbientSkyColor: {r: 0.212, g: 0.227, b: 0.259, a: 1}
  m_AmbientEquatorColor: {r: 0.114, g: 0.125, b: 0.133, a: 1}
  m_AmbientGroundColor: {r: 0.047, g: 0.043, b: 0.035, a: 1}
  m_AmbientIntensity: 1
  m_AmbientMode: 3
  m_SubtractiveShadowColor: {r: 0.42, g: 0.478, b: 0.627, a: 1}
  m_SkyboxMaterial: {fileID: 0}
  m_HaloStrength: 0.5
  m_FlareStrength: 1
  m_FlareFadeSpeed: 3
  m_HaloTexture: {fileID: 0}
  m_SpotCookie: {fileID: 10001, guid: 0000000000000000e000000000000000, type: 0}
  m_DefaultReflectionMode: 0
  m_DefaultReflectionResolution: 128
  m_ReflectionBounces: 1
  m_ReflectionIntensity: 1
  m_CustomReflection: {fileID: 0}
  m_Sun: {fileID: 0}
  m_IndirectSpecularColor: {r: 0, g: 0, b: 0, a: 1}
  m_UseRadianceAmbientProbe: 0
--- !u!157 &3
LightmapSettings:
  m_ObjectHideFlags: 0
  serializedVersion: 12
  m_GIWorkflowMode: 1
  m_GISettings:
    serializedVersion: 2
    m_BounceScale: 1
    m_IndirectOutputScale: 1
    m_AlbedoBoost: 1
    m_EnvironmentLightingMode: 0
    m_EnableBakedLightmaps: 0
    m_EnableRealtimeLightmaps: 0
  m_LightmapEditorSettings:
    serializedVersion: 12
    m_Resolution: 2
    m_BakeResolution: 40
    m_AtlasSize: 1024
    m_AO: 0
    m_AOMaxDistance: 1
    m_CompAOExponent: 1
    m_CompAOExponentDirect: 0
    m_ExtractAmbientOcclusion: 0
    m_Padding: 2
    m_LightmapParameters: {fileID: 0}
    m_LightmapsBakeMode: 1
    m_TextureCompression: 1
    m_FinalGather: 0
    m_FinalGatherFiltering: 1
    m_FinalGatherRayCount: 256
    m_ReflectionCompression: 2
    m_MixedBakeMode: 2
    m_BakeBackend: 0
    m_PVRSampling: 1
    m_PVRDirectSampleCount: 32
    m_PVRSampleCount: 500
    m_PVRBounces: 2
    m_PVREnvironmentSampleCount: 500
    m_PVREnvironmentReferencePointCount: 2048
    m_PVRFilteringMode: 2
    m_PVRDenoiserTypeDirect: 0
    m_PVRDenoiserTypeIndirect: 0
    m_PVRDenoiserTypeAO: 0
    m_PVRFilterTypeDirect: 0
    m_PVRFilterTypeIndirect: 0
    m_PVRFilterTypeAO: 0
    m_PVREnvironmentMIS: 0
    m_PVRCulling: 1
    m_PVRFilteringGaussRadiusDirect: 1
    m_PVRFilteringGaussRadiusIndirect: 5
    m_PVRFilteringGaussRadiusAO: 2
    m_PVRFilteringAtrousPositionSigmaDirect: 0.5
    m_PVRFilteringAtrousPositionSigmaIndirect: 2
    m_PVRFilteringAtrousPositionSigmaAO: 1
    m_ExportTrainingData: 0
    m_TrainingDataDestination: TrainingData
    m_LightProbeSampleCountMultiplier: 4
  m_LightingDataAsset: {fileID: 0}
  m_LightingSettings: {fileID: 0}
--- !u!196 &4
NavMeshSettings:
  serializedVersion: 2
  m_ObjectHideFlags: 0
  m_BuildSettings:
    serializedVersion: 2
    agentTypeID: 0
    agentRadius: 0.5
    agentHeight: 2
    agentSlope: 45
    agentClimb: 0.4
    ledgeDropHeight: 0
    maxJumpAcrossDistance: 0
    minRegionArea: 2
    manualCellSize: 0
    cellSize: 0.16666667
    manualTileSize: 0
    tileSize: 256
    accuratePlacement: 0
    maxJobWorkers: 0
    preserveTilesOutsideBounds: 0
    debug:
      m_Flags: 0
  m_NavMeshData: {fileID: 0}
--- !u!1001 &292002081
PrefabInstance:
  m_ObjectHideFlags: 0
  serializedVersion: 2
  m_Modification:
    m_TransformParent: {fileID: 0}
    m_Modifications:
    - target: {fileID: -8653719598885068355, guid: a0ab6fe7a59625c1f9a28400b92dc540, type: 3}
      propertyPath: m_Name
      value: Protagonist
      objectReference: {fileID: 0}
    - target: {fileID: -7561113526181806574, guid: a0ab6fe7a59625c1f9a28400b92dc540, type: 3}
      propertyPath: m_LocalRotation.w
      value: 0.015162202
      objectReference: {fileID: 0}
    - target: {fileID: -7561113526181806574, guid: a0ab6fe7a59625c1f9a28400b92dc540, type: 3}
      propertyPath: m_LocalRotation.x
      value: 0
      objectReference: {fileID: 0}
    - target: {fileID: -7561113526181806574, guid: a0ab6fe7a59625c1f9a28400b92dc540, type: 3}
      propertyPath: m_LocalRotation.y
      value: -0
      objectReference: {fileID: 0}
    - target: {fileID: -7561113526181806574, guid: a0ab6fe7a59625c1f9a28400b92dc540, type: 3}
      propertyPath: m_LocalRotation.z
      value: -0.9998851
      objectReference: {fileID: 0}
    - target: {fileID: -7561113526181806574, guid: a0ab6fe7a59625c1f9a28400b92dc540, type: 3}
      propertyPath: m_LocalEulerAnglesHint.z
      value: 0
      objectReference: {fileID: 0}
    - target: {fileID: -7552582706839291426, guid: a0ab6fe7a59625c1f9a28400b92dc540, type: 3}
      propertyPath: m_RootOrder
      value: 1
      objectReference: {fileID: 0}
    - target: {fileID: -7552582706839291426, guid: a0ab6fe7a59625c1f9a28400b92dc540, type: 3}
      propertyPath: m_LocalPosition.x
      value: -2.0921307
      objectReference: {fileID: 0}
    - target: {fileID: -7552582706839291426, guid: a0ab6fe7a59625c1f9a28400b92dc540, type: 3}
      propertyPath: m_LocalPosition.y
      value: -5.35
      objectReference: {fileID: 0}
    - target: {fileID: -7552582706839291426, guid: a0ab6fe7a59625c1f9a28400b92dc540, type: 3}
      propertyPath: m_LocalPosition.z
      value: 0
      objectReference: {fileID: 0}
    - target: {fileID: -7552582706839291426, guid: a0ab6fe7a59625c1f9a28400b92dc540, type: 3}
      propertyPath: m_LocalRotation.w
      value: 1
      objectReference: {fileID: 0}
    - target: {fileID: -7552582706839291426, guid: a0ab6fe7a59625c1f9a28400b92dc540, type: 3}
      propertyPath: m_LocalRotation.x
      value: 0
      objectReference: {fileID: 0}
    - target: {fileID: -7552582706839291426, guid: a0ab6fe7a59625c1f9a28400b92dc540, type: 3}
      propertyPath: m_LocalRotation.y
      value: 0
      objectReference: {fileID: 0}
    - target: {fileID: -7552582706839291426, guid: a0ab6fe7a59625c1f9a28400b92dc540, type: 3}
      propertyPath: m_LocalRotation.z
      value: 0
      objectReference: {fileID: 0}
    - target: {fileID: -7552582706839291426, guid: a0ab6fe7a59625c1f9a28400b92dc540, type: 3}
      propertyPath: m_LocalEulerAnglesHint.x
      value: 0
      objectReference: {fileID: 0}
    - target: {fileID: -7552582706839291426, guid: a0ab6fe7a59625c1f9a28400b92dc540, type: 3}
      propertyPath: m_LocalEulerAnglesHint.y
      value: 0
      objectReference: {fileID: 0}
    - target: {fileID: -7552582706839291426, guid: a0ab6fe7a59625c1f9a28400b92dc540, type: 3}
      propertyPath: m_LocalEulerAnglesHint.z
      value: 0
      objectReference: {fileID: 0}
    - target: {fileID: -7221020487405985688, guid: a0ab6fe7a59625c1f9a28400b92dc540, type: 3}
      propertyPath: m_LocalScale.x
      value: 0.9999999
      objectReference: {fileID: 0}
    - target: {fileID: -7221020487405985688, guid: a0ab6fe7a59625c1f9a28400b92dc540, type: 3}
      propertyPath: m_LocalScale.y
      value: 0.9999999
      objectReference: {fileID: 0}
    - target: {fileID: -7221020487405985688, guid: a0ab6fe7a59625c1f9a28400b92dc540, type: 3}
      propertyPath: m_LocalRotation.w
      value: 0.99992573
      objectReference: {fileID: 0}
    - target: {fileID: -7221020487405985688, guid: a0ab6fe7a59625c1f9a28400b92dc540, type: 3}
      propertyPath: m_LocalRotation.x
      value: 0
      objectReference: {fileID: 0}
    - target: {fileID: -7221020487405985688, guid: a0ab6fe7a59625c1f9a28400b92dc540, type: 3}
      propertyPath: m_LocalRotation.y
      value: 0
      objectReference: {fileID: 0}
    - target: {fileID: -7221020487405985688, guid: a0ab6fe7a59625c1f9a28400b92dc540, type: 3}
      propertyPath: m_LocalRotation.z
      value: 0.012187485
      objectReference: {fileID: 0}
    - target: {fileID: -7221020487405985688, guid: a0ab6fe7a59625c1f9a28400b92dc540, type: 3}
      propertyPath: m_LocalEulerAnglesHint.z
      value: 0
      objectReference: {fileID: 0}
    - target: {fileID: -3199406794788031522, guid: a0ab6fe7a59625c1f9a28400b92dc540, type: 3}
      propertyPath: m_LocalRotation.w
      value: 0.9996547
      objectReference: {fileID: 0}
    - target: {fileID: -3199406794788031522, guid: a0ab6fe7a59625c1f9a28400b92dc540, type: 3}
      propertyPath: m_LocalRotation.x
      value: 0
      objectReference: {fileID: 0}
    - target: {fileID: -3199406794788031522, guid: a0ab6fe7a59625c1f9a28400b92dc540, type: 3}
      propertyPath: m_LocalRotation.y
      value: 0
      objectReference: {fileID: 0}
    - target: {fileID: -3199406794788031522, guid: a0ab6fe7a59625c1f9a28400b92dc540, type: 3}
      propertyPath: m_LocalRotation.z
      value: -0.026278954
      objectReference: {fileID: 0}
    - target: {fileID: -3199406794788031522, guid: a0ab6fe7a59625c1f9a28400b92dc540, type: 3}
      propertyPath: m_LocalEulerAnglesHint.z
      value: 0
      objectReference: {fileID: 0}
    - target: {fileID: 311580695235782034, guid: a0ab6fe7a59625c1f9a28400b92dc540, type: 3}
      propertyPath: m_LocalRotation.w
      value: 0.9999833
      objectReference: {fileID: 0}
    - target: {fileID: 311580695235782034, guid: a0ab6fe7a59625c1f9a28400b92dc540, type: 3}
      propertyPath: m_LocalRotation.x
      value: 0
      objectReference: {fileID: 0}
    - target: {fileID: 311580695235782034, guid: a0ab6fe7a59625c1f9a28400b92dc540, type: 3}
      propertyPath: m_LocalRotation.y
      value: 0
      objectReference: {fileID: 0}
    - target: {fileID: 311580695235782034, guid: a0ab6fe7a59625c1f9a28400b92dc540, type: 3}
      propertyPath: m_LocalRotation.z
      value: 0.0057902727
      objectReference: {fileID: 0}
    - target: {fileID: 311580695235782034, guid: a0ab6fe7a59625c1f9a28400b92dc540, type: 3}
      propertyPath: m_LocalEulerAnglesHint.z
      value: 0
      objectReference: {fileID: 0}
    - target: {fileID: 763660694920740480, guid: a0ab6fe7a59625c1f9a28400b92dc540, type: 3}
      propertyPath: m_LocalPosition.y
      value: 0.00000020607993
      objectReference: {fileID: 0}
    - target: {fileID: 763660694920740480, guid: a0ab6fe7a59625c1f9a28400b92dc540, type: 3}
      propertyPath: m_LocalRotation.w
      value: 0.9994262
      objectReference: {fileID: 0}
    - target: {fileID: 763660694920740480, guid: a0ab6fe7a59625c1f9a28400b92dc540, type: 3}
      propertyPath: m_LocalRotation.x
      value: 0
      objectReference: {fileID: 0}
    - target: {fileID: 763660694920740480, guid: a0ab6fe7a59625c1f9a28400b92dc540, type: 3}
      propertyPath: m_LocalRotation.y
      value: 0
      objectReference: {fileID: 0}
    - target: {fileID: 763660694920740480, guid: a0ab6fe7a59625c1f9a28400b92dc540, type: 3}
      propertyPath: m_LocalRotation.z
      value: -0.0338727
      objectReference: {fileID: 0}
    - target: {fileID: 763660694920740480, guid: a0ab6fe7a59625c1f9a28400b92dc540, type: 3}
      propertyPath: m_LocalEulerAnglesHint.z
      value: 0
      objectReference: {fileID: 0}
    - target: {fileID: 1447206975777293173, guid: a0ab6fe7a59625c1f9a28400b92dc540, type: 3}
      propertyPath: m_LocalRotation.w
      value: 0.7300691
      objectReference: {fileID: 0}
    - target: {fileID: 1447206975777293173, guid: a0ab6fe7a59625c1f9a28400b92dc540, type: 3}
      propertyPath: m_LocalRotation.x
      value: 0
      objectReference: {fileID: 0}
    - target: {fileID: 1447206975777293173, guid: a0ab6fe7a59625c1f9a28400b92dc540, type: 3}
      propertyPath: m_LocalRotation.y
      value: 0
      objectReference: {fileID: 0}
    - target: {fileID: 1447206975777293173, guid: a0ab6fe7a59625c1f9a28400b92dc540, type: 3}
      propertyPath: m_LocalRotation.z
      value: 0.6833734
      objectReference: {fileID: 0}
    - target: {fileID: 1447206975777293173, guid: a0ab6fe7a59625c1f9a28400b92dc540, type: 3}
      propertyPath: m_LocalEulerAnglesHint.z
      value: 0
      objectReference: {fileID: 0}
    - target: {fileID: 1466605569007584153, guid: a0ab6fe7a59625c1f9a28400b92dc540, type: 3}
      propertyPath: m_LocalRotation.w
      value: 0.9990606
      objectReference: {fileID: 0}
    - target: {fileID: 1466605569007584153, guid: a0ab6fe7a59625c1f9a28400b92dc540, type: 3}
      propertyPath: m_LocalRotation.x
      value: 0
      objectReference: {fileID: 0}
    - target: {fileID: 1466605569007584153, guid: a0ab6fe7a59625c1f9a28400b92dc540, type: 3}
      propertyPath: m_LocalRotation.y
      value: 0
      objectReference: {fileID: 0}
    - target: {fileID: 1466605569007584153, guid: a0ab6fe7a59625c1f9a28400b92dc540, type: 3}
      propertyPath: m_LocalRotation.z
      value: 0.043336164
      objectReference: {fileID: 0}
    - target: {fileID: 1466605569007584153, guid: a0ab6fe7a59625c1f9a28400b92dc540, type: 3}
      propertyPath: m_LocalEulerAnglesHint.z
      value: 0
      objectReference: {fileID: 0}
    - target: {fileID: 2015287661806188099, guid: a0ab6fe7a59625c1f9a28400b92dc540, type: 3}
      propertyPath: m_LocalRotation.w
      value: 0.999951
      objectReference: {fileID: 0}
    - target: {fileID: 2015287661806188099, guid: a0ab6fe7a59625c1f9a28400b92dc540, type: 3}
      propertyPath: m_LocalRotation.x
      value: 0
      objectReference: {fileID: 0}
    - target: {fileID: 2015287661806188099, guid: a0ab6fe7a59625c1f9a28400b92dc540, type: 3}
      propertyPath: m_LocalRotation.y
      value: 0
      objectReference: {fileID: 0}
    - target: {fileID: 2015287661806188099, guid: a0ab6fe7a59625c1f9a28400b92dc540, type: 3}
      propertyPath: m_LocalRotation.z
      value: -0.009898992
      objectReference: {fileID: 0}
    - target: {fileID: 2015287661806188099, guid: a0ab6fe7a59625c1f9a28400b92dc540, type: 3}
      propertyPath: m_LocalEulerAnglesHint.z
      value: 0
      objectReference: {fileID: 0}
    - target: {fileID: 2063762043519630310, guid: a0ab6fe7a59625c1f9a28400b92dc540, type: 3}
      propertyPath: m_LocalRotation.w
      value: 0.077937596
      objectReference: {fileID: 0}
    - target: {fileID: 2063762043519630310, guid: a0ab6fe7a59625c1f9a28400b92dc540, type: 3}
      propertyPath: m_LocalRotation.x
      value: 0
      objectReference: {fileID: 0}
    - target: {fileID: 2063762043519630310, guid: a0ab6fe7a59625c1f9a28400b92dc540, type: 3}
      propertyPath: m_LocalRotation.z
      value: 0.99695826
      objectReference: {fileID: 0}
    - target: {fileID: 2063762043519630310, guid: a0ab6fe7a59625c1f9a28400b92dc540, type: 3}
      propertyPath: m_LocalEulerAnglesHint.z
      value: 0
      objectReference: {fileID: 0}
    - target: {fileID: 2300871795886169620, guid: a0ab6fe7a59625c1f9a28400b92dc540, type: 3}
      propertyPath: m_LocalRotation.w
      value: 0.3279828
      objectReference: {fileID: 0}
    - target: {fileID: 2300871795886169620, guid: a0ab6fe7a59625c1f9a28400b92dc540, type: 3}
      propertyPath: m_LocalRotation.x
      value: -0
      objectReference: {fileID: 0}
    - target: {fileID: 2300871795886169620, guid: a0ab6fe7a59625c1f9a28400b92dc540, type: 3}
      propertyPath: m_LocalRotation.z
      value: 0.9446838
      objectReference: {fileID: 0}
    - target: {fileID: 2300871795886169620, guid: a0ab6fe7a59625c1f9a28400b92dc540, type: 3}
      propertyPath: m_LocalEulerAnglesHint.z
      value: 141.707
      objectReference: {fileID: 0}
    - target: {fileID: 2614376700115881846, guid: a0ab6fe7a59625c1f9a28400b92dc540, type: 3}
      propertyPath: m_LocalRotation.w
      value: 0.90628093
      objectReference: {fileID: 0}
    - target: {fileID: 2614376700115881846, guid: a0ab6fe7a59625c1f9a28400b92dc540, type: 3}
      propertyPath: m_LocalRotation.x
      value: -0
      objectReference: {fileID: 0}
    - target: {fileID: 2614376700115881846, guid: a0ab6fe7a59625c1f9a28400b92dc540, type: 3}
      propertyPath: m_LocalRotation.y
      value: -0
      objectReference: {fileID: 0}
    - target: {fileID: 2614376700115881846, guid: a0ab6fe7a59625c1f9a28400b92dc540, type: 3}
      propertyPath: m_LocalRotation.z
      value: 0.42267603
      objectReference: {fileID: 0}
    - target: {fileID: 2614376700115881846, guid: a0ab6fe7a59625c1f9a28400b92dc540, type: 3}
      propertyPath: m_LocalEulerAnglesHint.z
      value: 50.007
      objectReference: {fileID: 0}
    - target: {fileID: 4257508509235537429, guid: a0ab6fe7a59625c1f9a28400b92dc540, type: 3}
      propertyPath: m_LocalPosition.y
      value: 2.314207
      objectReference: {fileID: 0}
    - target: {fileID: 4257508509235537429, guid: a0ab6fe7a59625c1f9a28400b92dc540, type: 3}
      propertyPath: m_LocalRotation.w
      value: 0.7043176
      objectReference: {fileID: 0}
    - target: {fileID: 4257508509235537429, guid: a0ab6fe7a59625c1f9a28400b92dc540, type: 3}
      propertyPath: m_LocalRotation.x
      value: 0
      objectReference: {fileID: 0}
    - target: {fileID: 4257508509235537429, guid: a0ab6fe7a59625c1f9a28400b92dc540, type: 3}
      propertyPath: m_LocalRotation.y
      value: 0
      objectReference: {fileID: 0}
    - target: {fileID: 4257508509235537429, guid: a0ab6fe7a59625c1f9a28400b92dc540, type: 3}
      propertyPath: m_LocalRotation.z
      value: 0.709885
      objectReference: {fileID: 0}
    - target: {fileID: 4257508509235537429, guid: a0ab6fe7a59625c1f9a28400b92dc540, type: 3}
      propertyPath: m_LocalEulerAnglesHint.z
      value: 0
      objectReference: {fileID: 0}
    - target: {fileID: 4524337502883179777, guid: a0ab6fe7a59625c1f9a28400b92dc540, type: 3}
      propertyPath: m_LocalPosition.x
      value: 0.51992846
      objectReference: {fileID: 0}
    - target: {fileID: 4524337502883179777, guid: a0ab6fe7a59625c1f9a28400b92dc540, type: 3}
      propertyPath: m_LocalPosition.y
      value: -0.00000026802104
      objectReference: {fileID: 0}
    - target: {fileID: 4524337502883179777, guid: a0ab6fe7a59625c1f9a28400b92dc540, type: 3}
      propertyPath: m_LocalRotation.w
      value: 0.9984885
      objectReference: {fileID: 0}
    - target: {fileID: 4524337502883179777, guid: a0ab6fe7a59625c1f9a28400b92dc540, type: 3}
      propertyPath: m_LocalRotation.x
      value: 0
      objectReference: {fileID: 0}
    - target: {fileID: 4524337502883179777, guid: a0ab6fe7a59625c1f9a28400b92dc540, type: 3}
      propertyPath: m_LocalRotation.y
      value: 0
      objectReference: {fileID: 0}
    - target: {fileID: 4524337502883179777, guid: a0ab6fe7a59625c1f9a28400b92dc540, type: 3}
      propertyPath: m_LocalRotation.z
      value: 0.0549612
      objectReference: {fileID: 0}
    - target: {fileID: 4524337502883179777, guid: a0ab6fe7a59625c1f9a28400b92dc540, type: 3}
      propertyPath: m_LocalEulerAnglesHint.z
      value: 0
      objectReference: {fileID: 0}
    - target: {fileID: 4988801263700739594, guid: a0ab6fe7a59625c1f9a28400b92dc540, type: 3}
      propertyPath: m_LocalRotation.w
      value: 0.42561182
      objectReference: {fileID: 0}
    - target: {fileID: 4988801263700739594, guid: a0ab6fe7a59625c1f9a28400b92dc540, type: 3}
      propertyPath: m_LocalRotation.x
      value: -0
      objectReference: {fileID: 0}
    - target: {fileID: 4988801263700739594, guid: a0ab6fe7a59625c1f9a28400b92dc540, type: 3}
      propertyPath: m_LocalRotation.z
      value: -0.90490586
      objectReference: {fileID: 0}
    - target: {fileID: 4988801263700739594, guid: a0ab6fe7a59625c1f9a28400b92dc540, type: 3}
      propertyPath: m_LocalEulerAnglesHint.z
      value: -129.621
      objectReference: {fileID: 0}
    - target: {fileID: 7796712431219789332, guid: a0ab6fe7a59625c1f9a28400b92dc540, type: 3}
      propertyPath: m_LocalPosition.x
      value: 0.9030917
      objectReference: {fileID: 0}
    - target: {fileID: 7796712431219789332, guid: a0ab6fe7a59625c1f9a28400b92dc540, type: 3}
      propertyPath: m_LocalPosition.y
      value: 0.00000010767762
      objectReference: {fileID: 0}
    - target: {fileID: 7796712431219789332, guid: a0ab6fe7a59625c1f9a28400b92dc540, type: 3}
      propertyPath: m_LocalRotation.w
      value: 0.7284207
      objectReference: {fileID: 0}
    - target: {fileID: 7796712431219789332, guid: a0ab6fe7a59625c1f9a28400b92dc540, type: 3}
      propertyPath: m_LocalRotation.x
      value: 0
      objectReference: {fileID: 0}
    - target: {fileID: 7796712431219789332, guid: a0ab6fe7a59625c1f9a28400b92dc540, type: 3}
      propertyPath: m_LocalRotation.y
      value: 0
      objectReference: {fileID: 0}
    - target: {fileID: 7796712431219789332, guid: a0ab6fe7a59625c1f9a28400b92dc540, type: 3}
      propertyPath: m_LocalRotation.z
      value: 0.68513024
      objectReference: {fileID: 0}
    - target: {fileID: 7796712431219789332, guid: a0ab6fe7a59625c1f9a28400b92dc540, type: 3}
      propertyPath: m_LocalEulerAnglesHint.z
      value: 0
      objectReference: {fileID: 0}
    m_RemovedComponents: []
  m_SourcePrefab: {fileID: 4843985084834002234, guid: a0ab6fe7a59625c1f9a28400b92dc540, type: 3}
--- !u!1 &519420028
GameObject:
  m_ObjectHideFlags: 0
  m_CorrespondingSourceObject: {fileID: 0}
  m_PrefabInstance: {fileID: 0}
  m_PrefabAsset: {fileID: 0}
  serializedVersion: 6
  m_Component:
  - component: {fileID: 519420032}
  - component: {fileID: 519420031}
  - component: {fileID: 519420029}
  m_Layer: 0
  m_Name: Main Camera
  m_TagString: MainCamera
  m_Icon: {fileID: 0}
  m_NavMeshLayer: 0
  m_StaticEditorFlags: 0
  m_IsActive: 1
--- !u!81 &519420029
AudioListener:
  m_ObjectHideFlags: 0
  m_CorrespondingSourceObject: {fileID: 0}
  m_PrefabInstance: {fileID: 0}
  m_PrefabAsset: {fileID: 0}
  m_GameObject: {fileID: 519420028}
  m_Enabled: 1
--- !u!20 &519420031
Camera:
  m_ObjectHideFlags: 0
  m_CorrespondingSourceObject: {fileID: 0}
  m_PrefabInstance: {fileID: 0}
  m_PrefabAsset: {fileID: 0}
  m_GameObject: {fileID: 519420028}
  m_Enabled: 1
  serializedVersion: 2
  m_ClearFlags: 2
  m_BackGroundColor: {r: 0.19215687, g: 0.3019608, b: 0.4745098, a: 0}
  m_projectionMatrixMode: 1
  m_GateFitMode: 2
  m_FOVAxisMode: 0
  m_SensorSize: {x: 36, y: 24}
  m_LensShift: {x: 0, y: 0}
  m_FocalLength: 50
  m_NormalizedViewPortRect:
    serializedVersion: 2
    x: 0
    y: 0
    width: 1
    height: 1
  near clip plane: 0.3
  far clip plane: 1000
  field of view: 60
  orthographic: 1
  orthographic size: 5
  m_Depth: -1
  m_CullingMask:
    serializedVersion: 2
    m_Bits: 4294967295
  m_RenderingPath: -1
  m_TargetTexture: {fileID: 0}
  m_TargetDisplay: 0
  m_TargetEye: 0
  m_HDR: 1
  m_AllowMSAA: 0
  m_AllowDynamicResolution: 0
  m_ForceIntoRT: 0
  m_OcclusionCulling: 0
  m_StereoConvergence: 10
  m_StereoSeparation: 0.022
--- !u!4 &519420032
Transform:
  m_ObjectHideFlags: 0
  m_CorrespondingSourceObject: {fileID: 0}
  m_PrefabInstance: {fileID: 0}
  m_PrefabAsset: {fileID: 0}
  m_GameObject: {fileID: 519420028}
  m_LocalRotation: {x: 0, y: 0, z: 0, w: 1}
  m_LocalPosition: {x: 0, y: 0, z: -10}
  m_LocalScale: {x: 1, y: 1, z: 1}
  m_ConstrainProportionsScale: 0
  m_Children: []
  m_Father: {fileID: 0}
  m_RootOrder: 0
  m_LocalEulerAnglesHint: {x: 0, y: 0, z: 0}
--- !u!1 &961066317 stripped
GameObject:
  m_CorrespondingSourceObject: {fileID: -8653719598885068355, guid: a0ab6fe7a59625c1f9a28400b92dc540, type: 3}
  m_PrefabInstance: {fileID: 292002081}
  m_PrefabAsset: {fileID: 0}
--- !u!95 &961066318
Animator:
  serializedVersion: 4
  m_ObjectHideFlags: 0
  m_CorrespondingSourceObject: {fileID: 0}
  m_PrefabInstance: {fileID: 0}
  m_PrefabAsset: {fileID: 0}
  m_GameObject: {fileID: 961066317}
  m_Enabled: 1
  m_Avatar: {fileID: 0}
  m_Controller: {fileID: 9100000, guid: c1a2804eb5cc53110917f467fb41b467, type: 2}
  m_CullingMode: 0
  m_UpdateMode: 0
  m_ApplyRootMotion: 0
  m_LinearVelocityBlending: 0
  m_StabilizeFeet: 0
  m_WarningMessage: 
  m_HasTransformHierarchy: 1
  m_AllowConstantClipSamplingOptimization: 1
  m_KeepAnimatorControllerStateOnDisable: 0
--- !u!114 &961066320
MonoBehaviour:
  m_ObjectHideFlags: 0
  m_CorrespondingSourceObject: {fileID: 0}
  m_PrefabInstance: {fileID: 0}
  m_PrefabAsset: {fileID: 0}
  m_GameObject: {fileID: 961066317}
  m_Enabled: 1
  m_EditorHideFlags: 0
  m_Script: {fileID: 11500000, guid: 9c5996b75be4cbd268157bc6d9219246, type: 3}
  m_Name: 
  m_EditorClassIdentifier: 
  shoot: 0
  isRunning: 0
  die: 0
