<?xml version="1.0" standalone="no"?>
<!DOCTYPE svg PUBLIC "-//W3C//DTD SVG 1.1//EN" "http://www.w3.org/Graphics/SVG/1.1/DTD/svg11.dtd" >
<!--
2016-5-23: Created.
-->
<svg xmlns="http://www.w3.org/2000/svg">
<metadata>
Created by FontForge 20120731 at Mon May 23 23:04:00 2016
 By Apache
Created by Apache with FontForge 2.0 (http://fontforge.sf.net)
</metadata>
<defs>
<font id="Flaticon" horiz-adv-x="512" >
  <font-face 
    font-family="Flaticon"
    font-weight="500"
    font-stretch="normal"
    units-per-em="512"
    panose-1="2 0 6 3 0 0 0 0 0 0"
    ascent="448"
    descent="-64"
    bbox="-0.00186968 -64.001 512 448"
    underline-thickness="25.6"
    underline-position="-51.2"
    unicode-range="U+0020-F115"
  />
    <missing-glyph />
    <glyph glyph-name="space" unicode=" " horiz-adv-x="200" 
 />
    <glyph glyph-name="uniF10F" unicode="&#xf10f;" 
d="M349.091 215.272c-39.5635 0 -69.8184 30.2549 -69.8184 69.8184s30.2549 69.8184 69.8184 69.8184s69.8184 -30.2549 69.8184 -69.8184s-30.2549 -69.8184 -69.8184 -69.8184zM162.909 215.272c-39.5635 0 -69.8184 30.2549 -69.8184 69.8184
s30.2549 69.8184 69.8184 69.8184s69.8184 -30.2549 69.8184 -69.8184s-30.2549 -69.8184 -69.8184 -69.8184zM162.909 168.728c53.5273 0 162.909 -27.9277 162.909 -81.4551v-58.1816h-325.818v58.1816c0 53.5273 109.382 81.4551 162.909 81.4551zM349.091 168.728
c53.5273 0 162.909 -27.9277 162.909 -81.4551v-58.1816h-139.637v58.1816c0 32.582 -18.6182 60.5098 -46.5449 79.1279c9.30859 2.32715 16.291 2.32715 23.2725 2.32715z" />
    <glyph glyph-name="uniF113" unicode="&#xf113;" 
d="M256 192c-70.4004 0 -128 57.5996 -128 128s57.5996 128 128 128s128 -57.5996 128 -128s-57.5996 -128 -128 -128zM256 128c86.4004 0 256 -41.5996 256 -128v-64h-512v64c0 86.4004 169.6 128 256 128z" />
    <glyph glyph-name="uniF102" unicode="&#xf102;" 
d="M159.476 110.352v75.668l134.296 87.6113v-75.667zM67.1475 141.787v75.6582l83.9346 -31.4258v-75.668zM155.278 198.962l-82.8848 32.9023l126.38 83.751l82.4072 -35.2959zM436.459 365.959v-75.667l-134.295 -87.6113v75.667zM423.869 372.648l-125.901 -81.3584
l-82.8857 32.9033l126.38 83.749zM92.3281 -23.9434v75.668l134.296 87.6104v-75.666zM83.9346 51.7246v-75.668l-83.9346 31.4346v75.6572zM141.875 97.8135l-53.7441 -33.1475l-82.8848 29.9492l59.2324 36.3438zM444.853 301.194v56.4463l57.9404 -24.8105
l-53.7432 -33.1465zM235.017 68.3848v75.668l134.295 87.6113v-75.668zM377.705 236.381l134.295 87.6104v-75.667l-134.295 -87.6113v75.668z" />
    <glyph glyph-name="uniF10C" unicode="&#xf10c;" 
d="M254.026 74.5508c-10.4443 -2.4873 -25.0498 -0.824219 -30.0166 0.167969c-4.97461 0.991211 -224.01 24.54 -224.01 24.54v17.251l104.83 16.3047h18.3691l49.7666 139.731s18.9951 36.999 53.8145 50.4268c0 0 -13.8291 -14.2861 -17.4004 -20.8818
c-2.01172 -3.70996 -0.365234 -7.02051 2.47168 -7.96484c5.50195 -1.83105 11.8809 2.06348 15.1152 6.04785c3.23633 3.97266 24.7939 35.7607 62.1055 35.2578c0 0 -37.0967 -15.4824 -48.3184 -33.4043c-3.63867 -5.82227 -1.08008 -8.60352 2.9834 -9.55957
c7.02637 -2.01172 10.6426 2.06641 11.0107 2.12598c7.00391 5.1709 34.6113 37.9004 82.8594 34.4189c0 0 -50.3604 -7.99414 -78.2158 -56.2412l-45.8457 -144.012c16.1963 -0.889648 30.8721 -1.82031 40.0078 -2.69043
c3.72168 -0.351562 8.43359 -0.896484 13.8057 -1.59082l3.02344 21.5234l14.8271 15.75l39.7607 -7.69434l6.73438 -22.9678l-3.93945 -16.0459c32.9883 -5.89453 65.6289 -12.9561 76.6465 -18.459l-1.98828 -4.79102s-137.952 -14.7559 -148.397 -17.2432z
M503.461 63.8779c-9.17285 27.124 -82.5098 27.1123 -82.5098 27.1123s3.83398 17.2607 3.68457 20.9463c0 0 -55.083 15.4307 -78.9551 18.4131l1.63574 10.1299l-10.9805 28.6143l-59.082 8.79297l-20.2852 -19.6357l-5.07227 -23.5762l-20.5674 1.56348
s18.7402 102.009 50.0771 137.319c31.3428 35.3115 50.7383 46.7422 86.5518 39.7793c35.8145 -6.96387 61.6758 -28.8604 83.5615 -58.7031s38.7949 -75.3574 38.7949 -98.2354c0 -22.8809 -4.75684 -55.2734 -4.75684 -55.2734s23.4727 -10.0322 25.835 -12.2764
c2.36719 -2.23145 -2.58496 -15.1484 -7.93164 -24.9707zM451.414 73.9883c45.9355 -4.94824 41.7559 -17.04 41.7637 -17.0273c1.84961 -6.37598 -8.55371 -7.45898 -23.9502 -8.31055c-15.3975 -0.855469 -119.762 4.35938 -160.621 22.5176
c0 0 85.0205 9.0459 142.808 2.82031zM103.025 149.6l9.7959 -1.91699l40.2891 117.026h-1.49316c-20.6123 -17.2764 -36.4932 -53.2852 -46.1279 -81.123l-0.543945 -0.111328l-14.377 -3.12207l-2.6377 -28.5176v-3.90527l15.0977 2.02246z" />
    <glyph glyph-name="uniF108" unicode="&#xf108;" 
d="M324.076 201.884c0 -2.68359 -2.17871 -4.8623 -4.86328 -4.8623h-67.8662v-48.6113c0 -2.68359 -2.17676 -4.86133 -4.86133 -4.86133c-2.68164 0 -4.86035 2.17676 -4.86035 4.86133v48.6113h-19.6357v97.2236h-48.6113v-97.2236h-126.391h-9.72168v136.113h-37.2656
l145.428 99.6562l145.407 -99.6553h-39.6768v-126.392h68.0576c2.68164 0 4.86035 -2.17773 4.86035 -4.86035zM144.213 245.634v48.6113h-58.335v-4.86035v-43.751h53.4736h4.86133zM150.435 431.866c-0.767578 0.806641 -1.22461 1.87695 -1.30176 3.05273
c-0.00976562 0.106445 -0.0585938 0.194336 -0.0585938 0.300781c0 2.68359 2.17676 4.86133 4.86035 4.86133h165.28c2.68164 0 4.86035 -2.17773 4.86035 -4.86133c0 -2.68262 -2.17773 -4.86035 -4.86035 -4.86035h-165.28
c-0.631836 0 -1.68066 0.18457 -2.22559 0.408203zM329.189 391.47h-9.97363v-145.836h9.97363l-14.835 -25.6963l-14.8369 25.6963h9.97559v145.836h-9.97559l14.8369 25.707zM212.269 158.132v9.97656l25.707 -14.8359l-25.707 -14.8369v9.97461h-126.391v-9.97461
l-25.7051 14.8369l25.7051 14.8359v-9.97656h126.391zM299.139 7.36914l123.484 241.93l57.6055 -29.4004l-123.484 -241.931l-51.8594 -34.0488zM494.86 299.729c13.5234 -6.90332 21.4463 -18.4521 14.6699 -31.7236l-13.707 -26.8535l-57.6055 29.4004l13.708 26.8535
c6.77734 13.2705 26.5322 10.6943 40.0557 3.79199z" />
    <glyph glyph-name="uniF101" unicode="&#xf101;" 
d="M196.432 120.806h18.2734v-59.3398l48.7061 59.3398h35.458l-87.2803 -106.328c-2.64941 -3.24414 -6.56836 -5.0166 -10.5889 -5.0166c-1.54395 0 -3.10645 0.256836 -4.61328 0.804688c-5.45508 1.94531 -9.0918 7.1084 -9.0918 12.9004v99.165
c2.97852 -0.894531 6.02051 -1.52539 9.13672 -1.52539zM130.001 212.169h-116.296c-7.56543 0 -13.7051 6.13965 -13.7051 13.7041c0 7.56543 6.13965 13.7041 13.7051 13.7041h118.771c1.64453 0 3.26172 -0.291992 4.80566 -0.867188l9.4375 -3.52637l4.27637 -30.8633z
M512 73.9814c0 -36.7832 -29.8223 -66.6035 -66.6055 -66.6035s-66.6035 29.8203 -66.6035 66.6035c0 9.74902 2.14746 18.9863 5.91211 27.3271l-44.0547 32.1504c4.27441 3.02441 8.10254 6.21289 11.0537 9.2002l9.4375 9.76758l39.7432 -29
c11.8057 10.6357 27.3818 17.1592 44.5127 17.1592c36.7832 0 66.6045 -29.8213 66.6045 -66.6045zM445.396 51.3516c12.498 0 22.6309 10.1309 22.6309 22.6299s-10.1338 22.6318 -22.6318 22.6318c-2.22852 0 -4.33887 -0.420898 -6.36719 -1.02344
c-9.37402 -2.75879 -16.2627 -11.3379 -16.2627 -21.6074c0 -0.164062 0.0458984 -0.320312 0.0458984 -0.484375c0.265625 -12.2705 10.252 -22.1465 22.585 -22.1465zM346.888 162.832l-8.18652 -8.46973c-3.29883 -3.34375 -8.14941 -6.87891 -13.375 -9.72168
c-3.43555 -1.87305 -7.02539 -3.41797 -10.498 -4.39453c-2.52148 -0.711914 -4.98828 -1.16992 -7.23633 -1.16992h-29.1807h-63.708h-18.2725c-3.0791 0 -6.05664 1.16992 -8.79785 2.96094c-6.21289 4.05566 -11.0732 11.6484 -12.0605 18.5557l-5.2168 36.4902
l-4.41309 30.917l-3.47168 24.3213c-1.42578 9.9502 5.63672 14.6641 15.6865 14.6641h255.817c10.0498 0 12.4902 -1.27832 5.42676 -8.42285zM347.181 349.213l22.8398 -36.5449h30.8359l14.8467 -27.4082h-228.409l18.2734 45.6807h21.6982l23.9834 45.6816h30.835
l14.8467 -27.4092h50.25z" />
    <glyph glyph-name="uniF105" unicode="&#xf105;" 
d="M345.072 -19.2168l6.02539 -31.6758h-349.062c-2.59375 25.1582 -8.12891 107.29 24.8779 145.413c11.2832 13.1045 25.7891 19.4121 44.29 19.4121h40.1553l20.5312 19.6221v0c16.2598 -12.334 35.7402 -19.6221 56.5547 -19.6221h0.0703125h0.0703125
c22.0049 0 42.6074 8.12891 59.4268 21.8662l20.1826 -19.6943l-40.5059 -7.00781l-0.209961 -54.0303l55.5039 -9.88086c0.982422 -2.17285 0.770508 -2.52344 1.8916 -4.55566l-30.1338 -48.0039l35.0391 -35.0391l43.0986 28.3115
c2.10254 -1.61133 9.74121 -3.57227 12.1934 -5.11523zM104.983 215.547c-12.8242 2.03223 -22.7051 14.5762 -22.7051 29.9932c0 10.1611 4.34473 19.0615 11.002 24.5977h194.957c6.65723 -5.53613 11.0029 -14.4365 11.0029 -24.5977
c0 -16.749 -11.8447 -30.3438 -26.4199 -30.3438c-0.280273 0 -0.492188 0.0693359 -0.770508 0.0693359c-2.66309 -22.7754 -12.2646 -42.958 -26.21 -57.8848c-2.94336 -3.15332 -6.09668 -6.02637 -9.39062 -8.68945
c-4.2041 -3.3623 -8.61914 -6.23535 -13.3145 -8.68848c-10.582 -5.46582 -22.2168 -8.61914 -34.6191 -8.61914s-24.0371 3.15332 -34.6191 8.61914c-4.69531 2.45312 -9.10938 5.32617 -13.3145 8.68848c-3.29199 2.59277 -6.37598 5.46582 -9.31934 8.62012
c-14.0156 14.9277 -23.6182 35.3193 -26.2793 58.2354zM512 70.834l-48.5645 -8.61914c-2.10254 -8.9707 -5.6748 -17.4502 -10.3721 -25.1582l28.1738 -40.5059l-16.54 -16.5381l-40.3652 28.2412c-7.70898 -4.69531 -16.1182 -8.26953 -25.1582 -10.4414
l-8.75977 -48.5645h-23.335l-8.62012 48.4951c-8.96875 2.10254 -17.4492 5.67578 -25.1582 10.3701l-40.5039 -28.1709l-16.5381 16.5381l28.3096 40.3652c-4.69336 7.70898 -8.26758 16.1182 -10.4404 25.1582l-48.5645 8.75977v23.3369l48.4951 8.61816
c2.10254 8.96973 5.67578 17.4492 10.3711 25.1582l-28.1709 40.5049l16.5381 16.5391l40.3652 -28.2422c7.70898 4.69531 16.1182 8.26953 25.1582 10.4424l8.75977 48.5645h23.335l8.61914 -48.4951c8.9707 -2.10156 17.4502 -5.6748 25.1592 -10.3701l40.5039 28.1719
l16.54 -16.5391l-28.2422 -40.3652c4.69434 -7.70801 8.26953 -16.1172 10.4414 -25.1582l48.5635 -8.75977v-23.3359zM378.711 46.4482c19.9014 0 36.0195 16.1182 36.0195 36.0186c0 19.9023 -16.1182 36.0205 -36.0195 36.0205
c-19.9023 0 -36.0205 -16.1182 -36.0205 -36.0205c0 -19.9004 16.1182 -36.0186 36.0205 -36.0186zM151.516 400.134h-0.000976562v-67.5557v-7.84961c0 -1.12109 0 -1.96191 0.280273 -3.08301c0.560547 -3.08301 1.40137 -5.88672 3.08301 -8.40918
c3.64258 -6.16699 10.6504 -10.3721 18.501 -10.3721h30.834h4.48535c8.40918 0 15.6963 5.0459 19.3418 12.0537c1.40137 2.80273 1.96191 5.60645 2.24219 8.68945v1.12109v9.25098v65.874c29.1533 -14.8574 52.1387 -44.29 60.8281 -73.1621l1.96289 -6.16699h15.6963
v-33.3574v-1.68262h-38.4023h-10.0908h-135.111h-10.3711h-24.6689h-17.3779v35.04h15.9795l1.96191 6.16699c8.69043 28.8721 31.6748 58.585 60.8271 73.4424zM173.38 312.115c-4.48438 0 -8.40918 2.24219 -10.9316 5.60547
c-1.40234 2.24316 -2.24414 4.76562 -2.24414 7.56836v1.12207v10.6514v67.2754v9.53125v7.84863c0 0.560547 0.280273 1.12109 0.280273 1.68164c0.560547 6.44727 6.16699 11.4932 12.8945 11.4932h30.834c7.29004 0 13.7354 -4.76562 16.2588 -11.2129
c0.561523 -1.96191 1.12109 -3.92383 1.12109 -6.16699v-3.64355v-9.53125v-66.1543v-10.3711v-2.52344c0 -2.24219 -0.55957 -4.2041 -1.68066 -6.16602c-2.24219 -4.20508 -6.44727 -7.00781 -11.4922 -7.00781h-35.04z" />
    <glyph glyph-name="uniF110" unicode="&#xf110;" 
d="M276.333 448l61.334 -174.667h-159.667l61.667 174.667h36.666zM358.333 215.333l28.667 -81.666h-258l28.667 81.666h200.666zM488.667 -17.666v-46.334h-465.334v46.334h52.334l32.666 93.333l299 0.333008l33 -93.666h48.334z" />
    <glyph glyph-name="uniF103" unicode="&#xf103;" 
d="M126.036 -63.999v40.1992h112.559v-40.1992h-112.559zM254.675 -63.999v40.1992h112.559v-40.1992h-112.559zM383.312 -63.999v40.1992h112.559v-40.1992h-112.559zM61.7168 -7.7207v40.1992h112.559v-40.1992h-112.559zM190.355 -7.7207v40.1992h112.559v-40.1992
h-112.559zM318.994 -7.7207v40.1992h112.559v-40.1992h-112.559zM447.632 -7.7207v40.1992h48.2393v-40.1992h-48.2393zM61.7168 82.4551c14.0391 -10.6689 30.3916 -18.4443 48.2393 -22.2051v-11.6904h-48.2393v33.8955zM61.7168 -63.999v40.1992h48.2393v-40.1992
h-48.2393zM135.081 57.6035c31.123 0 59.4629 11.8506 80.9932 31.1543h22.5205v-40.1992h-112.559v9.50293c2.99902 -0.224609 5.98926 -0.458008 9.04492 -0.458008zM254.675 48.5596v40.1992h112.559v-40.1992h-112.559zM383.312 48.5596v40.1992h112.559v-40.1992
h-112.559zM302.914 104.838h-71.8369c9.21387 11.8672 16.2979 25.4307 20.6309 40.1992h51.2061v-40.1992zM318.994 104.838v40.1992h112.559v-40.1992h-112.559zM447.632 104.838v40.1992h48.2393v-40.1992h-48.2393zM254.675 200.641v0.676758h112.559v-40.2012h-112.044
c0.883789 5.91699 1.49512 11.9316 1.49512 18.0898c0 7.32422 -0.763672 14.4639 -2.00977 21.4346zM383.312 161.118v40.1992h112.559v-40.1992h-112.559zM70.7617 310.691l-53.9795 126.105c-1.75293 4.08398 0.145508 8.81152 4.22852 10.5566
c4.08496 1.7373 8.80371 -0.144531 10.5566 -4.22949l53.7363 -125.56c8.5957 -0.128906 18.5967 -6.08691 30.8252 -18.3877c2.1709 -2.17871 4.38965 -4.51855 6.70605 -7.09863c2.10645 -2.34766 4.22949 -4.72852 6.46387 -7.4209l-0.280273 -0.233398
c2.0166 0.113281 4.01172 0.305664 6.06152 0.305664c50.6914 0 92.9893 -35.7529 103.16 -83.4141c0.12793 -0.570312 0.241211 -1.1416 0.353516 -1.7207c1.29395 -6.59961 2.01074 -13.4102 2.01074 -20.3887c0 -11.9795 -2.09082 -23.4365 -5.76465 -34.1699
c-5.23438 -15.2676 -13.7812 -28.9912 -24.916 -40.1982c-6.16699 -6.20703 -13.1523 -11.5537 -20.6943 -16.0801c-15.8457 -9.51172 -34.3223 -15.0752 -54.1484 -15.0752c-3.05566 0 -6.05469 0.201172 -9.04492 0.458008
c-5.49902 0.466797 -10.8535 1.39941 -16.0801 2.67773c-10.3711 2.54004 -20.1162 6.59277 -29.0244 11.9395c-30.7354 18.4434 -51.374 51.9941 -51.374 90.4482c0 31.7188 14.0605 60.0986 36.2109 79.4346l-1.28613 -0.18457
c-0.306641 2.13086 -0.692383 5.18555 -0.99707 8.79492c-0.241211 2.91895 -0.417969 6.21582 -0.474609 9.67285c-0.183594 11.835 1.28711 25.6074 7.75098 33.7676zM97.3496 294.74c-1.22949 1.02051 -2.36328 1.88965 -3.39941 2.62207l0.0810547 -0.185547
c0.474609 -1.12598 0.626953 -2.29102 0.586914 -3.44141c-0.105469 -3.01465 -1.85742 -5.85352 -4.81641 -7.11523c-1.0293 -0.441406 -2.10645 -0.650391 -3.16016 -0.650391c-1.99316 0 -3.86719 0.811523 -5.33887 2.1377
c-0.554688 0.506836 -1.02148 1.07812 -1.43066 1.7373c-0.113281 -0.869141 -0.249023 -1.65723 -0.330078 -2.58984c-0.256836 -2.83789 -0.345703 -6.0127 -0.337891 -9.30176c0.0078125 -2.95801 0.105469 -6.01367 0.337891 -9.1416
c9.45508 5.87012 19.874 10.2842 31.0098 12.9365c-2.25977 2.5 -4.36621 4.74316 -6.28711 6.65723c-2.59766 2.59668 -4.88086 4.6543 -6.91504 6.33496z" />
    <glyph glyph-name="uniF106" unicode="&#xf106;" 
d="M473.829 322.452c3.89844 -2.21191 6.21582 -6.42676 6.21582 -10.957l-1.79102 -244.324c0 -4.53125 -2.42285 -8.74512 -6.42676 -10.958l-211.453 -118.633c-2.00195 -1.05371 -4.10938 -1.58008 -6.21582 -1.58008c-2.31836 0 -4.53125 0.631836 -6.53223 1.79102
l-209.557 125.692c-3.79297 2.31738 -6.2168 6.42676 -6.11133 10.957l2.9502 242.428c0 4.53027 2.52832 8.63965 6.42676 10.8525l211.348 118.633c3.89844 2.21191 8.74512 2.21191 12.6436 -0.105469zM243.306 -30.1797v215.878l-183.428 108.308l-2.63379 -212.612z
M256.159 207.507l186.273 104.199l-183.744 109.045l-186.483 -104.726zM452.968 74.7559l1.58105 214.825l-185.957 -103.988v-214.298zM171.347 132.914c-4.4248 0 -8.63965 2.31738 -10.957 6.42676c-3.37207 6.11035 -1.26465 13.8018 4.8457 17.1729
c6.11133 3.37207 13.8027 1.26465 17.1738 -4.84668c3.37109 -6.00488 1.26465 -13.6963 -4.84668 -17.1729c-2.00195 -1.05371 -4.1084 -1.58008 -6.21582 -1.58008zM129.098 109.103c-4.4248 0 -8.74414 2.31836 -10.957 6.42676
c-3.37109 6.00586 -1.26367 13.8027 4.84668 17.1738c6.00586 3.37109 13.8018 1.26465 17.1738 -4.84668c3.37109 -6.00488 1.26367 -13.8018 -4.84668 -17.1729c-2.00195 -1.05371 -4.10938 -1.58105 -6.2168 -1.58105zM213.7 156.619
c-4.4248 0 -8.74414 2.31836 -10.957 6.42676c-3.37109 6.00586 -1.26465 13.8018 4.84668 17.1738c6.00488 3.37109 13.8018 1.26367 17.1729 -4.84668c3.37207 -6.00586 1.26465 -13.8018 -4.84668 -17.1738c-2.00098 -1.05273 -4.1084 -1.58008 -6.21582 -1.58008z
M86.8496 85.3975c-4.4248 0 -8.74512 2.31738 -10.957 6.42676c-3.37207 6.00586 -1.26465 13.8018 4.84668 17.1729c6.00488 3.37207 13.6963 1.26465 17.1729 -4.8457c3.37109 -6.00586 1.26465 -13.6973 -4.84668 -17.1738
c-2.00195 -1.05371 -4.1084 -1.58008 -6.21582 -1.58008zM374.582 107.839c-6.00586 3.58203 -8.00781 11.2734 -4.53027 17.2783c3.58203 6.00586 11.3779 8.00684 17.3838 4.4248c6.00488 -3.47656 8.00684 -11.2734 4.4248 -17.2783
c-2.31738 -4.00391 -6.53223 -6.21582 -10.8516 -6.21582c-2.21289 0 -4.4248 0.631836 -6.42676 1.79102zM332.86 132.598c-6.00586 3.58203 -7.90234 11.2734 -4.4248 17.2783c3.47656 6.00586 11.2725 8.00781 17.2783 4.42578
c6.00488 -3.47754 8.00684 -11.2734 4.4248 -17.2793c-2.31738 -4.00293 -6.53223 -6.21582 -10.8516 -6.21582c-2.21289 0 -4.4248 0.631836 -6.42676 1.79102zM291.244 157.356c-6.00586 3.58203 -8.00781 11.2734 -4.42578 17.2793
c3.47754 6.00488 11.2734 8.00684 17.2793 4.4248c6.00488 -3.47656 8.00684 -11.2734 4.4248 -17.2783c-2.31738 -4.00391 -6.53223 -6.2168 -10.8516 -6.2168c-2.21289 0 -4.42578 0.632812 -6.42676 1.79102zM416.304 83.0791
c-6.00586 3.58301 -8.00781 11.3789 -4.4248 17.3848c3.47656 6.00488 11.2725 8.00684 17.2783 4.4248c6.00488 -3.58203 8.00684 -11.3789 4.4248 -17.3838c-2.31738 -4.00391 -6.53223 -6.2168 -10.8516 -6.2168c-2.21289 0 -4.4248 0.632812 -6.42676 1.79102z
M257.318 302.54c6.9541 0 12.5381 -5.79492 12.5381 -12.748c-0.105469 -6.9541 -5.68945 -12.5381 -12.6436 -12.5381h-0.209961c-6.9541 0 -12.5381 5.79492 -12.4326 12.748c0 7.05957 5.79492 12.6436 12.748 12.5381zM257.846 351.109
c7.05859 -0.104492 12.6426 -5.89941 12.5371 -12.748c-0.105469 -6.95312 -5.68945 -12.5371 -12.6426 -12.5371h-0.105469c-7.05957 0.105469 -12.6436 5.89941 -12.5381 12.8535c0 6.95312 5.79492 12.5371 12.749 12.4316zM258.161 374.288
c-6.95312 0.105469 -12.5371 5.79492 -12.4316 12.8545c0 6.95312 5.79395 12.5371 12.748 12.4316c7.05859 0 12.6426 -5.79492 12.5371 -12.748c-0.104492 -6.9541 -5.68848 -12.5381 -12.6426 -12.5381h-0.210938zM256.687 254.075
c6.95312 -0.105469 12.5371 -5.79492 12.5371 -12.748c-0.105469 -6.9541 -5.68848 -12.5381 -12.6426 -12.5381h-0.105469c-7.05859 0.105469 -12.6426 5.90039 -12.5371 12.8535c0 6.9541 5.79395 12.5381 12.748 12.4326z" />
    <glyph glyph-name="uniF107" unicode="&#xf107;" 
d="M512 -17.7285c0 -28.0117 -13.0039 -42.8076 -35.252 -42.8076h-221.589c-30.5283 0 -45.3242 11.0186 -45.3242 33.0479v42.4941c0 21.0918 15.4199 35.2529 45.3242 35.2529h221.588c22.249 0 35.2529 -13.0029 35.2529 -35.2529v-32.7344zM471.711 -20.2471v30.2178
h-221.588v-30.2178h221.588zM340.771 281.92h151.082v-191.373h-10.0713h-50.3613v-20.1445h-10.0713h-141.011v20.1445h-40.2891v7.08105v3.03223v1.60156l-120.866 232.618l-10.0723 18.9961l-10.0713 18.9961v-233.524c47.9141 -5.15625 81.001 -41.2959 81.001 -89.5215
c0 -50.6641 -38.8486 -90.3389 -88.4443 -90.3389c-50.502 0 -91.5967 40.5322 -91.5967 90.3389c0 43.0781 28.7061 79.3984 68.8232 88.1318v0.644531l4.48145 0.3125l5.58984 0.926758v269.673l-3.99805 7.02051l46.4229 28.001l210.691 -293.555h21.5947
l-12.834 34.5273v0.0107422v0v86.3281v10.0723zM117.875 364.451l9.71973 50.834l-27.1045 -17.8174zM141.443 394.719l-11.8643 -53.6045l31.1836 20.084zM162.414 288.638l11.502 52.3252l-29.3809 -19.1064zM186.336 323.891l-10.9082 -52.4561l32.5732 20.8604z
M182.991 247.361l15.6719 -30.5781l20.7295 55.5176zM233.806 256.84l-21.1416 -54.21l41.0947 26.7422l-0.121094 0.171875zM236.868 151.586l26.0156 62.1045l-43.582 -31.123zM250.546 129.577l54.0283 31.1631l-24.2344 33.0469zM451.566 181.197v60.4336h-70.5059
v-60.4336h70.5059z" />
    <glyph glyph-name="uniF112" unicode="&#xf112;" 
d="M176.562 56.8633c0 -35.3545 -28.6455 -64 -64 -64c-35.3486 0 -64 28.6455 -64 64c0 35.3486 28.6514 64 64 64c35.3545 0 64 -28.6514 64 -64zM91.4287 56.8633c0 -11.7031 9.46094 -21.1592 21.1328 -21.1484c11.6875 0 21.1543 9.4668 21.1543 21.1484
c0 11.666 -9.48242 21.1328 -21.1543 21.1328s-21.1328 -9.4668 -21.1328 -21.1328zM329.143 272.279h134.854l38.8604 -59.4287v-96.0049h-64c-7.7793 0 -14.7754 -3.29102 -19.7754 -8.5c-9.56055 14.916 -29.502 34.2256 -68.8057 34.2256
c-17.6328 0 -21.1338 -0.867188 -21.1338 -0.867188v130.575zM475.429 171.703v43.9951l-18.2861 29.1475h-54.8564v-73.1426h73.1426zM26.8535 180.846l0.575195 54.8623h-27.4287v36.5713h267.432l25.1396 54.8574h205.715l-26.5723 -36.5713h-160.856v-152.012
c-35.4277 -12.5654 -44.0117 -58.2793 -44.0117 -58.2793h-69.1299c-20.0049 72.5889 -170.862 100.571 -170.862 100.571zM438.857 98.5596h64c5.04102 0 9.14258 -4.10059 9.14258 -9.14258v-18.2852c0 -5.04688 -4.10156 -9.14355 -9.14258 -9.14355h-64
c-5.05273 0 -9.14355 4.09668 -9.14355 9.14355v18.2852c0 0.78418 0.266602 1.47363 0.450195 2.20508c0.99707 3.94922 4.44043 6.9375 8.69336 6.9375zM414.276 56.8633c0 -35.3545 -28.6309 -64 -63.9844 -64c-35.3545 0 -64 28.6455 -64 64c0 35.3486 28.6455 64 64 64
c28.7549 0 53.0596 -18.96 61.1416 -45.0508c1.60938 -5.20312 2.49707 -10.71 2.72168 -16.3945c0.0263672 -0.856445 0.121094 -1.6875 0.121094 -2.55469zM329.143 56.8633c0 -11.7031 9.46191 -21.1592 21.1338 -21.1484c11.6924 0 21.1533 9.4668 21.1533 21.1484
c0 11.666 -9.47168 21.1328 -21.1533 21.1328c-11.6719 0 -21.1338 -9.4668 -21.1338 -21.1328zM271.245 331.51l-19.8164 -40.9443h-219.429l30.4688 27.4287h19.8174l25.8975 27.4277h28.959l37.7158 45.7148h35.4277l24.001 -36.5713h27.4287z" />
    <glyph glyph-name="uniF10D" unicode="&#xf10d;" 
d="M406.235 309.747l-63.9414 -129.652l-21.6074 10.665l63.9404 129.651zM486.262 413.578l-6.0166 -10.8809c-6.9082 -12.8086 -20.8018 -38.4854 -40.874 -43.877l-18.8447 -38.2031l-36.0186 17.7656l18.499 37.5205c-9.02441 20.1162 3.89941 50.1387 9.64746 63.3125
l3.80371 8.78418zM455.702 392.834l-36.5615 18.0244c-4.50977 -15.2178 -5.53711 -29.7207 5.1377 -34.9932c11.6816 -5.75684 21.9873 3.08496 31.4238 16.9688zM260.637 55.0967c-15.4287 15.1602 -31.5049 21.5889 -46.5781 22.8223
c-0.503906 2.50391 -0.460938 4.69629 0.387695 6.40918l0.499023 1.01172l12.3398 25.0244l27.0811 54.873c0.700195 1.41504 2.70605 2.00488 5.55566 2.00488c8.4248 0 24.2754 -5.15234 35.5107 -9.5127l10.9189 22.1641l36.0244 -17.7598l-10.9238 -22.165
c20.9893 -11.9121 33.7021 -22.4277 30.958 -28.0029l-19.6982 -39.958l-5.89648 -11.9453l-13.1641 -26.6836c-2.87793 3.42578 -6.07324 6.5293 -9.65234 9.22559c-19.3486 14.5459 -43.3262 13.7012 -53.3623 12.4922zM397 4.33008
c15.6113 -3.47266 27.3066 -17.2275 27.3506 -33.6729c0 -19.1475 -15.7021 -34.6426 -35.0508 -34.6426c-1.89453 0 -3.70312 0.249023 -5.49316 0.532227c-0.0761719 -0.00976562 -0.128906 -0.0195312 -0.21582 -0.0195312
c-1.37695 0 -2.67676 0.207031 -3.97168 0.508789h-320.831h-4.71582v0.360352c-16 1.81738 -28.334 12.5215 -28.334 25.5986c0 9.77246 6.94727 18.1777 17.084 22.6152c-2.85938 5.55078 -4.49023 11.5098 -4.49023 17.7314c0 19.4541 15.1885 36.4414 37.8613 45.874
c-1.36719 5.40625 -2.17285 11.0479 -2.17285 16.8916c0 38.8262 32.1807 70.3066 71.875 70.3066c23.3545 0 44.0459 -10.9385 57.1719 -27.8203c4.80664 1.43457 4.03906 1.81348 9.31641 1.91406l-7.36426 -14.9102l-3.91504 -7.9541
c-1.42871 -2.86914 -1.69824 -6.26562 -1.1748 -9.96484c-18.6865 -2.29785 -34.623 -11.6143 -43.9209 -20.0488c-3.43945 -3.1377 -3.7041 -8.42871 -0.589844 -11.8779c3.12305 -3.44043 8.42383 -3.6748 11.8643 -0.576172
c1.75586 1.60742 43.5898 38.5908 84.2676 -4.76367l3.22363 -3.43555l4.61035 0.959961c0.27832 0.0332031 25.9443 5.20996 44.5635 -8.7793c11.4082 -8.59277 18 -22.9844 19.4971 -42.7744c0.326172 -4.4043 4.02051 -7.74805 8.35742 -7.74805
c0.21582 0 0.431641 0.00976562 0.657227 0.0341797c4.61035 0.349609 8.07324 4.38477 7.71875 9.00488c-0.963867 12.4775 -3.66504 23.3535 -8.0791 32.5693c1.16113 1.19043 2.15918 2.46191 2.85938 3.88672l21.0898 42.7549
c10.0459 -2.86426 17.8896 -14.2393 17.8896 -29.1064c0 -6.7793 -2.04395 -13.0684 -5.46387 -18.4082c2.31641 0.945312 4.70605 1.61719 7.23438 1.61719c9.14355 0 21.5166 -3.85742 21.291 -16.6572z" />
    <glyph glyph-name="uniF104" unicode="&#xf104;" 
d="M421.363 90.6826c35.3809 -39.4746 31.8721 -127.78 29.8232 -154.684h-389.481c-2.63184 26.6084 -8.47949 112.869 26.3164 153.22c11.9883 13.7441 27.1934 20.4688 46.7842 20.4688h38.4736l21.6387 20.7607c16.959 -13.1582 37.7197 -20.7607 59.6504 -20.7607
c23.3926 0 45.0312 8.48047 62.8672 23.1006l24.2695 -23.3916h36.9678c17.5449 0 31.2871 -6.14062 42.6904 -18.7139zM153.219 273.728v0h205.559c7.01758 -5.84863 11.6963 -15.2051 11.6963 -26.0244c0 -17.5439 -12.2803 -31.8721 -27.7783 -31.8721h-0.876953
c-2.63184 -24.2695 -12.8662 -45.3232 -27.4863 -61.1123c-3.2168 -3.21582 -6.43164 -6.43262 -9.94141 -9.06445c-4.38672 -3.50879 -9.06445 -6.43262 -14.0352 -9.06445c-11.1104 -5.84668 -23.3926 -9.06348 -36.5508 -9.06348
c-13.1592 0 -25.4395 3.2168 -36.5508 9.06348c-4.9707 2.63184 -9.64844 5.55566 -14.0352 9.06445c-3.50879 2.63184 -6.72559 5.84863 -9.94043 9.06445c-14.9131 15.79 -24.8545 37.1357 -27.7783 61.4053c-13.4512 2.33887 -23.9775 15.4971 -23.9775 31.5791
c0 10.8193 4.67871 20.1758 11.6963 26.0244zM360.64 335.132l2.04883 -6.43262h16.4551v-34.7959v-1.75488h-39.8467h-10.5273h-140.939h-10.8184h-25.7324h-18.4209v36.5508h16.667l2.04688 6.43262c9.06445 30.1182 33.042 60.8203 63.4512 76.9023v-70.1768v-8.1875
c0 -1.16895 0 -2.04688 0.292969 -3.21582c0.584961 -3.21777 1.46191 -6.14062 3.21582 -8.77246c3.80078 -6.43262 11.1113 -10.8193 19.2988 -10.8193h32.165h4.67773c8.77148 0 16.374 5.26367 20.1758 12.5732c1.46191 2.9248 2.0459 5.84863 2.33887 9.06445v1.16992
v9.35742v68.7148c30.4102 -15.79 54.3867 -46.4922 63.4512 -76.6104zM237.724 319.927c-4.67871 0 -8.77148 2.33984 -11.4043 5.84863c-1.46191 2.33887 -2.33887 4.9707 -2.33887 7.89453v1.16992v11.1113v70.1768v9.94141v8.1875
c0 0.584961 0.291992 1.16992 0.291992 1.75488c0.584961 6.72461 6.43359 11.9883 13.4512 11.9883h32.165c7.60254 0 14.3281 -4.9707 16.958 -11.6963c0.584961 -2.04688 1.16992 -4.09375 1.16992 -6.43262v-3.80176v-9.94141v-69.0068v-10.8193v-2.63184
c0 -2.33887 -0.584961 -4.38574 -1.75391 -6.43262c-2.33984 -4.38574 -6.72559 -7.31055 -11.9893 -7.31055h-36.5498z" />
    <glyph glyph-name="uniF115" unicode="&#xf115;" 
d="M410.021 152.872l29.4941 -7.99512l72.4844 -181.272h-31.665l-37.6074 54.2676h-35.1484l-40.9355 -54.2676h-93.4229l79.5215 145.049l22.8184 -9.20703zM437.996 8.82715l31.3408 -45.2227h-91.3604l34.1162 45.2227h25.9033zM36.3057 50.4238l6.31348 106.156
l-42.6191 10.5283v71.3896l53.6553 46.9062l24.4385 -2.05273l19.0752 16.0361l0.84082 -0.0908203c-12.916 8.67383 -21.418 23.4082 -21.418 40.1309c0 3.46484 0.398438 6.83887 1.09473 10.0947l95.2939 -12.6357
c-1.17578 -22.1963 -17.1396 -40.4746 -38.3496 -44.8076l5.5625 -15.3037l31.6562 -1.30273l9.7959 -86.5029l12.6709 -45.0244l-30.5527 17.8633l-7.74219 20.1055l-4.82129 41.4258l-11.1885 -45.3232l6.15039 -21.5986l114.053 -64.6152l17.7363 30.7881
l42.6816 -24.5928l-45.1504 -78.3711l-42.6816 24.5918l18.3789 31.9092l-97.9531 55.499l6.4668 -22.6934l17.7998 -50.1621l-17.7998 -95.167h-36.2061l15.6289 84.0254l-25.5791 69.7344h-28.4268l-8.52051 -67.292l-29.8467 -86.4678h-37.3096zM27.1348 193.039
l18.0889 -4.06934v41.9131l-18.0889 -16.5254v-21.3184zM172.563 346.066l-92.1562 12.2197l-12.6172 1.67383c8.54688 38.4844 30.3721 60.4355 60.3633 60.4355c2.72266 0 5.47168 -0.180664 8.24902 -0.551758c33.8643 -4.48633 52.5684 -32.6514 50.6416 -75.6953z" />
    <glyph glyph-name="uniF114" unicode="&#xf114;" 
d="M0 8.34863v55.6514h155.826v-55.6514h-155.826zM178.087 8.34863v55.6514h155.826v-55.6514h-155.826zM89.0439 86.2607v55.6523h155.825v-55.6523h-155.825zM0 164.175v55.6514h155.826v-55.6514h-155.826zM178.087 164.175v55.6514h155.826v-55.6514h-155.826z
M89.0439 242.087v55.6523h155.825v-55.6523h-155.825zM267.131 86.2607v55.6523h155.825v-55.6523h-155.825zM267.131 242.087v55.6523h155.825v-55.6523h-155.825zM0 320.001v55.6514h155.826v-55.6514h-155.826zM178.087 320.001v55.6514h155.826v-55.6514h-155.826z
M356.174 8.34863v55.6514h155.826v-55.6514h-155.826zM356.174 164.175v55.6514h155.826v-55.6514h-155.826zM356.174 320.001v55.6514h155.826v-55.6514h-155.826z" />
    <glyph glyph-name="uniF111" unicode="&#xf111;" 
d="M31.9092 69.5469c0 0 -31.9092 -2.56152 -31.9092 28.9199v67.002s0.65332 26.5312 29.5625 26.5312s106.075 0.847656 106.075 0.847656l14.8779 60.3789h125.006l47.6133 -183.68h-291.226zM172.629 222.613l-9.35742 -61.2275h106.299l-17.0098 61.2275h-79.9316z
M295.929 243.021l-10.2041 30.6133h-81.6357c23.8076 30.6143 91.6768 89.626 152.863 92.6973c27.4199 1.36719 65.6865 8.5 81.4219 -9.35742c11.9492 -13.5615 5.63281 -36.124 -31.043 -40.8184c-85.8916 -10.2031 -111.402 -73.1348 -111.402 -73.1348zM462.6 338.262
c0 56.123 -61.2275 52.7246 -61.2275 52.7246s0 35.7158 39.9707 35.7158c34.8691 0 39.9707 -42.5225 39.9707 -42.5225l-22.5205 -202.385l-36.502 -31.6035l-10.7139 143.854s51.0225 -1.70312 51.0225 44.2168zM481.313 171.591c0 0 32.4199 -28.9502 30.6143 -69.7275
c-3.39941 -76.5332 -90.3506 -88.4414 -90.3506 -88.4414s-38.9092 31.8887 -58.124 53.1963zM336.747 -6.9873c0 -19.6953 -16.0205 -35.7158 -35.7158 -35.7158h-255.111c-19.6953 0 -35.7158 16.0205 -35.7158 35.7158v20.4092
c0 19.6943 16.0205 35.7158 35.7158 35.7158h255.111c19.6943 0 35.7158 -16.0215 35.7158 -35.7158v-20.4092zM306.134 -6.9873l-0.000976562 20.4092c0 2.81543 -2.28516 5.10156 -5.10156 5.10156h-255.111c-2.81641 0 -5.10254 -2.28418 -5.10254 -5.10156v-20.4092
c0 -2.81641 2.28613 -5.10156 5.10254 -5.10156h255.112c2.81543 0 5.10156 2.28418 5.10156 5.10156zM357.157 139.702l33.1641 -23.3887l-34.8691 -31.46l-11.6836 45.2871z" />
    <glyph glyph-name="uniF109" unicode="&#xf109;" 
d="M104.297 258.37v18.9629h303.407v-18.9629h-303.407zM104.297 286.814v28.4453h303.407v-28.4453h-303.407zM407.704 248.89v-18.8203l-103.357 -75.501l8.5332 -197.348c0 -13.1699 -4.79883 -21.2188 -15.4551 -21.2188h-76.8564
c-10.6572 0 -21.457 8.04883 -21.457 21.2188l8.6377 199.652l-103.452 73.1963v18.8203h303.407zM256 -39.1104c9.82227 0 17.7783 7.95508 17.7783 17.7773c0 9.82324 -7.95508 17.7783 -17.7783 17.7783c-9.82227 0 -17.7773 -7.95508 -17.7773 -17.7783
c0 -9.82227 7.95605 -17.7773 17.7773 -17.7773zM407.704 448v-113.777h-303.407v113.777h38.4648l13.2373 -60.6064l11.207 60.6064h86.5654l11.1973 -65.5732l13.2373 65.5732h129.498z" />
    <glyph glyph-name="uniF100" unicode="&#xf100;" 
d="M383.847 294.32v-128.068h8.74512l-13.1162 -22.668l-13.1191 22.668h8.74512v128.068h-8.74512l13.1191 22.668l13.1162 -22.668h-8.74512zM289.873 98.1582h0.266602l22.6699 -13.1182l-22.6699 -13.1182v8.74512h-111.11v-8.74512l-22.668 13.1182l22.668 13.1182
v-8.74512h110.844v8.74512zM444.801 33.5449c-0.981445 -1.33887 -1.96191 -2.58691 -3.03418 -3.83691c-26.3262 -31.5029 -53.9033 -62.3828 -80.6777 -93.708h-301.381v512h392.412v-16.332v-83.5332v-118.607v-112.806v-41.499
c-0.000976562 -14.8145 1.96387 -28.917 -7.31934 -41.6777zM409.461 38.0967h-51.0469v-56.7607zM426.686 422.387h-341.364v-460.953h247.388v89.5137c0 7.14062 5.71191 12.8516 12.8516 12.8516h81.125v0v358.588zM236.859 328.68l-1.07031 1.07031
c-0.536133 0.625977 -1.07129 1.69727 -1.07129 2.76758c0 2.76562 1.96387 4.64062 4.10547 4.64062h145.023c2.49902 0 4.37402 -1.87305 4.37402 -4.37305c0 -2.49902 -1.875 -4.37305 -4.37402 -4.37305h-145.112c-0.536133 0 -1.33887 0.267578 -1.875 0.267578z
M136.905 243.182h-32.7529l127.532 87.3711l127.532 -87.3711h-34.9844v-110.843h60.0615c2.49902 0 4.37305 -1.875 4.37305 -4.37305c0 -2.49902 -1.87402 -4.37207 -4.37305 -4.37207h-60.0615v-42.5703c0 -2.49902 -1.875 -4.37305 -4.37402 -4.37305
s-4.37402 1.87402 -4.37402 4.37305v42.5703h-16.957v85.2285h-42.5684v-85.2285h-110.309v-60.0625c0 -2.5 -1.87402 -4.37305 -4.37207 -4.37305s-4.37305 1.87305 -4.37305 4.37305v179.65zM179.029 166.163h51.3164v42.6602h-51.3164v-42.6602z" />
    <glyph glyph-name="uniF10E" unicode="&#xf10e;" 
d="M349.091 215.272c-39.5635 0 -69.8184 30.2549 -69.8184 69.8184s30.2549 69.8184 69.8184 69.8184s69.8184 -30.2549 69.8184 -69.8184s-30.2549 -69.8184 -69.8184 -69.8184zM162.909 215.272c-39.5635 0 -69.8184 30.2549 -69.8184 69.8184
s30.2549 69.8184 69.8184 69.8184s69.8184 -30.2549 69.8184 -69.8184s-30.2549 -69.8184 -69.8184 -69.8184zM162.909 168.728c53.5273 0 162.909 -27.9277 162.909 -81.4551v-58.1816h-325.818v58.1816c0 53.5273 109.382 81.4551 162.909 81.4551zM349.091 168.728
c53.5273 0 162.909 -27.9277 162.909 -81.4551v-58.1816h-139.637v58.1816c0 32.582 -18.6182 60.5098 -46.5449 79.1279c9.30859 2.32715 16.291 2.32715 23.2725 2.32715z" />
    <glyph glyph-name="uniF10B" unicode="&#xf10b;" 
d="M256 448c140.8 0 256 -115.2 256 -256s-115.2 -256 -256 -256s-256 115.2 -256 256s115.2 256 256 256zM256 371.2c-43.5195 0 -76.7998 -33.2803 -76.7998 -76.7998c0 -43.5205 33.2803 -76.8008 76.7998 -76.8008s76.7998 33.2803 76.7998 76.8008
c0 43.5195 -33.2803 76.7998 -76.7998 76.7998zM256 7.67969c64 0 120.32 33.2803 153.6 81.9199c0 51.2002 -102.399 79.3604 -153.6 79.3604s-153.6 -28.1602 -153.6 -79.3604c33.2793 -48.6406 89.5996 -81.9199 153.6 -81.9199z" />
    <glyph glyph-name="uniF10A" unicode="&#xf10a;" 
d="M55.9297 415.775c-0.333984 -1.70703 -3.48145 -16.1104 -1.46191 -32.2227h-2.63184h-32.2764v21.4824v10.7402h36.3701zM486.007 272.048c-3.97461 -4.41309 -19.1943 -6.64746 -20.6895 -6.65039h-198.712v-128.894h-5.37012h-5.37109h-10.7402h-10.7402v134.265
c-0.0214844 0.139648 -0.624023 11.2461 6.85254 19.2051c4.76855 5.08105 11.4932 7.64844 20 7.64844h198.713v85.9297h-19.0234c0 0.581055 3.57617 16.1123 0.0322266 32.2236h24.3613c9.86035 0 17.2617 -3.07129 21.9756 -8.78613
c6.96094 -8.45312 4.87695 -19.8389 4.78027 -20.3115l0.0966797 -95.0811c0.0332031 0 1.04297 -11.5566 -6.16504 -19.5488zM223.695 -51.7012l-0.0537109 155.982h-21.4824v21.4824h96.6699v-21.4824h-21.4824v-155.747s-0.00976562 -0.0537109 -0.03125 -0.150391
c-0.301758 -1.37402 -1.76074 -12.3838 -26.8213 -12.3838c-23.7168 0 -26.4014 10.6543 -26.7988 12.2988zM422.354 392.951c0 -21.4824 -5.15527 -51.4941 -8.15234 -63.1045h-328.628c-4.27344 10.3115 -12.3086 37.5938 -12.3086 59.0762
c0 39.8291 9.26953 51.752 12.3086 59.0771h328.628c2.08496 -8.05566 8.15234 -38.2705 8.15234 -55.0488z" />
  </font>
</defs></svg>
