Using pre-set license
Built from '2020.3/staging' branch; Version is '2020.3.6f1 (338bb68529b2) revision 3378102'; Using compiler version '192528614'; Build Type 'Release'
OS: 'Windows 10 Home; OS build 19041.985; Version 2004; 64bit' Language: 'es' Physical Memory: 16245 MB
BatchMode: 1, IsHumanControllingUs: 0, StartBugReporterOnCrash: 0, Is64bit: 1, IsPro: 0

 COMMAND LINE ARGUMENTS:
E:\Program Files (x86)\UnityVersions\Editor\Unity.exe
-adb2
-batchMode
-noUpm
-name
AssetImportWorker0
-projectPath
E:/eduar/Documents/SAE/UnityProjects/Repositorio/Procedural Road
-logFile
Logs/AssetImportWorker0.log
-srvPort
53787
Successfully changed project path to: E:/eduar/Documents/SAE/UnityProjects/Repositorio/Procedural Road
E:/eduar/Documents/SAE/UnityProjects/Repositorio/Procedural Road
Using Asset Import Pipeline V2.
Refreshing native plugins compatible for Editor in 39.47 ms, found 0 plugins.
Preloading 0 native plugins for Editor in 0.00 ms.
Initialize engine version: 2020.3.6f1 (338bb68529b2)
[Subsystems] Discovering subsystems at path E:/Program Files (x86)/UnityVersions/Editor/Data/Resources/UnitySubsystems
[Subsystems] Discovering subsystems at path E:/eduar/Documents/SAE/UnityProjects/Repositorio/Procedural Road/Assets
GfxDevice: creating device client; threaded=0
Direct3D:
    Version:  Direct3D 11.0 [level 11.1]
    Renderer: NVIDIA GeForce GTX 1080 (ID=0x1b80)
    Vendor:   
    VRAM:     8079 MB
    Driver:   27.21.14.6647
Initialize mono
Mono path[0] = 'E:/Program Files (x86)/UnityVersions/Editor/Data/Managed'
Mono path[1] = 'E:/Program Files (x86)/UnityVersions/Editor/Data/MonoBleedingEdge/lib/mono/unityjit'
Mono config path = 'E:/Program Files (x86)/UnityVersions/Editor/Data/MonoBleedingEdge/etc'
Using monoOptions --debugger-agent=transport=dt_socket,embedding=1,server=y,suspend=n,address=127.0.0.1:56516
Begin MonoManager ReloadAssembly
Registering precompiled unity dll's ...
Register platform support module: E:/Program Files (x86)/UnityVersions/Editor/Data/PlaybackEngines/WindowsStandaloneSupport/UnityEditor.WindowsStandalone.Extensions.dll
Registered in 0.003746 seconds.
Native extension for WindowsStandalone target not found
Refreshing native plugins compatible for Editor in 38.48 ms, found 0 plugins.
Preloading 0 native plugins for Editor in 0.00 ms.
Mono: successfully reloaded assembly
- Completed reload, in  1.384 seconds
Platform modules already initialized, skipping
Registering precompiled user dll's ...
Registered in 0.001196 seconds.
Begin MonoManager ReloadAssembly
Native extension for WindowsStandalone target not found
Refreshing native plugins compatible for Editor in 0.38 ms, found 0 plugins.
Preloading 0 native plugins for Editor in 0.00 ms.
Mono: successfully reloaded assembly
- Completed reload, in  1.225 seconds
Platform modules already initialized, skipping
========================================================================
Worker process is ready to serve import requests
Launched and connected shader compiler UnityShaderCompiler.exe after 0.05 seconds
Refreshing native plugins compatible for Editor in 1.00 ms, found 0 plugins.
Preloading 0 native plugins for Editor in 0.00 ms.
Unloading 1632 Unused Serialized files (Serialized files now loaded: 0)
System memory in use before: 79.1 MB.
System memory in use after: 79.2 MB.

Unloading 103 unused Assets to reduce memory usage. Loaded Objects now: 2067.
Total: 3.407000 ms (FindLiveObjects: 0.499900 ms CreateObjectMapping: 0.325000 ms MarkObjects: 2.336700 ms  DeleteObjects: 0.243800 ms)

========================================================================
Received Import Request.
  path: Assets/ModularRoar/Prefabs/LevelPieces/LevelBlock E To North.prefab
  artifactKey: Guid(fef2ca783579a5f46878bd5e8f24c6b1) Importer(815301076,1909f56bfc062723c751e8b465ee728b)
Start importing Assets/ModularRoar/Prefabs/LevelPieces/LevelBlock E To North.prefab using Guid(fef2ca783579a5f46878bd5e8f24c6b1) Importer(815301076,1909f56bfc062723c751e8b465ee728b)  -> (artifact id: '09e0f180cd92790f40b5273c7d421829') in 0.137432 seconds
  Import took 0.143195 seconds .

========================================================================
Received Import Request.
  Time since last request: 4.491365 seconds.
  path: Assets/ModularRoar/Prefabs/LevelPieces/LevelBlock E To North.prefab
  artifactKey: Guid(fef2ca783579a5f46878bd5e8f24c6b1) Importer(815301076,1909f56bfc062723c751e8b465ee728b)
Start importing Assets/ModularRoar/Prefabs/LevelPieces/LevelBlock E To North.prefab using Guid(fef2ca783579a5f46878bd5e8f24c6b1) Importer(815301076,1909f56bfc062723c751e8b465ee728b)  -> (artifact id: '7ec5c697327ddf5af8c552d93551663a') in 0.023898 seconds
  Import took 0.027944 seconds .

========================================================================
Received Import Request.
  Time since last request: 14.704238 seconds.
  path: Assets/ModularRoar/Prefabs/LevelPieces/LevelBlock E To North.prefab
  artifactKey: Guid(fef2ca783579a5f46878bd5e8f24c6b1) Importer(815301076,1909f56bfc062723c751e8b465ee728b)
Start importing Assets/ModularRoar/Prefabs/LevelPieces/LevelBlock E To North.prefab using Guid(fef2ca783579a5f46878bd5e8f24c6b1) Importer(815301076,1909f56bfc062723c751e8b465ee728b)  -> (artifact id: 'd3a6e3ac9c7477902ff1b6a936dd4949') in 0.022847 seconds
  Import took 0.026980 seconds .

========================================================================
Received Import Request.
  Time since last request: 5.014725 seconds.
  path: Assets/ModularRoar/Prefabs/LevelPieces/LevelBlock E To North.prefab
  artifactKey: Guid(fef2ca783579a5f46878bd5e8f24c6b1) Importer(815301076,1909f56bfc062723c751e8b465ee728b)
Start importing Assets/ModularRoar/Prefabs/LevelPieces/LevelBlock E To North.prefab using Guid(fef2ca783579a5f46878bd5e8f24c6b1) Importer(815301076,1909f56bfc062723c751e8b465ee728b)  -> (artifact id: '821816d51a322872b07620db00b2cbf2') in 0.029211 seconds
  Import took 0.033572 seconds .

========================================================================
Received Import Request.
  Time since last request: 2.399209 seconds.
  path: Assets/ModularRoar/Prefabs/LevelPieces/LevelBlock E To North.prefab
  artifactKey: Guid(fef2ca783579a5f46878bd5e8f24c6b1) Importer(815301076,1909f56bfc062723c751e8b465ee728b)
Start importing Assets/ModularRoar/Prefabs/LevelPieces/LevelBlock E To North.prefab using Guid(fef2ca783579a5f46878bd5e8f24c6b1) Importer(815301076,1909f56bfc062723c751e8b465ee728b)  -> (artifact id: '757e81582abbc825402ce2db9541a0dc') in 0.020800 seconds
  Import took 0.024945 seconds .

========================================================================
Received Import Request.
  Time since last request: 1.175161 seconds.
  path: Assets/ModularRoar/Prefabs/LevelPieces/LevelBlock E To North.prefab
  artifactKey: Guid(fef2ca783579a5f46878bd5e8f24c6b1) Importer(815301076,1909f56bfc062723c751e8b465ee728b)
Start importing Assets/ModularRoar/Prefabs/LevelPieces/LevelBlock E To North.prefab using Guid(fef2ca783579a5f46878bd5e8f24c6b1) Importer(815301076,1909f56bfc062723c751e8b465ee728b)  -> (artifact id: '0495e47cc9ce2eabcdf3de7eab88ebd0') in 0.028755 seconds
  Import took 0.033872 seconds .

========================================================================
Received Import Request.
  Time since last request: 4.412235 seconds.
  path: Assets/ModularRoar/Prefabs/LevelPieces/LevelBlock E To North.prefab
  artifactKey: Guid(fef2ca783579a5f46878bd5e8f24c6b1) Importer(815301076,1909f56bfc062723c751e8b465ee728b)
Start importing Assets/ModularRoar/Prefabs/LevelPieces/LevelBlock E To North.prefab using Guid(fef2ca783579a5f46878bd5e8f24c6b1) Importer(815301076,1909f56bfc062723c751e8b465ee728b)  -> (artifact id: 'f248333cd16957a2bc691cc10144850d') in 0.018304 seconds
  Import took 0.022238 seconds .

========================================================================
Received Import Request.
  Time since last request: 9.720401 seconds.
  path: Assets/ModularRoar/Prefabs/LevelPieces/LevelBlock E To North.prefab
  artifactKey: Guid(fef2ca783579a5f46878bd5e8f24c6b1) Importer(815301076,1909f56bfc062723c751e8b465ee728b)
Start importing Assets/ModularRoar/Prefabs/LevelPieces/LevelBlock E To North.prefab using Guid(fef2ca783579a5f46878bd5e8f24c6b1) Importer(815301076,1909f56bfc062723c751e8b465ee728b)  -> (artifact id: 'f2ceb8833a91076c2552147ae9ae2633') in 0.024428 seconds
  Import took 0.029595 seconds .

========================================================================
Received Import Request.
  Time since last request: 17.377877 seconds.
  path: Assets/ModularRoar/Prefabs/LevelPieces/LevelBlock S To East.prefab
  artifactKey: Guid(96d1c3912701e4847a767b776f19d1e4) Importer(815301076,1909f56bfc062723c751e8b465ee728b)
Start importing Assets/ModularRoar/Prefabs/LevelPieces/LevelBlock S To East.prefab using Guid(96d1c3912701e4847a767b776f19d1e4) Importer(815301076,1909f56bfc062723c751e8b465ee728b)  -> (artifact id: '978aaa38392884fe123c4927fcdb5e9f') in 0.028550 seconds
  Import took 0.032548 seconds .

========================================================================
Received Import Request.
  Time since last request: 7.004281 seconds.
  path: Assets/ModularRoar/Prefabs/LevelPieces/LevelBlock S To East.prefab
  artifactKey: Guid(96d1c3912701e4847a767b776f19d1e4) Importer(815301076,1909f56bfc062723c751e8b465ee728b)
Start importing Assets/ModularRoar/Prefabs/LevelPieces/LevelBlock S To East.prefab using Guid(96d1c3912701e4847a767b776f19d1e4) Importer(815301076,1909f56bfc062723c751e8b465ee728b)  -> (artifact id: 'c577aa48ac019c0bfc62abb5ac58a6c6') in 0.031532 seconds
  Import took 0.035894 seconds .

========================================================================
Received Import Request.
  Time since last request: 7.298513 seconds.
  path: Assets/ModularRoar/Prefabs/LevelPieces/LevelBlock S To East.prefab
  artifactKey: Guid(96d1c3912701e4847a767b776f19d1e4) Importer(815301076,1909f56bfc062723c751e8b465ee728b)
Start importing Assets/ModularRoar/Prefabs/LevelPieces/LevelBlock S To East.prefab using Guid(96d1c3912701e4847a767b776f19d1e4) Importer(815301076,1909f56bfc062723c751e8b465ee728b)  -> (artifact id: '8d745038066c54913c33368ae7674cbd') in 0.026543 seconds
  Import took 0.029984 seconds .

========================================================================
Received Import Request.
  Time since last request: 2.462132 seconds.
  path: Assets/ModularRoar/Prefabs/LevelPieces/LevelBlock S To East.prefab
  artifactKey: Guid(96d1c3912701e4847a767b776f19d1e4) Importer(815301076,1909f56bfc062723c751e8b465ee728b)
Start importing Assets/ModularRoar/Prefabs/LevelPieces/LevelBlock S To East.prefab using Guid(96d1c3912701e4847a767b776f19d1e4) Importer(815301076,1909f56bfc062723c751e8b465ee728b)  -> (artifact id: '2c7fcb891eb0150b410392b3309f9e46') in 0.025229 seconds
  Import took 0.029351 seconds .

========================================================================
Received Import Request.
  Time since last request: 15.168127 seconds.
  path: Assets/ModularRoar/Prefabs/LevelPieces/LevelBlock S To North.prefab
  artifactKey: Guid(61df4719d5c659f4abe752e88c8c6744) Importer(815301076,1909f56bfc062723c751e8b465ee728b)
Start importing Assets/ModularRoar/Prefabs/LevelPieces/LevelBlock S To North.prefab using Guid(61df4719d5c659f4abe752e88c8c6744) Importer(815301076,1909f56bfc062723c751e8b465ee728b)  -> (artifact id: '4f3aacd67001aac336632b45f98f112b') in 0.027960 seconds
  Import took 0.032198 seconds .

========================================================================
Received Import Request.
  Time since last request: 3.567988 seconds.
  path: Assets/ModularRoar/Prefabs/LevelPieces/LevelBlock S To North.prefab
  artifactKey: Guid(61df4719d5c659f4abe752e88c8c6744) Importer(815301076,1909f56bfc062723c751e8b465ee728b)
Start importing Assets/ModularRoar/Prefabs/LevelPieces/LevelBlock S To North.prefab using Guid(61df4719d5c659f4abe752e88c8c6744) Importer(815301076,1909f56bfc062723c751e8b465ee728b)  -> (artifact id: '4a8d29bb14184658c10ad73c290e58e9') in 0.019033 seconds
  Import took 0.023296 seconds .

========================================================================
Received Import Request.
  Time since last request: 1.949408 seconds.
  path: Assets/ModularRoar/Prefabs/LevelPieces/LevelBlock S To North.prefab
  artifactKey: Guid(61df4719d5c659f4abe752e88c8c6744) Importer(815301076,1909f56bfc062723c751e8b465ee728b)
Start importing Assets/ModularRoar/Prefabs/LevelPieces/LevelBlock S To North.prefab using Guid(61df4719d5c659f4abe752e88c8c6744) Importer(815301076,1909f56bfc062723c751e8b465ee728b)  -> (artifact id: 'ce722cbae3d1e096408e49fef3aa99ab') in 0.019262 seconds
  Import took 0.023585 seconds .

========================================================================
Received Import Request.
  Time since last request: 14.297927 seconds.
  path: Assets/ModularRoar/Prefabs/LevelPieces/LevelBlock S To North.prefab
  artifactKey: Guid(61df4719d5c659f4abe752e88c8c6744) Importer(815301076,1909f56bfc062723c751e8b465ee728b)
Start importing Assets/ModularRoar/Prefabs/LevelPieces/LevelBlock S To North.prefab using Guid(61df4719d5c659f4abe752e88c8c6744) Importer(815301076,1909f56bfc062723c751e8b465ee728b)  -> (artifact id: '6d7c08bc27e8a5f0aa196af15d726d55') in 0.024991 seconds
  Import took 0.028694 seconds .

========================================================================
Received Import Request.
  Time since last request: 2.184631 seconds.
  path: Assets/ModularRoar/Prefabs/LevelPieces/LevelBlock S To North.prefab
  artifactKey: Guid(61df4719d5c659f4abe752e88c8c6744) Importer(815301076,1909f56bfc062723c751e8b465ee728b)
Start importing Assets/ModularRoar/Prefabs/LevelPieces/LevelBlock S To North.prefab using Guid(61df4719d5c659f4abe752e88c8c6744) Importer(815301076,1909f56bfc062723c751e8b465ee728b)  -> (artifact id: '36f2c683fe82decddb654c4cc872bd16') in 0.018012 seconds
  Import took 0.022969 seconds .

========================================================================
Received Import Request.
  Time since last request: 4.827401 seconds.
  path: Assets/ModularRoar/Prefabs/LevelPieces/LevelBlock S To North.prefab
  artifactKey: Guid(61df4719d5c659f4abe752e88c8c6744) Importer(815301076,1909f56bfc062723c751e8b465ee728b)
Start importing Assets/ModularRoar/Prefabs/LevelPieces/LevelBlock S To North.prefab using Guid(61df4719d5c659f4abe752e88c8c6744) Importer(815301076,1909f56bfc062723c751e8b465ee728b)  -> (artifact id: '06ee6c4db100dd0e1f5438c072b1fb0e') in 0.035991 seconds
  Import took 0.039941 seconds .

========================================================================
Received Import Request.
  Time since last request: 1.171628 seconds.
  path: Assets/ModularRoar/Prefabs/LevelPieces/LevelBlock S To North.prefab
  artifactKey: Guid(61df4719d5c659f4abe752e88c8c6744) Importer(815301076,1909f56bfc062723c751e8b465ee728b)
Start importing Assets/ModularRoar/Prefabs/LevelPieces/LevelBlock S To North.prefab using Guid(61df4719d5c659f4abe752e88c8c6744) Importer(815301076,1909f56bfc062723c751e8b465ee728b)  -> (artifact id: '4ad236ababd7f2b0b8dad2e479d664af') in 0.027290 seconds
  Import took 0.033762 seconds .

========================================================================
Received Import Request.
  Time since last request: 1.781044 seconds.
  path: Assets/ModularRoar/Prefabs/LevelPieces/LevelBlock S To North.prefab
  artifactKey: Guid(61df4719d5c659f4abe752e88c8c6744) Importer(815301076,1909f56bfc062723c751e8b465ee728b)
Start importing Assets/ModularRoar/Prefabs/LevelPieces/LevelBlock S To North.prefab using Guid(61df4719d5c659f4abe752e88c8c6744) Importer(815301076,1909f56bfc062723c751e8b465ee728b)  -> (artifact id: '9acd79abdd8856119b279582b2331ba6') in 0.025164 seconds
  Import took 0.031382 seconds .

========================================================================
Received Import Request.
  Time since last request: 8.637764 seconds.
  path: Assets/ModularRoar/Prefabs/LevelPieces/LevelBlock S To West.prefab
  artifactKey: Guid(2073cba55421ef04398038331126d497) Importer(815301076,1909f56bfc062723c751e8b465ee728b)
Start importing Assets/ModularRoar/Prefabs/LevelPieces/LevelBlock S To West.prefab using Guid(2073cba55421ef04398038331126d497) Importer(815301076,1909f56bfc062723c751e8b465ee728b)  -> (artifact id: '174a5ae1540ef0562d6f76949de8fe0d') in 0.035216 seconds
  Import took 0.041059 seconds .

========================================================================
Received Import Request.
  Time since last request: 5.131915 seconds.
  path: Assets/ModularRoar/Prefabs/LevelPieces/LevelBlock S To West.prefab
  artifactKey: Guid(2073cba55421ef04398038331126d497) Importer(815301076,1909f56bfc062723c751e8b465ee728b)
Start importing Assets/ModularRoar/Prefabs/LevelPieces/LevelBlock S To West.prefab using Guid(2073cba55421ef04398038331126d497) Importer(815301076,1909f56bfc062723c751e8b465ee728b)  -> (artifact id: '3f29de9784c9b6032e88bd205c12d04e') in 0.029383 seconds
  Import took 0.033020 seconds .

========================================================================
Received Import Request.
  Time since last request: 3.758197 seconds.
  path: Assets/ModularRoar/Prefabs/LevelPieces/LevelBlock S To West.prefab
  artifactKey: Guid(2073cba55421ef04398038331126d497) Importer(815301076,1909f56bfc062723c751e8b465ee728b)
Start importing Assets/ModularRoar/Prefabs/LevelPieces/LevelBlock S To West.prefab using Guid(2073cba55421ef04398038331126d497) Importer(815301076,1909f56bfc062723c751e8b465ee728b)  -> (artifact id: '082d27d7697cccde9a7b0bcfdaf69488') in 0.019537 seconds
  Import took 0.023311 seconds .

========================================================================
Received Import Request.
  Time since last request: 5.947893 seconds.
  path: Assets/ModularRoar/Prefabs/LevelPieces/LevelBlock S To West.prefab
  artifactKey: Guid(2073cba55421ef04398038331126d497) Importer(815301076,1909f56bfc062723c751e8b465ee728b)
Start importing Assets/ModularRoar/Prefabs/LevelPieces/LevelBlock S To West.prefab using Guid(2073cba55421ef04398038331126d497) Importer(815301076,1909f56bfc062723c751e8b465ee728b)  -> (artifact id: 'f3503b4bde259ee9f1f85e794d24dfbb') in 0.020056 seconds
  Import took 0.025275 seconds .

========================================================================
Received Import Request.
  Time since last request: 1.908795 seconds.
  path: Assets/ModularRoar/Prefabs/LevelPieces/LevelBlock S To West.prefab
  artifactKey: Guid(2073cba55421ef04398038331126d497) Importer(815301076,1909f56bfc062723c751e8b465ee728b)
Start importing Assets/ModularRoar/Prefabs/LevelPieces/LevelBlock S To West.prefab using Guid(2073cba55421ef04398038331126d497) Importer(815301076,1909f56bfc062723c751e8b465ee728b)  -> (artifact id: '8071be6a6fd6432bc8968481452b967b') in 0.026721 seconds
  Import took 0.031025 seconds .

========================================================================
Received Import Request.
  Time since last request: 1.892551 seconds.
  path: Assets/ModularRoar/Prefabs/LevelPieces/LevelBlock S To West.prefab
  artifactKey: Guid(2073cba55421ef04398038331126d497) Importer(815301076,1909f56bfc062723c751e8b465ee728b)
Start importing Assets/ModularRoar/Prefabs/LevelPieces/LevelBlock S To West.prefab using Guid(2073cba55421ef04398038331126d497) Importer(815301076,1909f56bfc062723c751e8b465ee728b)  -> (artifact id: '63ed80381475e4746156d13a78b6c4c2') in 0.024246 seconds
  Import took 0.027939 seconds .

========================================================================
Received Import Request.
  Time since last request: 10.663947 seconds.
  path: Assets/ModularRoar/Prefabs/LevelPieces/LevelBlock W To North.prefab
  artifactKey: Guid(21e152a04432e934daa8a92d3315e925) Importer(815301076,1909f56bfc062723c751e8b465ee728b)
Start importing Assets/ModularRoar/Prefabs/LevelPieces/LevelBlock W To North.prefab using Guid(21e152a04432e934daa8a92d3315e925) Importer(815301076,1909f56bfc062723c751e8b465ee728b)  -> (artifact id: 'e02956b105c8c31cdab3c1747f119af9') in 0.033734 seconds
  Import took 0.038014 seconds .

========================================================================
Received Import Request.
  Time since last request: 3.167028 seconds.
  path: Assets/ModularRoar/Prefabs/LevelPieces/LevelBlock W To North.prefab
  artifactKey: Guid(21e152a04432e934daa8a92d3315e925) Importer(815301076,1909f56bfc062723c751e8b465ee728b)
Start importing Assets/ModularRoar/Prefabs/LevelPieces/LevelBlock W To North.prefab using Guid(21e152a04432e934daa8a92d3315e925) Importer(815301076,1909f56bfc062723c751e8b465ee728b)  -> (artifact id: '58f81bfd7885d639b0309f386326c1f9') in 0.018261 seconds
  Import took 0.021981 seconds .

========================================================================
Received Import Request.
  Time since last request: 1.925107 seconds.
  path: Assets/ModularRoar/Prefabs/LevelPieces/LevelBlock W To North.prefab
  artifactKey: Guid(21e152a04432e934daa8a92d3315e925) Importer(815301076,1909f56bfc062723c751e8b465ee728b)
Start importing Assets/ModularRoar/Prefabs/LevelPieces/LevelBlock W To North.prefab using Guid(21e152a04432e934daa8a92d3315e925) Importer(815301076,1909f56bfc062723c751e8b465ee728b)  -> (artifact id: 'c2ee6f5bc2a3efb32c9a4da59bf59435') in 0.023653 seconds
  Import took 0.028216 seconds .

========================================================================
Received Import Request.
  Time since last request: 5.232000 seconds.
  path: Assets/ModularRoar/Prefabs/LevelPieces/LevelBlock W To North.prefab
  artifactKey: Guid(21e152a04432e934daa8a92d3315e925) Importer(815301076,1909f56bfc062723c751e8b465ee728b)
Start importing Assets/ModularRoar/Prefabs/LevelPieces/LevelBlock W To North.prefab using Guid(21e152a04432e934daa8a92d3315e925) Importer(815301076,1909f56bfc062723c751e8b465ee728b)  -> (artifact id: '3566c3a135bfe440a838cb34d98ee332') in 0.021962 seconds
  Import took 0.025713 seconds .

========================================================================
Received Import Request.
  Time since last request: 12.255351 seconds.
  path: Assets/ModularRoar/Prefabs/LevelPieces/LevelBlock W To North.prefab
  artifactKey: Guid(21e152a04432e934daa8a92d3315e925) Importer(815301076,1909f56bfc062723c751e8b465ee728b)
Start importing Assets/ModularRoar/Prefabs/LevelPieces/LevelBlock W To North.prefab using Guid(21e152a04432e934daa8a92d3315e925) Importer(815301076,1909f56bfc062723c751e8b465ee728b)  -> (artifact id: '4edb5b63837733bb06a0e10cb077ee35') in 0.023902 seconds
  Import took 0.028555 seconds .

========================================================================
Received Import Request.
  Time since last request: 5.432238 seconds.
  path: Assets/ModularRoar/Prefabs/LevelPieces/LevelBlock W To North.prefab
  artifactKey: Guid(21e152a04432e934daa8a92d3315e925) Importer(815301076,1909f56bfc062723c751e8b465ee728b)
Start importing Assets/ModularRoar/Prefabs/LevelPieces/LevelBlock W To North.prefab using Guid(21e152a04432e934daa8a92d3315e925) Importer(815301076,1909f56bfc062723c751e8b465ee728b)  -> (artifact id: '17b3e3747a2a2020042b00fc300c3bf6') in 0.023891 seconds
  Import took 0.027453 seconds .

========================================================================
Received Prepare
Registering precompiled user dll's ...
Registered in 0.001135 seconds.
Begin MonoManager ReloadAssembly
Native extension for WindowsStandalone target not found
Refreshing native plugins compatible for Editor in 2.25 ms, found 0 plugins.
Preloading 0 native plugins for Editor in 0.00 ms.
Warning: Annotation not found!
UnityEngine.StackTraceUtility:ExtractStackTrace ()
UnityEditor.ProBuilder.EditorUtility:SetGizmoIconEnabled (System.Type,bool) (at Library/PackageCache/com.unity.probuilder@4.5.0/Editor/EditorCore/EditorUtility.cs:593)
UnityEditor.ProBuilder.HierarchyListener:.cctor () (at Library/PackageCache/com.unity.probuilder@4.5.0/Editor/EditorCore/HierarchyListener.cs:21)
System.Runtime.CompilerServices.RuntimeHelpers:RunClassConstructor (System.RuntimeTypeHandle)
UnityEditor.EditorAssemblies:ProcessInitializeOnLoadAttributes (System.Type[])

[Library/PackageCache/com.unity.probuilder@4.5.0/Editor/EditorCore/EditorUtility.cs line 593]

Mono: successfully reloaded assembly
- Completed reload, in  0.977 seconds
Platform modules already initialized, skipping
Refreshing native plugins compatible for Editor in 0.38 ms, found 0 plugins.
Preloading 0 native plugins for Editor in 0.00 ms.
Unloading 1597 Unused Serialized files (Serialized files now loaded: 0)
System memory in use before: 79.5 MB.
System memory in use after: 79.6 MB.

Unloading 7 unused Assets to reduce memory usage. Loaded Objects now: 2079.
Total: 2.060100 ms (FindLiveObjects: 0.179500 ms CreateObjectMapping: 0.055900 ms MarkObjects: 1.738600 ms  DeleteObjects: 0.085000 ms)

========================================================================
Received Prepare
Registering precompiled user dll's ...
Registered in 0.001939 seconds.
Begin MonoManager ReloadAssembly
Native extension for WindowsStandalone target not found
Refreshing native plugins compatible for Editor in 0.36 ms, found 0 plugins.
Preloading 0 native plugins for Editor in 0.00 ms.
Warning: Annotation not found!
UnityEngine.StackTraceUtility:ExtractStackTrace ()
UnityEditor.ProBuilder.EditorUtility:SetGizmoIconEnabled (System.Type,bool) (at Library/PackageCache/com.unity.probuilder@4.5.0/Editor/EditorCore/EditorUtility.cs:593)
UnityEditor.ProBuilder.HierarchyListener:.cctor () (at Library/PackageCache/com.unity.probuilder@4.5.0/Editor/EditorCore/HierarchyListener.cs:21)
System.Runtime.CompilerServices.RuntimeHelpers:RunClassConstructor (System.RuntimeTypeHandle)
UnityEditor.EditorAssemblies:ProcessInitializeOnLoadAttributes (System.Type[])

[Library/PackageCache/com.unity.probuilder@4.5.0/Editor/EditorCore/EditorUtility.cs line 593]

Mono: successfully reloaded assembly
- Completed reload, in  1.046 seconds
Platform modules already initialized, skipping
Refreshing native plugins compatible for Editor in 0.34 ms, found 0 plugins.
Preloading 0 native plugins for Editor in 0.00 ms.
Unloading 1596 Unused Serialized files (Serialized files now loaded: 0)
System memory in use before: 79.5 MB.
System memory in use after: 79.6 MB.

Unloading 7 unused Assets to reduce memory usage. Loaded Objects now: 2082.
Total: 2.301200 ms (FindLiveObjects: 0.286600 ms CreateObjectMapping: 0.070000 ms MarkObjects: 1.843600 ms  DeleteObjects: 0.099400 ms)

========================================================================
Received Prepare
Registering precompiled user dll's ...
Registered in 0.001394 seconds.
Begin MonoManager ReloadAssembly
Native extension for WindowsStandalone target not found
Refreshing native plugins compatible for Editor in 0.34 ms, found 0 plugins.
Preloading 0 native plugins for Editor in 0.00 ms.
Warning: Annotation not found!
UnityEngine.StackTraceUtility:ExtractStackTrace ()
UnityEditor.ProBuilder.EditorUtility:SetGizmoIconEnabled (System.Type,bool) (at Library/PackageCache/com.unity.probuilder@4.5.0/Editor/EditorCore/EditorUtility.cs:593)
UnityEditor.ProBuilder.HierarchyListener:.cctor () (at Library/PackageCache/com.unity.probuilder@4.5.0/Editor/EditorCore/HierarchyListener.cs:21)
System.Runtime.CompilerServices.RuntimeHelpers:RunClassConstructor (System.RuntimeTypeHandle)
UnityEditor.EditorAssemblies:ProcessInitializeOnLoadAttributes (System.Type[])

[Library/PackageCache/com.unity.probuilder@4.5.0/Editor/EditorCore/EditorUtility.cs line 593]

Mono: successfully reloaded assembly
- Completed reload, in  1.054 seconds
Platform modules already initialized, skipping
Refreshing native plugins compatible for Editor in 0.42 ms, found 0 plugins.
Preloading 0 native plugins for Editor in 0.00 ms.
Unloading 1596 Unused Serialized files (Serialized files now loaded: 0)
System memory in use before: 79.5 MB.
System memory in use after: 79.6 MB.

Unloading 7 unused Assets to reduce memory usage. Loaded Objects now: 2085.
Total: 2.165900 ms (FindLiveObjects: 0.184100 ms CreateObjectMapping: 0.057400 ms MarkObjects: 1.841100 ms  DeleteObjects: 0.082000 ms)

========================================================================
Received Prepare
Registering precompiled user dll's ...
Registered in 0.001059 seconds.
Begin MonoManager ReloadAssembly
Native extension for WindowsStandalone target not found
Refreshing native plugins compatible for Editor in 0.36 ms, found 0 plugins.
Preloading 0 native plugins for Editor in 0.00 ms.
Warning: Annotation not found!
UnityEngine.StackTraceUtility:ExtractStackTrace ()
UnityEditor.ProBuilder.EditorUtility:SetGizmoIconEnabled (System.Type,bool) (at Library/PackageCache/com.unity.probuilder@4.5.0/Editor/EditorCore/EditorUtility.cs:593)
UnityEditor.ProBuilder.HierarchyListener:.cctor () (at Library/PackageCache/com.unity.probuilder@4.5.0/Editor/EditorCore/HierarchyListener.cs:21)
System.Runtime.CompilerServices.RuntimeHelpers:RunClassConstructor (System.RuntimeTypeHandle)
UnityEditor.EditorAssemblies:ProcessInitializeOnLoadAttributes (System.Type[])

[Library/PackageCache/com.unity.probuilder@4.5.0/Editor/EditorCore/EditorUtility.cs line 593]

Mono: successfully reloaded assembly
- Completed reload, in  1.013 seconds
Platform modules already initialized, skipping
Refreshing native plugins compatible for Editor in 0.47 ms, found 0 plugins.
Preloading 0 native plugins for Editor in 0.00 ms.
Unloading 1596 Unused Serialized files (Serialized files now loaded: 0)
System memory in use before: 79.5 MB.
System memory in use after: 79.6 MB.

Unloading 7 unused Assets to reduce memory usage. Loaded Objects now: 2088.
Total: 4.136800 ms (FindLiveObjects: 0.297700 ms CreateObjectMapping: 0.076000 ms MarkObjects: 3.663100 ms  DeleteObjects: 0.098000 ms)

========================================================================
Received Prepare
Registering precompiled user dll's ...
Registered in 0.001596 seconds.
Begin MonoManager ReloadAssembly
Native extension for WindowsStandalone target not found
Refreshing native plugins compatible for Editor in 0.40 ms, found 0 plugins.
Preloading 0 native plugins for Editor in 0.00 ms.
Warning: Annotation not found!
UnityEngine.StackTraceUtility:ExtractStackTrace ()
UnityEditor.ProBuilder.EditorUtility:SetGizmoIconEnabled (System.Type,bool) (at Library/PackageCache/com.unity.probuilder@4.5.0/Editor/EditorCore/EditorUtility.cs:593)
UnityEditor.ProBuilder.HierarchyListener:.cctor () (at Library/PackageCache/com.unity.probuilder@4.5.0/Editor/EditorCore/HierarchyListener.cs:21)
System.Runtime.CompilerServices.RuntimeHelpers:RunClassConstructor (System.RuntimeTypeHandle)
UnityEditor.EditorAssemblies:ProcessInitializeOnLoadAttributes (System.Type[])

[Library/PackageCache/com.unity.probuilder@4.5.0/Editor/EditorCore/EditorUtility.cs line 593]

Mono: successfully reloaded assembly
- Completed reload, in  1.044 seconds
Platform modules already initialized, skipping
Refreshing native plugins compatible for Editor in 0.37 ms, found 0 plugins.
Preloading 0 native plugins for Editor in 0.00 ms.
Unloading 1596 Unused Serialized files (Serialized files now loaded: 0)
System memory in use before: 79.5 MB.
System memory in use after: 79.6 MB.

Unloading 7 unused Assets to reduce memory usage. Loaded Objects now: 2091.
Total: 2.347400 ms (FindLiveObjects: 0.280300 ms CreateObjectMapping: 0.074700 ms MarkObjects: 1.899000 ms  DeleteObjects: 0.092300 ms)

========================================================================
Received Prepare
Registering precompiled user dll's ...
Registered in 0.001105 seconds.
Begin MonoManager ReloadAssembly
Native extension for WindowsStandalone target not found
Refreshing native plugins compatible for Editor in 0.34 ms, found 0 plugins.
Preloading 0 native plugins for Editor in 0.00 ms.
Warning: Annotation not found!
UnityEngine.StackTraceUtility:ExtractStackTrace ()
UnityEditor.ProBuilder.EditorUtility:SetGizmoIconEnabled (System.Type,bool) (at Library/PackageCache/com.unity.probuilder@4.5.0/Editor/EditorCore/EditorUtility.cs:593)
UnityEditor.ProBuilder.HierarchyListener:.cctor () (at Library/PackageCache/com.unity.probuilder@4.5.0/Editor/EditorCore/HierarchyListener.cs:21)
System.Runtime.CompilerServices.RuntimeHelpers:RunClassConstructor (System.RuntimeTypeHandle)
UnityEditor.EditorAssemblies:ProcessInitializeOnLoadAttributes (System.Type[])

[Library/PackageCache/com.unity.probuilder@4.5.0/Editor/EditorCore/EditorUtility.cs line 593]

Mono: successfully reloaded assembly
- Completed reload, in  0.894 seconds
Platform modules already initialized, skipping
Refreshing native plugins compatible for Editor in 0.35 ms, found 0 plugins.
Preloading 0 native plugins for Editor in 0.00 ms.
Unloading 1596 Unused Serialized files (Serialized files now loaded: 0)
System memory in use before: 79.6 MB.
System memory in use after: 79.6 MB.

Unloading 7 unused Assets to reduce memory usage. Loaded Objects now: 2094.
Total: 2.443900 ms (FindLiveObjects: 0.190200 ms CreateObjectMapping: 0.055000 ms MarkObjects: 2.101400 ms  DeleteObjects: 0.096200 ms)

========================================================================
Received Import Request.
  Time since last request: 887.134999 seconds.
  path: Assets/ModularRoar/Prefabs/LevelPieces/LevelBlock E To North.prefab
  artifactKey: Guid(fef2ca783579a5f46878bd5e8f24c6b1) Importer(815301076,1909f56bfc062723c751e8b465ee728b)
Start importing Assets/ModularRoar/Prefabs/LevelPieces/LevelBlock E To North.prefab using Guid(fef2ca783579a5f46878bd5e8f24c6b1) Importer(815301076,1909f56bfc062723c751e8b465ee728b)  -> (artifact id: 'cddca217d36ba1ccf88babadc0c3feda') in 0.085584 seconds
  Import took 0.092936 seconds .

========================================================================
Received Import Request.
  Time since last request: 10.328005 seconds.
  path: Assets/ModularRoar/Prefabs/LevelPieces/LevelBlock E To North.prefab
  artifactKey: Guid(fef2ca783579a5f46878bd5e8f24c6b1) Importer(815301076,1909f56bfc062723c751e8b465ee728b)
Start importing Assets/ModularRoar/Prefabs/LevelPieces/LevelBlock E To North.prefab using Guid(fef2ca783579a5f46878bd5e8f24c6b1) Importer(815301076,1909f56bfc062723c751e8b465ee728b)  -> (artifact id: '5d994752d28622d5f4e76976580b7f54') in 0.035828 seconds
  Import took 0.039682 seconds .

========================================================================
Received Import Request.
  Time since last request: 2.594303 seconds.
  path: Assets/ModularRoar/Prefabs/LevelPieces/LevelBlock E To North.prefab
  artifactKey: Guid(fef2ca783579a5f46878bd5e8f24c6b1) Importer(815301076,1909f56bfc062723c751e8b465ee728b)
Start importing Assets/ModularRoar/Prefabs/LevelPieces/LevelBlock E To North.prefab using Guid(fef2ca783579a5f46878bd5e8f24c6b1) Importer(815301076,1909f56bfc062723c751e8b465ee728b)  -> (artifact id: 'f523449e3e5c1bfcf47fa176531948b5') in 0.026218 seconds
  Import took 0.030208 seconds .

========================================================================
Received Import Request.
  Time since last request: 9.056786 seconds.
  path: Assets/ModularRoar/Prefabs/LevelPieces/LevelBlock E To North.prefab
  artifactKey: Guid(fef2ca783579a5f46878bd5e8f24c6b1) Importer(815301076,1909f56bfc062723c751e8b465ee728b)
Start importing Assets/ModularRoar/Prefabs/LevelPieces/LevelBlock E To North.prefab using Guid(fef2ca783579a5f46878bd5e8f24c6b1) Importer(815301076,1909f56bfc062723c751e8b465ee728b)  -> (artifact id: 'd360bd21e7496ea8dced0b6e75bd6c0c') in 0.032714 seconds
  Import took 0.037470 seconds .

========================================================================
Received Import Request.
  Time since last request: 1.975540 seconds.
  path: Assets/ModularRoar/Prefabs/LevelPieces/LevelBlock E To North.prefab
  artifactKey: Guid(fef2ca783579a5f46878bd5e8f24c6b1) Importer(815301076,1909f56bfc062723c751e8b465ee728b)
Start importing Assets/ModularRoar/Prefabs/LevelPieces/LevelBlock E To North.prefab using Guid(fef2ca783579a5f46878bd5e8f24c6b1) Importer(815301076,1909f56bfc062723c751e8b465ee728b)  -> (artifact id: 'a128dd23f46f5cbd6bd6173a79b11e5e') in 0.039376 seconds
  Import took 0.043613 seconds .

========================================================================
Received Import Request.
  Time since last request: 2.994820 seconds.
  path: Assets/ModularRoar/Prefabs/LevelPieces/LevelBlock E To North.prefab
  artifactKey: Guid(fef2ca783579a5f46878bd5e8f24c6b1) Importer(815301076,1909f56bfc062723c751e8b465ee728b)
Start importing Assets/ModularRoar/Prefabs/LevelPieces/LevelBlock E To North.prefab using Guid(fef2ca783579a5f46878bd5e8f24c6b1) Importer(815301076,1909f56bfc062723c751e8b465ee728b)  -> (artifact id: '3b8ad408e3e224d96ebd5e3d3374a785') in 0.023312 seconds
  Import took 0.027692 seconds .

========================================================================
Received Import Request.
  Time since last request: 1.583431 seconds.
  path: Assets/ModularRoar/Prefabs/LevelPieces/LevelBlock E To North.prefab
  artifactKey: Guid(fef2ca783579a5f46878bd5e8f24c6b1) Importer(815301076,1909f56bfc062723c751e8b465ee728b)
Start importing Assets/ModularRoar/Prefabs/LevelPieces/LevelBlock E To North.prefab using Guid(fef2ca783579a5f46878bd5e8f24c6b1) Importer(815301076,1909f56bfc062723c751e8b465ee728b)  -> (artifact id: '2d1fcc1d6cf58b0782aa0e1a6058b186') in 0.026398 seconds
  Import took 0.030737 seconds .

========================================================================
Received Import Request.
  Time since last request: 7.824294 seconds.
  path: Assets/ModularRoar/Prefabs/LevelPieces/LevelBlock E To North.prefab
  artifactKey: Guid(fef2ca783579a5f46878bd5e8f24c6b1) Importer(815301076,1909f56bfc062723c751e8b465ee728b)
Start importing Assets/ModularRoar/Prefabs/LevelPieces/LevelBlock E To North.prefab using Guid(fef2ca783579a5f46878bd5e8f24c6b1) Importer(815301076,1909f56bfc062723c751e8b465ee728b)  -> (artifact id: 'f64d843bcedf85c910fefc7af7d04095') in 0.034239 seconds
  Import took 0.038519 seconds .

========================================================================
Received Import Request.
  Time since last request: 5.043414 seconds.
  path: Assets/ModularRoar/Prefabs/LevelPieces/LevelBlock E To North.prefab
  artifactKey: Guid(fef2ca783579a5f46878bd5e8f24c6b1) Importer(815301076,1909f56bfc062723c751e8b465ee728b)
Start importing Assets/ModularRoar/Prefabs/LevelPieces/LevelBlock E To North.prefab using Guid(fef2ca783579a5f46878bd5e8f24c6b1) Importer(815301076,1909f56bfc062723c751e8b465ee728b)  -> (artifact id: 'd1f1cbf41275375569d77c713b47bef2') in 0.024952 seconds
  Import took 0.028322 seconds .

========================================================================
Received Import Request.
  Time since last request: 0.980282 seconds.
  path: Assets/ModularRoar/Prefabs/LevelPieces/LevelBlock E To North.prefab
  artifactKey: Guid(fef2ca783579a5f46878bd5e8f24c6b1) Importer(815301076,1909f56bfc062723c751e8b465ee728b)
Start importing Assets/ModularRoar/Prefabs/LevelPieces/LevelBlock E To North.prefab using Guid(fef2ca783579a5f46878bd5e8f24c6b1) Importer(815301076,1909f56bfc062723c751e8b465ee728b)  -> (artifact id: 'fab31c6ea07e083822fc3f98e55cff86') in 0.022450 seconds
  Import took 0.027373 seconds .

========================================================================
Received Import Request.
  Time since last request: 16.557438 seconds.
  path: Assets/ModularRoar/Prefabs/LevelPieces/LevelBlock E To North.prefab
  artifactKey: Guid(fef2ca783579a5f46878bd5e8f24c6b1) Importer(815301076,1909f56bfc062723c751e8b465ee728b)
Start importing Assets/ModularRoar/Prefabs/LevelPieces/LevelBlock E To North.prefab using Guid(fef2ca783579a5f46878bd5e8f24c6b1) Importer(815301076,1909f56bfc062723c751e8b465ee728b)  -> (artifact id: '3c38774b02aa124b4ef0413027650b94') in 0.023330 seconds
  Import took 0.026898 seconds .

========================================================================
Received Prepare
Registering precompiled user dll's ...
Registered in 0.001448 seconds.
Begin MonoManager ReloadAssembly
Native extension for WindowsStandalone target not found
Refreshing native plugins compatible for Editor in 0.73 ms, found 0 plugins.
Preloading 0 native plugins for Editor in 0.00 ms.
Warning: Annotation not found!
UnityEngine.StackTraceUtility:ExtractStackTrace ()
UnityEditor.ProBuilder.EditorUtility:SetGizmoIconEnabled (System.Type,bool) (at Library/PackageCache/com.unity.probuilder@4.5.0/Editor/EditorCore/EditorUtility.cs:593)
UnityEditor.ProBuilder.HierarchyListener:.cctor () (at Library/PackageCache/com.unity.probuilder@4.5.0/Editor/EditorCore/HierarchyListener.cs:21)
System.Runtime.CompilerServices.RuntimeHelpers:RunClassConstructor (System.RuntimeTypeHandle)
UnityEditor.EditorAssemblies:ProcessInitializeOnLoadAttributes (System.Type[])

[Library/PackageCache/com.unity.probuilder@4.5.0/Editor/EditorCore/EditorUtility.cs line 593]

Mono: successfully reloaded assembly
- Completed reload, in  0.997 seconds
Platform modules already initialized, skipping
Refreshing native plugins compatible for Editor in 1.05 ms, found 0 plugins.
Preloading 0 native plugins for Editor in 0.00 ms.
Unloading 1597 Unused Serialized files (Serialized files now loaded: 0)
System memory in use before: 79.6 MB.
System memory in use after: 79.6 MB.

Unloading 8 unused Assets to reduce memory usage. Loaded Objects now: 2099.
Total: 2.542700 ms (FindLiveObjects: 0.178100 ms CreateObjectMapping: 0.054500 ms MarkObjects: 2.203500 ms  DeleteObjects: 0.105600 ms)

========================================================================
Received Prepare
Registering precompiled user dll's ...
Registered in 0.001181 seconds.
Begin MonoManager ReloadAssembly
Native extension for WindowsStandalone target not found
Refreshing native plugins compatible for Editor in 0.34 ms, found 0 plugins.
Preloading 0 native plugins for Editor in 0.00 ms.
Warning: Annotation not found!
UnityEngine.StackTraceUtility:ExtractStackTrace ()
UnityEditor.ProBuilder.EditorUtility:SetGizmoIconEnabled (System.Type,bool) (at Library/PackageCache/com.unity.probuilder@4.5.0/Editor/EditorCore/EditorUtility.cs:593)
UnityEditor.ProBuilder.HierarchyListener:.cctor () (at Library/PackageCache/com.unity.probuilder@4.5.0/Editor/EditorCore/HierarchyListener.cs:21)
System.Runtime.CompilerServices.RuntimeHelpers:RunClassConstructor (System.RuntimeTypeHandle)
UnityEditor.EditorAssemblies:ProcessInitializeOnLoadAttributes (System.Type[])

[Library/PackageCache/com.unity.probuilder@4.5.0/Editor/EditorCore/EditorUtility.cs line 593]

Mono: successfully reloaded assembly
- Completed reload, in  0.949 seconds
Platform modules already initialized, skipping
Refreshing native plugins compatible for Editor in 0.36 ms, found 0 plugins.
Preloading 0 native plugins for Editor in 0.00 ms.
Unloading 1597 Unused Serialized files (Serialized files now loaded: 0)
System memory in use before: 79.6 MB.
System memory in use after: 79.6 MB.

Unloading 7 unused Assets to reduce memory usage. Loaded Objects now: 2102.
Total: 2.381700 ms (FindLiveObjects: 0.228600 ms CreateObjectMapping: 0.055400 ms MarkObjects: 1.994400 ms  DeleteObjects: 0.101800 ms)

========================================================================
Received Import Request.
  Time since last request: 44.024282 seconds.
  path: Assets/ModularRoar/Prefabs/LevelPieces/LevelBlock E To North.prefab
  artifactKey: Guid(fef2ca783579a5f46878bd5e8f24c6b1) Importer(815301076,1909f56bfc062723c751e8b465ee728b)
Start importing Assets/ModularRoar/Prefabs/LevelPieces/LevelBlock E To North.prefab using Guid(fef2ca783579a5f46878bd5e8f24c6b1) Importer(815301076,1909f56bfc062723c751e8b465ee728b)  -> (artifact id: 'ae610940f22c7e35b6e0d217999b7a2e') in 0.066907 seconds
  Import took 0.070484 seconds .

========================================================================
Received Import Request.
  Time since last request: 4.997034 seconds.
  path: Assets/ModularRoar/Prefabs/LevelPieces/TriggerExitRoad.prefab
  artifactKey: Guid(b44d6a60253957d41a27946e2830f71a) Importer(815301076,1909f56bfc062723c751e8b465ee728b)
Start importing Assets/ModularRoar/Prefabs/LevelPieces/TriggerExitRoad.prefab using Guid(b44d6a60253957d41a27946e2830f71a) Importer(815301076,1909f56bfc062723c751e8b465ee728b)  -> (artifact id: '2a488ee9365c7b3810b7919cb441543f') in 0.012883 seconds
  Import took 0.016191 seconds .

========================================================================
Received Import Request.
  Time since last request: 0.000869 seconds.
  path: Assets/ModularRoar/Prefabs/LevelPieces/TriggerExitRoad.prefab
  artifactKey: Guid(b44d6a60253957d41a27946e2830f71a) Importer(815301076,1909f56bfc062723c751e8b465ee728b)
Start importing Assets/ModularRoar/Prefabs/LevelPieces/TriggerExitRoad.prefab using Guid(b44d6a60253957d41a27946e2830f71a) Importer(815301076,1909f56bfc062723c751e8b465ee728b)  -> (artifact id: '2a488ee9365c7b3810b7919cb441543f') in 0.013168 seconds
  Import took 0.017037 seconds .

========================================================================
Received Import Request.
  Time since last request: 0.173236 seconds.
  path: Assets/ModularRoar/Prefabs/LevelPieces/LevelBlock E To North.prefab
  artifactKey: Guid(fef2ca783579a5f46878bd5e8f24c6b1) Importer(815301076,1909f56bfc062723c751e8b465ee728b)
Start importing Assets/ModularRoar/Prefabs/LevelPieces/LevelBlock E To North.prefab using Guid(fef2ca783579a5f46878bd5e8f24c6b1) Importer(815301076,1909f56bfc062723c751e8b465ee728b)  -> (artifact id: '92c01b80bfb765394a6e3a68015c6082') in 0.023019 seconds
  Import took 0.028207 seconds .

========================================================================
Received Import Request.
  Time since last request: 45.295652 seconds.
  path: Assets/ModularRoar/Prefabs/LevelPieces/LevelBlock S To East.prefab
  artifactKey: Guid(96d1c3912701e4847a767b776f19d1e4) Importer(815301076,1909f56bfc062723c751e8b465ee728b)
Start importing Assets/ModularRoar/Prefabs/LevelPieces/LevelBlock S To East.prefab using Guid(96d1c3912701e4847a767b776f19d1e4) Importer(815301076,1909f56bfc062723c751e8b465ee728b)  -> (artifact id: 'd52eebddd828be4eba7915c6fe9d9ec2') in 0.027326 seconds
  Import took 0.031746 seconds .

========================================================================
Received Import Request.
  Time since last request: 2.366436 seconds.
  path: Assets/ModularRoar/Prefabs/LevelPieces/LevelBlock S To East.prefab
  artifactKey: Guid(96d1c3912701e4847a767b776f19d1e4) Importer(815301076,1909f56bfc062723c751e8b465ee728b)
Start importing Assets/ModularRoar/Prefabs/LevelPieces/LevelBlock S To East.prefab using Guid(96d1c3912701e4847a767b776f19d1e4) Importer(815301076,1909f56bfc062723c751e8b465ee728b)  -> (artifact id: '5b8df6a22b53ee540d74e64e3263dfec') in 0.030433 seconds
  Import took 0.035281 seconds .

========================================================================
Received Import Request.
  Time since last request: 2.794232 seconds.
  path: Assets/ModularRoar/Prefabs/LevelPieces/LevelBlock S To East.prefab
  artifactKey: Guid(96d1c3912701e4847a767b776f19d1e4) Importer(815301076,1909f56bfc062723c751e8b465ee728b)
Start importing Assets/ModularRoar/Prefabs/LevelPieces/LevelBlock S To East.prefab using Guid(96d1c3912701e4847a767b776f19d1e4) Importer(815301076,1909f56bfc062723c751e8b465ee728b)  -> (artifact id: '4202aea0c9f48ebfa4dbc5a62b9ea99c') in 0.033231 seconds
  Import took 0.036973 seconds .

========================================================================
Received Import Request.
  Time since last request: 4.826300 seconds.
  path: Assets/ModularRoar/Prefabs/LevelPieces/LevelBlock S To East.prefab
  artifactKey: Guid(96d1c3912701e4847a767b776f19d1e4) Importer(815301076,1909f56bfc062723c751e8b465ee728b)
Start importing Assets/ModularRoar/Prefabs/LevelPieces/LevelBlock S To East.prefab using Guid(96d1c3912701e4847a767b776f19d1e4) Importer(815301076,1909f56bfc062723c751e8b465ee728b)  -> (artifact id: '0bea66adad9341bc10ddea9cdec09ac9') in 0.026875 seconds
  Import took 0.030675 seconds .

========================================================================
Received Import Request.
  Time since last request: 3.194674 seconds.
  path: Assets/ModularRoar/Prefabs/LevelPieces/LevelBlock S To East.prefab
  artifactKey: Guid(96d1c3912701e4847a767b776f19d1e4) Importer(815301076,1909f56bfc062723c751e8b465ee728b)
Start importing Assets/ModularRoar/Prefabs/LevelPieces/LevelBlock S To East.prefab using Guid(96d1c3912701e4847a767b776f19d1e4) Importer(815301076,1909f56bfc062723c751e8b465ee728b)  -> (artifact id: 'e0360cba81d349dfde17d63b514aeeb3') in 0.035009 seconds
  Import took 0.038757 seconds .

========================================================================
Received Import Request.
  Time since last request: 9.020426 seconds.
  path: Assets/ModularRoar/Prefabs/LevelPieces/LevelBlock S To East.prefab
  artifactKey: Guid(96d1c3912701e4847a767b776f19d1e4) Importer(815301076,1909f56bfc062723c751e8b465ee728b)
Start importing Assets/ModularRoar/Prefabs/LevelPieces/LevelBlock S To East.prefab using Guid(96d1c3912701e4847a767b776f19d1e4) Importer(815301076,1909f56bfc062723c751e8b465ee728b)  -> (artifact id: 'a06ff3f0527ea0d7d9b209f596436421') in 0.032375 seconds
  Import took 0.036712 seconds .

========================================================================
Received Import Request.
  Time since last request: 2.572914 seconds.
  path: Assets/ModularRoar/Prefabs/LevelPieces/LevelBlock S To East.prefab
  artifactKey: Guid(96d1c3912701e4847a767b776f19d1e4) Importer(815301076,1909f56bfc062723c751e8b465ee728b)
Start importing Assets/ModularRoar/Prefabs/LevelPieces/LevelBlock S To East.prefab using Guid(96d1c3912701e4847a767b776f19d1e4) Importer(815301076,1909f56bfc062723c751e8b465ee728b)  -> (artifact id: '874311d17a5a36c4de7edb60383e0156') in 0.021240 seconds
  Import took 0.025630 seconds .

========================================================================
Received Import Request.
  Time since last request: 40.394503 seconds.
  path: Assets/ModularRoar/Prefabs/LevelPieces/LevelBlock S To North.prefab
  artifactKey: Guid(61df4719d5c659f4abe752e88c8c6744) Importer(815301076,1909f56bfc062723c751e8b465ee728b)
Start importing Assets/ModularRoar/Prefabs/LevelPieces/LevelBlock S To North.prefab using Guid(61df4719d5c659f4abe752e88c8c6744) Importer(815301076,1909f56bfc062723c751e8b465ee728b)  -> (artifact id: 'd9ae893be6597f6c4cb21e2304c2dc60') in 0.031173 seconds
  Import took 0.034775 seconds .

========================================================================
Received Import Request.
  Time since last request: 7.022115 seconds.
  path: Assets/ModularRoar/Prefabs/LevelPieces/LevelBlock S To North.prefab
  artifactKey: Guid(61df4719d5c659f4abe752e88c8c6744) Importer(815301076,1909f56bfc062723c751e8b465ee728b)
Start importing Assets/ModularRoar/Prefabs/LevelPieces/LevelBlock S To North.prefab using Guid(61df4719d5c659f4abe752e88c8c6744) Importer(815301076,1909f56bfc062723c751e8b465ee728b)  -> (artifact id: 'b48019682fefb31b0e612e3dc1615d92') in 0.034483 seconds
  Import took 0.038003 seconds .

========================================================================
Received Import Request.
  Time since last request: 0.962915 seconds.
  path: Assets/ModularRoar/Prefabs/LevelPieces/LevelBlock S To North.prefab
  artifactKey: Guid(61df4719d5c659f4abe752e88c8c6744) Importer(815301076,1909f56bfc062723c751e8b465ee728b)
Start importing Assets/ModularRoar/Prefabs/LevelPieces/LevelBlock S To North.prefab using Guid(61df4719d5c659f4abe752e88c8c6744) Importer(815301076,1909f56bfc062723c751e8b465ee728b)  -> (artifact id: 'f5f2b0513af751ce5bad971ecb97e4c4') in 0.025892 seconds
  Import took 0.030500 seconds .

========================================================================
Received Import Request.
  Time since last request: 5.622074 seconds.
  path: Assets/ModularRoar/Prefabs/LevelPieces/LevelBlock S To North.prefab
  artifactKey: Guid(61df4719d5c659f4abe752e88c8c6744) Importer(815301076,1909f56bfc062723c751e8b465ee728b)
Start importing Assets/ModularRoar/Prefabs/LevelPieces/LevelBlock S To North.prefab using Guid(61df4719d5c659f4abe752e88c8c6744) Importer(815301076,1909f56bfc062723c751e8b465ee728b)  -> (artifact id: 'bf0350e08f78acc29e0e44c08908153d') in 0.025188 seconds
  Import took 0.029904 seconds .

========================================================================
Received Import Request.
  Time since last request: 0.999551 seconds.
  path: Assets/ModularRoar/Prefabs/LevelPieces/LevelBlock S To North.prefab
  artifactKey: Guid(61df4719d5c659f4abe752e88c8c6744) Importer(815301076,1909f56bfc062723c751e8b465ee728b)
Start importing Assets/ModularRoar/Prefabs/LevelPieces/LevelBlock S To North.prefab using Guid(61df4719d5c659f4abe752e88c8c6744) Importer(815301076,1909f56bfc062723c751e8b465ee728b)  -> (artifact id: 'e27fa2528b9b9795e96cdf4305bd16ab') in 0.023947 seconds
  Import took 0.032415 seconds .

========================================================================
Received Import Request.
  Time since last request: 12.192981 seconds.
  path: Assets/ModularRoar/Prefabs/LevelPieces/LevelBlock S To West.prefab
  artifactKey: Guid(2073cba55421ef04398038331126d497) Importer(815301076,1909f56bfc062723c751e8b465ee728b)
Start importing Assets/ModularRoar/Prefabs/LevelPieces/LevelBlock S To West.prefab using Guid(2073cba55421ef04398038331126d497) Importer(815301076,1909f56bfc062723c751e8b465ee728b)  -> (artifact id: 'c2af7a3b70ed1862b806f1d342be4c1d') in 0.031179 seconds
  Import took 0.035074 seconds .

========================================================================
Received Import Request.
  Time since last request: 5.158511 seconds.
  path: Assets/ModularRoar/Prefabs/LevelPieces/LevelBlock S To West.prefab
  artifactKey: Guid(2073cba55421ef04398038331126d497) Importer(815301076,1909f56bfc062723c751e8b465ee728b)
Start importing Assets/ModularRoar/Prefabs/LevelPieces/LevelBlock S To West.prefab using Guid(2073cba55421ef04398038331126d497) Importer(815301076,1909f56bfc062723c751e8b465ee728b)  -> (artifact id: 'c31907e04badaff1e18a83eb26da07ed') in 0.025577 seconds
  Import took 0.029520 seconds .

========================================================================
Received Import Request.
  Time since last request: 3.744217 seconds.
  path: Assets/ModularRoar/Prefabs/LevelPieces/LevelBlock S To West.prefab
  artifactKey: Guid(2073cba55421ef04398038331126d497) Importer(815301076,1909f56bfc062723c751e8b465ee728b)
Start importing Assets/ModularRoar/Prefabs/LevelPieces/LevelBlock S To West.prefab using Guid(2073cba55421ef04398038331126d497) Importer(815301076,1909f56bfc062723c751e8b465ee728b)  -> (artifact id: 'a1ac784526486384c62400c272efd43e') in 0.031190 seconds
  Import took 0.035025 seconds .

========================================================================
Received Import Request.
  Time since last request: 3.519695 seconds.
  path: Assets/ModularRoar/Prefabs/LevelPieces/LevelBlock S To West.prefab
  artifactKey: Guid(2073cba55421ef04398038331126d497) Importer(815301076,1909f56bfc062723c751e8b465ee728b)
Start importing Assets/ModularRoar/Prefabs/LevelPieces/LevelBlock S To West.prefab using Guid(2073cba55421ef04398038331126d497) Importer(815301076,1909f56bfc062723c751e8b465ee728b)  -> (artifact id: 'b3cbf426b47ef7e2c609174c1e98d158') in 0.022000 seconds
  Import took 0.027106 seconds .

========================================================================
Received Import Request.
  Time since last request: 6.385894 seconds.
  path: Assets/ModularRoar/Prefabs/LevelPieces/LevelBlock S To West.prefab
  artifactKey: Guid(2073cba55421ef04398038331126d497) Importer(815301076,1909f56bfc062723c751e8b465ee728b)
Start importing Assets/ModularRoar/Prefabs/LevelPieces/LevelBlock S To West.prefab using Guid(2073cba55421ef04398038331126d497) Importer(815301076,1909f56bfc062723c751e8b465ee728b)  -> (artifact id: 'e98bfb52416f26899a768e75e8cb77a7') in 0.026863 seconds
  Import took 0.031769 seconds .

========================================================================
Received Import Request.
  Time since last request: 3.132116 seconds.
  path: Assets/ModularRoar/Prefabs/LevelPieces/LevelBlock S To West.prefab
  artifactKey: Guid(2073cba55421ef04398038331126d497) Importer(815301076,1909f56bfc062723c751e8b465ee728b)
Start importing Assets/ModularRoar/Prefabs/LevelPieces/LevelBlock S To West.prefab using Guid(2073cba55421ef04398038331126d497) Importer(815301076,1909f56bfc062723c751e8b465ee728b)  -> (artifact id: 'bd120f9edf49a2a804b660f172e25e9f') in 0.028964 seconds
  Import took 0.032276 seconds .

========================================================================
Received Import Request.
  Time since last request: 6.572322 seconds.
  path: Assets/ModularRoar/Prefabs/LevelPieces/LevelBlock S To West.prefab
  artifactKey: Guid(2073cba55421ef04398038331126d497) Importer(815301076,1909f56bfc062723c751e8b465ee728b)
Start importing Assets/ModularRoar/Prefabs/LevelPieces/LevelBlock S To West.prefab using Guid(2073cba55421ef04398038331126d497) Importer(815301076,1909f56bfc062723c751e8b465ee728b)  -> (artifact id: '065b0ad391a9af7453eb3c2df3d8adee') in 0.030264 seconds
  Import took 0.034929 seconds .

========================================================================
Received Import Request.
  Time since last request: 6.992472 seconds.
  path: Assets/ModularRoar/Prefabs/LevelPieces/LevelBlock S To West.prefab
  artifactKey: Guid(2073cba55421ef04398038331126d497) Importer(815301076,1909f56bfc062723c751e8b465ee728b)
Start importing Assets/ModularRoar/Prefabs/LevelPieces/LevelBlock S To West.prefab using Guid(2073cba55421ef04398038331126d497) Importer(815301076,1909f56bfc062723c751e8b465ee728b)  -> (artifact id: '3336ee7e23cd5d40c1d65738866248f9') in 0.026456 seconds
  Import took 0.030263 seconds .

========================================================================
Received Import Request.
  Time since last request: 2.339503 seconds.
  path: Assets/ModularRoar/Prefabs/LevelPieces/LevelBlock S To West.prefab
  artifactKey: Guid(2073cba55421ef04398038331126d497) Importer(815301076,1909f56bfc062723c751e8b465ee728b)
Start importing Assets/ModularRoar/Prefabs/LevelPieces/LevelBlock S To West.prefab using Guid(2073cba55421ef04398038331126d497) Importer(815301076,1909f56bfc062723c751e8b465ee728b)  -> (artifact id: '1d4b075c8d6d8c287c26967bc2acb545') in 0.025553 seconds
  Import took 0.029940 seconds .

========================================================================
Received Import Request.
  Time since last request: 14.801177 seconds.
  path: Assets/ModularRoar/Prefabs/LevelPieces/LevelBlock W To North.prefab
  artifactKey: Guid(21e152a04432e934daa8a92d3315e925) Importer(815301076,1909f56bfc062723c751e8b465ee728b)
Start importing Assets/ModularRoar/Prefabs/LevelPieces/LevelBlock W To North.prefab using Guid(21e152a04432e934daa8a92d3315e925) Importer(815301076,1909f56bfc062723c751e8b465ee728b)  -> (artifact id: '8427421e03e8d1394343e47f087ebe43') in 0.019656 seconds
  Import took 0.025219 seconds .

========================================================================
Received Import Request.
  Time since last request: 5.661856 seconds.
  path: Assets/ModularRoar/Prefabs/LevelPieces/LevelBlock W To North.prefab
  artifactKey: Guid(21e152a04432e934daa8a92d3315e925) Importer(815301076,1909f56bfc062723c751e8b465ee728b)
Start importing Assets/ModularRoar/Prefabs/LevelPieces/LevelBlock W To North.prefab using Guid(21e152a04432e934daa8a92d3315e925) Importer(815301076,1909f56bfc062723c751e8b465ee728b)  -> (artifact id: 'c55514de783b7d02d8e669094ced68e0') in 0.024923 seconds
  Import took 0.029327 seconds .

========================================================================
Received Import Request.
  Time since last request: 2.383407 seconds.
  path: Assets/ModularRoar/Prefabs/LevelPieces/LevelBlock W To North.prefab
  artifactKey: Guid(21e152a04432e934daa8a92d3315e925) Importer(815301076,1909f56bfc062723c751e8b465ee728b)
Start importing Assets/ModularRoar/Prefabs/LevelPieces/LevelBlock W To North.prefab using Guid(21e152a04432e934daa8a92d3315e925) Importer(815301076,1909f56bfc062723c751e8b465ee728b)  -> (artifact id: '45fe7f0312794b2c833544ebae1b4803') in 0.032736 seconds
  Import took 0.036242 seconds .

========================================================================
Received Import Request.
  Time since last request: 4.199840 seconds.
  path: Assets/ModularRoar/Prefabs/LevelPieces/LevelBlock W To North.prefab
  artifactKey: Guid(21e152a04432e934daa8a92d3315e925) Importer(815301076,1909f56bfc062723c751e8b465ee728b)
Start importing Assets/ModularRoar/Prefabs/LevelPieces/LevelBlock W To North.prefab using Guid(21e152a04432e934daa8a92d3315e925) Importer(815301076,1909f56bfc062723c751e8b465ee728b)  -> (artifact id: '098ba83debfc613803e4244c182ee187') in 0.035336 seconds
  Import took 0.041755 seconds .

========================================================================
Received Import Request.
  Time since last request: 7.837504 seconds.
  path: Assets/ModularRoar/Prefabs/LevelPieces/LevelBlock W To North.prefab
  artifactKey: Guid(21e152a04432e934daa8a92d3315e925) Importer(815301076,1909f56bfc062723c751e8b465ee728b)
Start importing Assets/ModularRoar/Prefabs/LevelPieces/LevelBlock W To North.prefab using Guid(21e152a04432e934daa8a92d3315e925) Importer(815301076,1909f56bfc062723c751e8b465ee728b)  -> (artifact id: 'ba75cd84c4b7097c48377039bc9f4b7e') in 0.024935 seconds
  Import took 0.028406 seconds .

========================================================================
Received Import Request.
  Time since last request: 1.579147 seconds.
  path: Assets/ModularRoar/Prefabs/LevelPieces/LevelBlock W To North.prefab
  artifactKey: Guid(21e152a04432e934daa8a92d3315e925) Importer(815301076,1909f56bfc062723c751e8b465ee728b)
Start importing Assets/ModularRoar/Prefabs/LevelPieces/LevelBlock W To North.prefab using Guid(21e152a04432e934daa8a92d3315e925) Importer(815301076,1909f56bfc062723c751e8b465ee728b)  -> (artifact id: '69450e7f644284cfabbb676ac616f183') in 0.027598 seconds
  Import took 0.034395 seconds .

========================================================================
Received Import Request.
  Time since last request: 80.525780 seconds.
  path: Assets/Scripts/TriggerExitRoad.cs
  artifactKey: Guid(ef5eb83db5495b543b4683d2b9e46925) Importer(815301076,1909f56bfc062723c751e8b465ee728b)
Start importing Assets/Scripts/TriggerExitRoad.cs using Guid(ef5eb83db5495b543b4683d2b9e46925) Importer(815301076,1909f56bfc062723c751e8b465ee728b)  -> (artifact id: 'a1a59e2f35bccaeae8be653459bb1dd9') in 0.006972 seconds
  Import took 0.010188 seconds .

========================================================================
Received Prepare
Registering precompiled user dll's ...
Registered in 0.001353 seconds.
Begin MonoManager ReloadAssembly
Native extension for WindowsStandalone target not found
Refreshing native plugins compatible for Editor in 0.34 ms, found 0 plugins.
Preloading 0 native plugins for Editor in 0.00 ms.
Warning: Annotation not found!
UnityEngine.StackTraceUtility:ExtractStackTrace ()
UnityEditor.ProBuilder.EditorUtility:SetGizmoIconEnabled (System.Type,bool) (at Library/PackageCache/com.unity.probuilder@4.5.0/Editor/EditorCore/EditorUtility.cs:593)
UnityEditor.ProBuilder.HierarchyListener:.cctor () (at Library/PackageCache/com.unity.probuilder@4.5.0/Editor/EditorCore/HierarchyListener.cs:21)
System.Runtime.CompilerServices.RuntimeHelpers:RunClassConstructor (System.RuntimeTypeHandle)
UnityEditor.EditorAssemblies:ProcessInitializeOnLoadAttributes (System.Type[])

[Library/PackageCache/com.unity.probuilder@4.5.0/Editor/EditorCore/EditorUtility.cs line 593]

Mono: successfully reloaded assembly
- Completed reload, in  1.075 seconds
Platform modules already initialized, skipping
Refreshing native plugins compatible for Editor in 0.35 ms, found 0 plugins.
Preloading 0 native plugins for Editor in 0.00 ms.
Unloading 1597 Unused Serialized files (Serialized files now loaded: 0)
System memory in use before: 79.8 MB.
System memory in use after: 79.9 MB.

Unloading 8 unused Assets to reduce memory usage. Loaded Objects now: 2106.
Total: 2.621200 ms (FindLiveObjects: 0.240600 ms CreateObjectMapping: 0.114300 ms MarkObjects: 2.169200 ms  DeleteObjects: 0.095200 ms)

========================================================================
Received Import Request.
  Time since last request: 368.733988 seconds.
  path: Assets/Scripts/TriggerExitRoad.cs
  artifactKey: Guid(ef5eb83db5495b543b4683d2b9e46925) Importer(815301076,1909f56bfc062723c751e8b465ee728b)
Start importing Assets/Scripts/TriggerExitRoad.cs using Guid(ef5eb83db5495b543b4683d2b9e46925) Importer(815301076,1909f56bfc062723c751e8b465ee728b)  -> (artifact id: 'a18774aacd9c0e742f2cf505bdf6274e') in 0.009164 seconds
  Import took 0.012849 seconds .

========================================================================
Received Prepare
Registering precompiled user dll's ...
Registered in 0.001085 seconds.
Begin MonoManager ReloadAssembly
Native extension for WindowsStandalone target not found
Refreshing native plugins compatible for Editor in 0.35 ms, found 0 plugins.
Preloading 0 native plugins for Editor in 0.00 ms.
Warning: Annotation not found!
UnityEngine.StackTraceUtility:ExtractStackTrace ()
UnityEditor.ProBuilder.EditorUtility:SetGizmoIconEnabled (System.Type,bool) (at Library/PackageCache/com.unity.probuilder@4.5.0/Editor/EditorCore/EditorUtility.cs:593)
UnityEditor.ProBuilder.HierarchyListener:.cctor () (at Library/PackageCache/com.unity.probuilder@4.5.0/Editor/EditorCore/HierarchyListener.cs:21)
System.Runtime.CompilerServices.RuntimeHelpers:RunClassConstructor (System.RuntimeTypeHandle)
UnityEditor.EditorAssemblies:ProcessInitializeOnLoadAttributes (System.Type[])

[Library/PackageCache/com.unity.probuilder@4.5.0/Editor/EditorCore/EditorUtility.cs line 593]

Mono: successfully reloaded assembly
- Completed reload, in  0.899 seconds
Platform modules already initialized, skipping
Refreshing native plugins compatible for Editor in 0.38 ms, found 0 plugins.
Preloading 0 native plugins for Editor in 0.00 ms.
Unloading 1597 Unused Serialized files (Serialized files now loaded: 0)
System memory in use before: 79.8 MB.
System memory in use after: 79.9 MB.

Unloading 7 unused Assets to reduce memory usage. Loaded Objects now: 2109.
Total: 2.320500 ms (FindLiveObjects: 0.193500 ms CreateObjectMapping: 0.055400 ms MarkObjects: 1.983400 ms  DeleteObjects: 0.087000 ms)

========================================================================
Received Prepare
Registering precompiled user dll's ...
Registered in 0.001134 seconds.
Begin MonoManager ReloadAssembly
Native extension for WindowsStandalone target not found
Refreshing native plugins compatible for Editor in 0.39 ms, found 0 plugins.
Preloading 0 native plugins for Editor in 0.00 ms.
Warning: Annotation not found!
UnityEngine.StackTraceUtility:ExtractStackTrace ()
UnityEditor.ProBuilder.EditorUtility:SetGizmoIconEnabled (System.Type,bool) (at Library/PackageCache/com.unity.probuilder@4.5.0/Editor/EditorCore/EditorUtility.cs:593)
UnityEditor.ProBuilder.HierarchyListener:.cctor () (at Library/PackageCache/com.unity.probuilder@4.5.0/Editor/EditorCore/HierarchyListener.cs:21)
System.Runtime.CompilerServices.RuntimeHelpers:RunClassConstructor (System.RuntimeTypeHandle)
UnityEditor.EditorAssemblies:ProcessInitializeOnLoadAttributes (System.Type[])

[Library/PackageCache/com.unity.probuilder@4.5.0/Editor/EditorCore/EditorUtility.cs line 593]

Mono: successfully reloaded assembly
- Completed reload, in  1.099 seconds
Platform modules already initialized, skipping
Refreshing native plugins compatible for Editor in 0.34 ms, found 0 plugins.
Preloading 0 native plugins for Editor in 0.00 ms.
Unloading 1597 Unused Serialized files (Serialized files now loaded: 0)
System memory in use before: 79.8 MB.
System memory in use after: 79.9 MB.

Unloading 7 unused Assets to reduce memory usage. Loaded Objects now: 2112.
Total: 2.589900 ms (FindLiveObjects: 0.267100 ms CreateObjectMapping: 0.069600 ms MarkObjects: 2.153300 ms  DeleteObjects: 0.098200 ms)

========================================================================
Received Prepare
Registering precompiled user dll's ...
Registered in 0.001233 seconds.
Begin MonoManager ReloadAssembly
Native extension for WindowsStandalone target not found
Refreshing native plugins compatible for Editor in 0.51 ms, found 0 plugins.
Preloading 0 native plugins for Editor in 0.00 ms.
Warning: Annotation not found!
UnityEngine.StackTraceUtility:ExtractStackTrace ()
UnityEditor.ProBuilder.EditorUtility:SetGizmoIconEnabled (System.Type,bool) (at Library/PackageCache/com.unity.probuilder@4.5.0/Editor/EditorCore/EditorUtility.cs:593)
UnityEditor.ProBuilder.HierarchyListener:.cctor () (at Library/PackageCache/com.unity.probuilder@4.5.0/Editor/EditorCore/HierarchyListener.cs:21)
System.Runtime.CompilerServices.RuntimeHelpers:RunClassConstructor (System.RuntimeTypeHandle)
UnityEditor.EditorAssemblies:ProcessInitializeOnLoadAttributes (System.Type[])

[Library/PackageCache/com.unity.probuilder@4.5.0/Editor/EditorCore/EditorUtility.cs line 593]

Mono: successfully reloaded assembly
- Completed reload, in  1.040 seconds
Platform modules already initialized, skipping
Refreshing native plugins compatible for Editor in 0.36 ms, found 0 plugins.
Preloading 0 native plugins for Editor in 0.00 ms.
Unloading 1597 Unused Serialized files (Serialized files now loaded: 0)
System memory in use before: 79.8 MB.
System memory in use after: 79.9 MB.

Unloading 7 unused Assets to reduce memory usage. Loaded Objects now: 2115.
Total: 2.708300 ms (FindLiveObjects: 0.333500 ms CreateObjectMapping: 0.065000 ms MarkObjects: 2.206800 ms  DeleteObjects: 0.101500 ms)

========================================================================
Received Prepare
Registering precompiled user dll's ...
Registered in 0.001155 seconds.
Begin MonoManager ReloadAssembly
Native extension for WindowsStandalone target not found
Refreshing native plugins compatible for Editor in 0.37 ms, found 0 plugins.
Preloading 0 native plugins for Editor in 0.00 ms.
Warning: Annotation not found!
UnityEngine.StackTraceUtility:ExtractStackTrace ()
UnityEditor.ProBuilder.EditorUtility:SetGizmoIconEnabled (System.Type,bool) (at Library/PackageCache/com.unity.probuilder@4.5.0/Editor/EditorCore/EditorUtility.cs:593)
UnityEditor.ProBuilder.HierarchyListener:.cctor () (at Library/PackageCache/com.unity.probuilder@4.5.0/Editor/EditorCore/HierarchyListener.cs:21)
System.Runtime.CompilerServices.RuntimeHelpers:RunClassConstructor (System.RuntimeTypeHandle)
UnityEditor.EditorAssemblies:ProcessInitializeOnLoadAttributes (System.Type[])

[Library/PackageCache/com.unity.probuilder@4.5.0/Editor/EditorCore/EditorUtility.cs line 593]

Mono: successfully reloaded assembly
- Completed reload, in  1.010 seconds
Platform modules already initialized, skipping
Refreshing native plugins compatible for Editor in 0.38 ms, found 0 plugins.
Preloading 0 native plugins for Editor in 0.00 ms.
Unloading 1597 Unused Serialized files (Serialized files now loaded: 0)
System memory in use before: 79.8 MB.
System memory in use after: 79.9 MB.

Unloading 7 unused Assets to reduce memory usage. Loaded Objects now: 2118.
Total: 2.880500 ms (FindLiveObjects: 0.216300 ms CreateObjectMapping: 0.110800 ms MarkObjects: 2.451300 ms  DeleteObjects: 0.100700 ms)

========================================================================
Received Prepare
Registering precompiled user dll's ...
Registered in 0.001123 seconds.
Begin MonoManager ReloadAssembly
Native extension for WindowsStandalone target not found
Refreshing native plugins compatible for Editor in 0.37 ms, found 0 plugins.
Preloading 0 native plugins for Editor in 0.00 ms.
Warning: Annotation not found!
UnityEngine.StackTraceUtility:ExtractStackTrace ()
UnityEditor.ProBuilder.EditorUtility:SetGizmoIconEnabled (System.Type,bool) (at Library/PackageCache/com.unity.probuilder@4.5.0/Editor/EditorCore/EditorUtility.cs:593)
UnityEditor.ProBuilder.HierarchyListener:.cctor () (at Library/PackageCache/com.unity.probuilder@4.5.0/Editor/EditorCore/HierarchyListener.cs:21)
System.Runtime.CompilerServices.RuntimeHelpers:RunClassConstructor (System.RuntimeTypeHandle)
UnityEditor.EditorAssemblies:ProcessInitializeOnLoadAttributes (System.Type[])

[Library/PackageCache/com.unity.probuilder@4.5.0/Editor/EditorCore/EditorUtility.cs line 593]

Mono: successfully reloaded assembly
- Completed reload, in  1.244 seconds
Platform modules already initialized, skipping
Refreshing native plugins compatible for Editor in 0.34 ms, found 0 plugins.
Preloading 0 native plugins for Editor in 0.00 ms.
Unloading 1597 Unused Serialized files (Serialized files now loaded: 0)
System memory in use before: 79.8 MB.
System memory in use after: 79.9 MB.

Unloading 7 unused Assets to reduce memory usage. Loaded Objects now: 2121.
Total: 2.736100 ms (FindLiveObjects: 0.289300 ms CreateObjectMapping: 0.064000 ms MarkObjects: 2.254900 ms  DeleteObjects: 0.107300 ms)

========================================================================
Received Prepare
Registering precompiled user dll's ...
Registered in 0.001158 seconds.
Begin MonoManager ReloadAssembly
Native extension for WindowsStandalone target not found
Refreshing native plugins compatible for Editor in 0.90 ms, found 0 plugins.
Preloading 0 native plugins for Editor in 0.00 ms.
Warning: Annotation not found!
UnityEngine.StackTraceUtility:ExtractStackTrace ()
UnityEditor.ProBuilder.EditorUtility:SetGizmoIconEnabled (System.Type,bool) (at Library/PackageCache/com.unity.probuilder@4.5.0/Editor/EditorCore/EditorUtility.cs:593)
UnityEditor.ProBuilder.HierarchyListener:.cctor () (at Library/PackageCache/com.unity.probuilder@4.5.0/Editor/EditorCore/HierarchyListener.cs:21)
System.Runtime.CompilerServices.RuntimeHelpers:RunClassConstructor (System.RuntimeTypeHandle)
UnityEditor.EditorAssemblies:ProcessInitializeOnLoadAttributes (System.Type[])

[Library/PackageCache/com.unity.probuilder@4.5.0/Editor/EditorCore/EditorUtility.cs line 593]

Mono: successfully reloaded assembly
- Completed reload, in  1.095 seconds
Platform modules already initialized, skipping
Refreshing native plugins compatible for Editor in 0.35 ms, found 0 plugins.
Preloading 0 native plugins for Editor in 0.00 ms.
Unloading 1597 Unused Serialized files (Serialized files now loaded: 0)
System memory in use before: 79.9 MB.
System memory in use after: 79.9 MB.

Unloading 7 unused Assets to reduce memory usage. Loaded Objects now: 2124.
Total: 2.140500 ms (FindLiveObjects: 0.218100 ms CreateObjectMapping: 0.054000 ms MarkObjects: 1.772800 ms  DeleteObjects: 0.094100 ms)

========================================================================
Received Prepare
Registering precompiled user dll's ...
Registered in 0.001174 seconds.
Begin MonoManager ReloadAssembly
Native extension for WindowsStandalone target not found
Refreshing native plugins compatible for Editor in 0.36 ms, found 0 plugins.
Preloading 0 native plugins for Editor in 0.00 ms.
Warning: Annotation not found!
UnityEngine.StackTraceUtility:ExtractStackTrace ()
UnityEditor.ProBuilder.EditorUtility:SetGizmoIconEnabled (System.Type,bool) (at Library/PackageCache/com.unity.probuilder@4.5.0/Editor/EditorCore/EditorUtility.cs:593)
UnityEditor.ProBuilder.HierarchyListener:.cctor () (at Library/PackageCache/com.unity.probuilder@4.5.0/Editor/EditorCore/HierarchyListener.cs:21)
System.Runtime.CompilerServices.RuntimeHelpers:RunClassConstructor (System.RuntimeTypeHandle)
UnityEditor.EditorAssemblies:ProcessInitializeOnLoadAttributes (System.Type[])

[Library/PackageCache/com.unity.probuilder@4.5.0/Editor/EditorCore/EditorUtility.cs line 593]

Mono: successfully reloaded assembly
- Completed reload, in  0.891 seconds
Platform modules already initialized, skipping
Refreshing native plugins compatible for Editor in 0.37 ms, found 0 plugins.
Preloading 0 native plugins for Editor in 0.00 ms.
Unloading 1597 Unused Serialized files (Serialized files now loaded: 0)
System memory in use before: 79.9 MB.
System memory in use after: 79.9 MB.

Unloading 7 unused Assets to reduce memory usage. Loaded Objects now: 2127.
Total: 2.313500 ms (FindLiveObjects: 0.177900 ms CreateObjectMapping: 0.054800 ms MarkObjects: 1.981600 ms  DeleteObjects: 0.098000 ms)

========================================================================
Received Prepare
Registering precompiled user dll's ...
Registered in 0.001780 seconds.
Begin MonoManager ReloadAssembly
Native extension for WindowsStandalone target not found
Refreshing native plugins compatible for Editor in 0.35 ms, found 0 plugins.
Preloading 0 native plugins for Editor in 0.00 ms.
Warning: Annotation not found!
UnityEngine.StackTraceUtility:ExtractStackTrace ()
UnityEditor.ProBuilder.EditorUtility:SetGizmoIconEnabled (System.Type,bool) (at Library/PackageCache/com.unity.probuilder@4.5.0/Editor/EditorCore/EditorUtility.cs:593)
UnityEditor.ProBuilder.HierarchyListener:.cctor () (at Library/PackageCache/com.unity.probuilder@4.5.0/Editor/EditorCore/HierarchyListener.cs:21)
System.Runtime.CompilerServices.RuntimeHelpers:RunClassConstructor (System.RuntimeTypeHandle)
UnityEditor.EditorAssemblies:ProcessInitializeOnLoadAttributes (System.Type[])

[Library/PackageCache/com.unity.probuilder@4.5.0/Editor/EditorCore/EditorUtility.cs line 593]

Mono: successfully reloaded assembly
- Completed reload, in  0.950 seconds
Platform modules already initialized, skipping
Refreshing native plugins compatible for Editor in 0.36 ms, found 0 plugins.
Preloading 0 native plugins for Editor in 0.00 ms.
Unloading 1597 Unused Serialized files (Serialized files now loaded: 0)
System memory in use before: 79.9 MB.
System memory in use after: 79.9 MB.

Unloading 7 unused Assets to reduce memory usage. Loaded Objects now: 2130.
Total: 2.289100 ms (FindLiveObjects: 0.174400 ms CreateObjectMapping: 0.052900 ms MarkObjects: 1.971000 ms  DeleteObjects: 0.089100 ms)

========================================================================
Received Prepare
Registering precompiled user dll's ...
Registered in 0.002021 seconds.
Begin MonoManager ReloadAssembly
Native extension for WindowsStandalone target not found
Refreshing native plugins compatible for Editor in 0.34 ms, found 0 plugins.
Preloading 0 native plugins for Editor in 0.00 ms.
Warning: Annotation not found!
UnityEngine.StackTraceUtility:ExtractStackTrace ()
UnityEditor.ProBuilder.EditorUtility:SetGizmoIconEnabled (System.Type,bool) (at Library/PackageCache/com.unity.probuilder@4.5.0/Editor/EditorCore/EditorUtility.cs:593)
UnityEditor.ProBuilder.HierarchyListener:.cctor () (at Library/PackageCache/com.unity.probuilder@4.5.0/Editor/EditorCore/HierarchyListener.cs:21)
System.Runtime.CompilerServices.RuntimeHelpers:RunClassConstructor (System.RuntimeTypeHandle)
UnityEditor.EditorAssemblies:ProcessInitializeOnLoadAttributes (System.Type[])

[Library/PackageCache/com.unity.probuilder@4.5.0/Editor/EditorCore/EditorUtility.cs line 593]

Mono: successfully reloaded assembly
- Completed reload, in  1.085 seconds
Platform modules already initialized, skipping
Refreshing native plugins compatible for Editor in 0.69 ms, found 0 plugins.
Preloading 0 native plugins for Editor in 0.00 ms.
Unloading 1597 Unused Serialized files (Serialized files now loaded: 0)
System memory in use before: 79.9 MB.
System memory in use after: 79.9 MB.

Unloading 7 unused Assets to reduce memory usage. Loaded Objects now: 2133.
Total: 2.755800 ms (FindLiveObjects: 0.269200 ms CreateObjectMapping: 0.062700 ms MarkObjects: 2.329800 ms  DeleteObjects: 0.093000 ms)

AssetImportWorkerClient::OnTransportError - code=2 error=End of file
