%YAML 1.1
%TAG !u! tag:unity3d.com,2011:
--- !u!221 &22100000
AnimatorOverrideController:
  m_ObjectHideFlags: 0
  m_CorrespondingSourceObject: {fileID: 0}
  m_PrefabInstance: {fileID: 0}
  m_PrefabAsset: {fileID: 0}
  m_Name: MagueAnimatorController
  m_Controller: {fileID: 9100000, guid: b5667e20e571cc6489a680e474bede49, type: 2}
  m_Clips:
  - m_OriginalClip: {fileID: -203655887218126122, guid: f497e1db731619b4d95fb28b2afddc34, type: 3}
    m_OverrideClip: {fileID: -203655887218126122, guid: c37890a00ed54184889cc7ca92fa3fd4, type: 3}
  - m_OriginalClip: {fileID: -203655887218126122, guid: 5137caf7b4cb49945947e9e740fbc27f, type: 3}
    m_OverrideClip: {fileID: -203655887218126122, guid: 0b0d256482d1aec49af64af6865abc42, type: 3}
  - m_OriginalClip: {fileID: -203655887218126122, guid: a1b60a573e4491a4db0f156ba9902c7d, type: 3}
    m_OverrideClip: {fileID: -203655887218126122, guid: b26473be21350934bbc92322fdcc3ec2, type: 3}
  - m_OriginalClip: {fileID: -203655887218126122, guid: 3c75ffbadb9cd534d8dace25ebc26549, type: 3}
    m_OverrideClip: {fileID: -203655887218126122, guid: c9c144a30ab2a074196de6a13ead7a74, type: 3}
  - m_OriginalClip: {fileID: -203655887218126122, guid: c313ede7eb2e92a45b7809aea5063edd, type: 3}
    m_OverrideClip: {fileID: -203655887218126122, guid: 1416df227b1a58d4ab4741f7bb12f71e, type: 3}
  - m_OriginalClip: {fileID: -203655887218126122, guid: d06f4024aecb9ad4cb95194695c617e5, type: 3}
    m_OverrideClip: {fileID: -203655887218126122, guid: 4cbf66a7158f5ba4881c868e80129eae, type: 3}
