%YAML 1.1
%TAG !u! tag:unity3d.com,2011:
--- !u!114 &11400000
MonoBehaviour:
  m_ObjectHideFlags: 0
  m_CorrespondingSourceObject: {fileID: 0}
  m_PrefabInstance: {fileID: 0}
  m_PrefabAsset: {fileID: 0}
  m_GameObject: {fileID: 0}
  m_Enabled: 1
  m_EditorHideFlags: 0
  m_Script: {fileID: 11500000, guid: 3f5e728f7b50a7e448a94ff9e9e6ac4c, type: 3}
  m_Name: Fireball
  m_EditorClassIdentifier: 
  itemName: Fireball
  itemGO: {fileID: 6605051574096372952, guid: cae7a26953e4cfa4f9220b5106ecbac5, type: 3}
  itemIcon: {fileID: 0}
  minDamage: 10
  maxDamage: 50
