[
  {
    "id": 0,
    "name": "Coca Cola",
    "description": "Coca‑Cola har en lång historia och har varit en uppskattad dryck hos folk världen över sedan den skapades år 1886 av apotekaren Dr. John Pemberton i Atlanta, USA. Sedan dess har drycken sålts som en törstsläckare för alla och 98 procent av jordens befolkning känner till varumärket. Coca‑Cola finns idag i drygt 200 länder och lanserades i Sverige 1953.",
    "background": "linear-gradient(-120deg, #710a0d, #ed1c23)",
    "color": "white",
    "variations": [
      {
        "id": 0,
        "title": "Original Taste",
        "color": "none",
        "description": "Kolsyrad läskedryck Coca-Cola Original Taste är världens mest välkända och älskade läskedryck. Serveras väl kyld för maximal njutning. I Sverige produceras Coca-Cola i en fabrik i Jordbro utanför Stockholm.",
        "energi": "180 kJ / 42 kcal",
        "fat": "0g",
        "saturatedFat": "0g",
        "carbohydrate": "10.6g",
        "sugars": "10.6g",
        "protein": "0g",
        "sodium": "0g",
        "ingredients": "Kolsyrat vatten, socker, färgämne (sockerkulör E150d), surhetsreglerande medel (E338), naturliga aromer (inkl. koffein)."
      },
      {
        "id": 1,
        "title": "Cherry",
        "color": "#cb0f6e",
        "description": "Kolsyrad läskedryck med körsbärssmak 2012 lanserades åter den populära smaken Coca-Cola Cherry i Sverige som inte funnits sedan det glada 80-talet. Coca-Cola Cherry är en Coca-Cola med smak av körsbär som älskas av många runt om i världen.",
        "energi": "182 kJ / 43 kcal",
        "fat": "0g",
        "saturatedFat": "0g",
        "carbohydrate": "10.7g",
        "sugars": "10.7g",
        "protein": "0g",
        "sodium": "0g",
        "ingredients": "Kolsyrat vatten, socker, färgämne (E150d), surhetsreglerande medel (E338), naturliga aromer (inkl. koffein)."
      },
      {
        "id": 2,
        "title": "Vanilla",
        "color": "#e5d194",
        "description": "Kolsyrad läskedryck med vaniljsmak I februari 2013 lanserades den av många uppskattade smaken Coca-Cola Vanilla i Sverige. En smaksatt Coca-Cola med vanilj testades första gången 1982 på en mässa i Knoxville, Tennessee, men det var först 2002 som produkten lanserades i olika delar av världen i full skala.",
        "energi": "181 kJ / 43 kcal",
        "fat": "0g",
        "saturatedFat": "0g",
        "carbohydrate": "10.6g",
        "sugars": "10.6g",
        "protein": "0g",
        "sodium": "0g",
        "ingredients": "Kolsyrat vatten, socker, färgämne (E150d), surhetsreglerande medel (E338), naturliga aromer (inkl. koffein)."
      },
      {
        "id": 3,
        "title": "Lemon",
        "color": "#f5df34",
        "description": "Kolsyrad läskedryck med citronsmak Många tycker om sin Coca-Cola tillsammans med en skiva citron för en extra frisk smakupplevelse. År 2019 lanserades smaken Coca-Cola Lemon i Sverige. Coca-Cola med citronsmak är nu tilgänglig båda med eller utan socker. Coca-Cola citron är en Coca-Cola med smak av citron som älskas av många runt om i världen.",
        "energi": "182 kJ / 43 kcal",
        "fat": "0g",
        "saturatedFat": "0g",
        "carbohydrate": "10.6g",
        "sugars": "10.6g",
        "protein": "0g",
        "sodium": "0g",
        "ingredients": "Kolsyrat vatten, socker, färgämne (E150d), surhetsreglerande medel (E334, E338), naturliga aromer (inkl. koffein)."
      }
    ]
  },
  {
    "id": 1,
    "name": "Sockerfri",
    "description": "Coca‑Cola light lanserades i Sverige år 1983 och blev då den första Coca‑Cola varianten sen 1886. Coca‑Cola light är en sockerfri och kalorifri läsk. Produkten är framtagen för att passa de som tycker om en riktigt god dryck men som vill ha den utan tillsatt socker. För att förtydliga den lättare colasmaken heter Coca‑Cola light från och med hösten 2018 Coca‑Cola light taste.",
    "background": "linear-gradient(-120deg, #eeeef0, #b7b8bd)",
    "color": "black",
    "variations": [
      {
        "id": 0,
        "title": "Light Taste",
        "color": "none",
        "description": "Kolsyrad läskedryck. Innehåller sötningsmedel. Coca-Cola light taste innehåller mindre än 1 kcal per 330 ml burk och har en uppfriskande smak.",
        "energi": "0.9 kJ / 0.2 kcal",
        "fat": "0g",
        "saturatedFat": "0g",
        "carbohydrate": "0g",
        "sugars": "0g",
        "protein": "0g",
        "sodium": "0g",
        "ingredients": "Kolsyrat vatten, färgämne (E150d), surhetsreglerande medel (E338, E331), sötningsmedel (aspartam, acesulfam K), naturliga aromer (inkl. koffein). Innehåller en källa till fenylalanin."
      }
    ]
  },
  {
    "id": 2,
    "name": "Zero",
    "description": "Coca‑Cola Zero introducerades runtom i världen under 2006 och blev snabbt den största sockerfria drycken på marknaden. I april 2007 lanserades Coca‑Cola zero sugar med ett nytt recept för att vara så lik Coca‑Cola Original Taste som möjligt. Tanken är att erbjuda konsumenter möjligheten att välja Coca‑Cola, med eller utan socker.",
    "background": "black",
    "color": "white",
    "variations": [
      {
        "id": 0,
        "title": "Zero Sugar",
        "color": "none",
        "description": "Kolsyrad läskedryck. Innehåller sötningsmedel.Coca-Cola Zero Sugar är Coca-Cola utan varken socker eller kalorier. Innehåller sötningsmedel.",
        "energi": "1.4 kJ / 0.3 kcal",
        "fat": "0g",
        "saturatedFat": "0g",
        "carbohydrate": "0g",
        "sugars": "0g",
        "protein": "0g",
        "sodium": "0.02g",
        "ingredients": "Kolsyrat vatten, färgämne (E150d), surhetsreglerande medel (E338, E331), sötningsmedel (aspartam, acesulfam K), naturliga aromer (inkl. koffein). Innehåller en källa till fenylalanin."
      },
      {
        "id": 1,
        "title": "Zero Vanilla",
        "color": "#e5d194",
        "description": "Kolsyrad läskedryck med vaniljsmak. Innehåller sötningsmedel.Coca-Cola Zero Sugar Vanilla är en ny smak inom Coca-Cola Zero Sugar familjen som lanserades hösten 2017 i Sverige. Coca-Cola Zero Sugar Vanilla utan socker är perfekt för personer som vill ha den goda Coca-Cola smaken med en twist av vanilj samtidigt som den är utan socker och kalorier.",
        "energi": "1.3 kJ / 0.3 kcal",
        "fat": "0g",
        "saturatedFat": "0g",
        "carbohydrate": "0g",
        "sugars": "0g",
        "protein": "0g",
        "sodium": "0.01g",
        "ingredients": "Kolsyrat vatten, färgämne (E150d), surhetsreglerande medel (E338, E331), sötningsmedel (aspartam, acesulfam K), naturliga aromer (inkl. koffein). Innehåller en källa till fenylalanin."
      },
      {
        "id": 2,
        "title": "Zero Raspberry",
        "color": "#e5afc7",
        "description": "Kolsyrad läskedryck med hallonsmak. Innehåller sötningsmedel. I slutet av 2019 kom Coca-Cola Zero Sugar Raspberry till Sverige. Det är en välbalanserad dryck av den omtyckta och unika smaken av Coca-Cola i kombination med en sötsyrlig smak av hallon.",
        "energi": "1.8 kJ / 0.4 kcal",
        "fat": "0g",
        "saturatedFat": "0g",
        "carbohydrate": "0g",
        "sugars": "0g",
        "protein": "0g",
        "sodium": "0.01g",
        "ingredients": "Kolsyrat vatten, färgämne (E150d), surhetsreglerande medel (E338, E331), naturliga aromer (inkl koffein), sötningsmedel (aspartam, acesulfam K). Innehåller en källa till fenylalanin."
      }
    ]
  },
  {
    "id": 3,
    "name": "Energy",
    "description": "2019 lanserades Coca‑Cola Energy - en energidryck med en smak av Coca‑Cola. Drycken innehåller koffein från naturliga källor, guarana-extrakt samt vitamin B och är fri från taurin. Produkten kommer i två varianter, en med socker och en sockerfri.",
    "background": "repeating-radial-gradient(circle, rgb(237, 28, 35), rgb(113, 10, 13) 1px)",
    "color": "white",
    "variations": [
      {
        "id": 0,
        "title": "Energy Original",
        "color": "none",
        "description": "Energidryck med koffein, guaranaextrakt och vitamin B. Energidryck från Coca-Cola. Innehåller inte taurin. Drick måttligt. Hög koffeinhalt. Rekommenderas ej för barn och gravida eller ammande kvinnor (32 mg koeffein/ 100 ml).",
        "energi": "179kJ / 42kcal",
        "fat": "0g",
        "saturatedFat": "0g",
        "carbohydrate": "10.4g",
        "sugars": "10.4g",
        "protein": "0g",
        "sodium": "0g",
        "ingredients": "Kolsyrat vatten, socker, glukos, färgämne (E150d), surhetsreglerande medel (fosforsyra), koffein (0.03%), konserveringsmedel (natriumbensoat, kaliumsorbat), naturliga aromer, vitaminer (niacin, vitamin B6), guaranaextrakt (0.001%)."
      },
      {
        "id": 1,
        "title": "Energy Sockerfri",
        "color": "none",
        "description": "Energidryck med koffein, guaranaextrakt och vitamin B. Innehåller sötningsmedel.Sockerfri energidryck från Coca-Cola. Innehåller inte taurin. Drick måttligt. Hög koffeinhalt. Rekommenderas ej för barn och gravida eller ammande kvinnor (32 mg koeffein/ 100 ml).",
        "energi": "1.9kJ / 0.4kcal",
        "fat": "0g",
        "saturatedFat": "0g",
        "carbohydrate": "10.4g",
        "sugars": "10.4g",
        "protein": "0g",
        "sodium": "0g",
        "ingredients": "Kolsyrat vatten, färgämne (E150d), surhetsreglerande medel (fosforsyra), sötningsmedel (acesulfam K, sukralos), koffein (0.03%), konserveringsmedel (natriumbensoat, kaliumsorbat), naturliga aromer, vitaminer (niacin, vitamin B6), guaranaextrakt (0.001%). "
      }
    ]
  },
  {
    "id": 4,
    "name": "Signature Mixers",
    "description": "2019 lanserades Coca‑Cola Signature Mixers – en produktserie i fyra olika varianter som är utvecklade för att blanda drinkar med eller bara drickas som de är. Serien är omsorgsfullt framtagen tillsammans med världsledande bartenders och finns på utvalda barer och restauranger i Sverige.",
    "background": "linear-gradient(to left, #241100, #de6700 50%, #de6700 50%, #241100 100%)",
    "color": "white",
    "variations": [
      {
        "id": 0,
        "title": "Smoky",
        "color": "#844a48",
        "description": "Kolsyrad dryck med toner av ylang-ylang, ambrettefrö, perubalsam, ekextrakt, guaiacträ. Coca-Cola Signature Mixers Smoky Notes erbjuder en intensivt aromatisk blandning med rökta toner som gifter sig väl och ger en nyanserad dimension till djup, kryddig rom och premium whisky. Ylang-ylang och ambrettfrö balanseras med en bas av varma kryddor. Smoky Notes är även god att avnjuta som den är.",
        "energi": "182 kJ / 43 kcal",
        "fat": "0g",
        "saturatedFat": "0g",
        "carbohydrate": "10.6g",
        "sugars": "10.6g",
        "protein": "0g",
        "sodium": "0g",
        "ingredients": "Kolsyrat vatten, socker, färgämne (E150d), surhetsreglerande medel (E338), naturliga aromer (inkl. koffein)."
      },
      {
        "id": 1,
        "title": "Spicy",
        "color": "#d14c57",
        "description": "Kolsyrad dryck med toner av lime, ingefära, rosmarin, jasmin, jalapeno. Coca-Cola Signature Mixers Spicy Notes är en sofistikerad och komplex blandning. Lime, ingefära, kryddig jalapeno, rosmarin och aromatisk jasmin gifter sig för att skapa en mixer balanserad av zest och jordiga smaker att blandas med kryddig rom, lagrad tequila och kryddig eller sötaktig whisky. Spicy Notes är även god att avnjuta som den är.",
        "energi": "182 kJ / 43 kcal",
        "fat": "0g",
        "saturatedFat": "0g",
        "carbohydrate": "10.6g",
        "sugars": "10.6g",
        "protein": "0g",
        "sodium": "0g",
        "ingredients": "Kolsyrat vatten, socker, färgämne (E150d), surhetsreglerande medel (E338, E330), naturliga aromer (inkl. koffein)."
      },
      {
        "id": 2,
        "title": "Herbal",
        "color": "#01a986",
        "description": "Kolsyrad dryck med toner av humle, dillfrö, tagetes, citrongräs. Coca-Cola Signature Mixers Herbal Notes är en härlig blommig, krispig och syrlig mixer som utvecklats för att erbjuda fräscha och örtiga toner för en kräsen smakpalett. Genom dess balanserade noter av citrongräs och jordiga toner av dillfrö och tagetes är det en tilltalande mixer med en uppfriskande, enkel profil som gifter sig vackert med whiskies och de flesta typerna av rom. Herbal Notes är även god att avnjuta som den är.",
        "energi": "182 kJ / 43 kcal",
        "fat": "0g",
        "saturatedFat": "0g",
        "carbohydrate": "10.6g",
        "sugars": "10.6g",
        "protein": "0g",
        "sodium": "0g",
        "ingredients": "Kolsyrat vatten, socker, färgämne (E150d), surhetsreglerande medel (E338), naturliga aromer (inkl. koffein)."
      },
      {
        "id": 3,
        "title": "Woody",
        "color": "#c47a61",
        "description": "Kolsyrad dryck med toner av patchouli, copaibabalsam, basilika, vetiver, yuzu. Framtagen från en blandning av jordig patchouli, citrusig yuzu och aromatisk basilika har Coca-Cola Signature Mixers Woody Notes en syrlig, lätt och uppfriskande profil med en hint av värme. Den är uppbyggd för att förstärka upplevelsen av fylligt trä och de mer söta tropiska smakerna som finns i gyllene rom och träiga whiskies. Woody Notes är även god att avnjuta som den är.",
        "energi": "182 kJ / 43 kcal",
        "fat": "0g",
        "saturatedFat": "0g",
        "carbohydrate": "10.6g",
        "sugars": "10.6g",
        "protein": "0g",
        "sodium": "0g",
        "ingredients": "Kolsyrat vatten, socker, färgämne (E150d), surhetsreglerande medel (E338, E330), naturliga aromer (inkl. koffein)."
      }
    ]
  }
]