[
    {
        "id": 0,
        "text": "The only way to do great work is to love what you do.",
        "quoter": "- Steve Jobs"
    },
    {
        "id": 1,
        "text": "I can accept failure, everyone fails at something. But I can't accept not trying.",
        "quoter": "– Michael Jordan"
    },
    {
        "id": 2,
        "text": "If you want something you've never had, you must be willing to do something you've never done.",
        "quoter": "- Unknown"
    },
    {
        "id": 3,
        "text": "If you can dream it, you can do it.",
        "quoter": "– Walt Disney"
    }
]