net\people\demo\controller\PersonRepository.class
net\people\demo\controller\PeopleController.class
net\people\demo\DemoApplication.class
net\people\demo\controller\PersonDTO.class
net\people\demo\controller\PersonServiceImpl.class
net\people\demo\controller\LoadDatabase.class
net\people\demo\controller\PersonService.class
net\people\demo\controller\Person.class
