%YAML 1.1
%TAG !u! tag:unity3d.com,2011:
--- !u!1001 &6225479546915921026
PrefabInstance:
  m_ObjectHideFlags: 0
  serializedVersion: 2
  m_Modification:
    m_TransformParent: {fileID: 1709371865068281387}
    m_Modifications:
    - target: {fileID: 100000, guid: d3c4cdfa4e91f2d49b48fffd1311322d, type: 3}
      propertyPath: m_Layer
      value: 9
      objectReference: {fileID: 0}
    - target: {fileID: 100002, guid: d3c4cdfa4e91f2d49b48fffd1311322d, type: 3}
      propertyPath: m_Layer
      value: 9
      objectReference: {fileID: 0}
    - target: {fileID: 100004, guid: d3c4cdfa4e91f2d49b48fffd1311322d, type: 3}
      propertyPath: m_Layer
      value: 9
      objectReference: {fileID: 0}
    - target: {fileID: 100006, guid: d3c4cdfa4e91f2d49b48fffd1311322d, type: 3}
      propertyPath: m_Layer
      value: 9
      objectReference: {fileID: 0}
    - target: {fileID: 100008, guid: d3c4cdfa4e91f2d49b48fffd1311322d, type: 3}
      propertyPath: m_Layer
      value: 9
      objectReference: {fileID: 0}
    - target: {fileID: 100010, guid: d3c4cdfa4e91f2d49b48fffd1311322d, type: 3}
      propertyPath: m_Layer
      value: 9
      objectReference: {fileID: 0}
    - target: {fileID: 100012, guid: d3c4cdfa4e91f2d49b48fffd1311322d, type: 3}
      propertyPath: m_Layer
      value: 9
      objectReference: {fileID: 0}
    - target: {fileID: 100014, guid: d3c4cdfa4e91f2d49b48fffd1311322d, type: 3}
      propertyPath: m_Layer
      value: 9
      objectReference: {fileID: 0}
    - target: {fileID: 100016, guid: d3c4cdfa4e91f2d49b48fffd1311322d, type: 3}
      propertyPath: m_Layer
      value: 9
      objectReference: {fileID: 0}
    - target: {fileID: 100018, guid: d3c4cdfa4e91f2d49b48fffd1311322d, type: 3}
      propertyPath: m_Layer
      value: 9
      objectReference: {fileID: 0}
    - target: {fileID: 100020, guid: d3c4cdfa4e91f2d49b48fffd1311322d, type: 3}
      propertyPath: m_Layer
      value: 9
      objectReference: {fileID: 0}
    - target: {fileID: 100022, guid: d3c4cdfa4e91f2d49b48fffd1311322d, type: 3}
      propertyPath: m_Layer
      value: 9
      objectReference: {fileID: 0}
    - target: {fileID: 100024, guid: d3c4cdfa4e91f2d49b48fffd1311322d, type: 3}
      propertyPath: m_Layer
      value: 9
      objectReference: {fileID: 0}
    - target: {fileID: 100026, guid: d3c4cdfa4e91f2d49b48fffd1311322d, type: 3}
      propertyPath: m_Layer
      value: 9
      objectReference: {fileID: 0}
    - target: {fileID: 100028, guid: d3c4cdfa4e91f2d49b48fffd1311322d, type: 3}
      propertyPath: m_Layer
      value: 9
      objectReference: {fileID: 0}
    - target: {fileID: 100030, guid: d3c4cdfa4e91f2d49b48fffd1311322d, type: 3}
      propertyPath: m_Layer
      value: 9
      objectReference: {fileID: 0}
    - target: {fileID: 100032, guid: d3c4cdfa4e91f2d49b48fffd1311322d, type: 3}
      propertyPath: m_Layer
      value: 9
      objectReference: {fileID: 0}
    - target: {fileID: 100034, guid: d3c4cdfa4e91f2d49b48fffd1311322d, type: 3}
      propertyPath: m_Layer
      value: 9
      objectReference: {fileID: 0}
    - target: {fileID: 100036, guid: d3c4cdfa4e91f2d49b48fffd1311322d, type: 3}
      propertyPath: m_Layer
      value: 9
      objectReference: {fileID: 0}
    - target: {fileID: 100038, guid: d3c4cdfa4e91f2d49b48fffd1311322d, type: 3}
      propertyPath: m_Layer
      value: 9
      objectReference: {fileID: 0}
    - target: {fileID: 100040, guid: d3c4cdfa4e91f2d49b48fffd1311322d, type: 3}
      propertyPath: m_Layer
      value: 9
      objectReference: {fileID: 0}
    - target: {fileID: 100042, guid: d3c4cdfa4e91f2d49b48fffd1311322d, type: 3}
      propertyPath: m_Name
      value: skeleton_warrior_red
      objectReference: {fileID: 0}
    - target: {fileID: 100042, guid: d3c4cdfa4e91f2d49b48fffd1311322d, type: 3}
      propertyPath: m_Layer
      value: 9
      objectReference: {fileID: 0}
    - target: {fileID: 100044, guid: d3c4cdfa4e91f2d49b48fffd1311322d, type: 3}
      propertyPath: m_Layer
      value: 9
      objectReference: {fileID: 0}
    - target: {fileID: 100046, guid: d3c4cdfa4e91f2d49b48fffd1311322d, type: 3}
      propertyPath: m_Layer
      value: 9
      objectReference: {fileID: 0}
    - target: {fileID: 100048, guid: d3c4cdfa4e91f2d49b48fffd1311322d, type: 3}
      propertyPath: m_Layer
      value: 9
      objectReference: {fileID: 0}
    - target: {fileID: 100050, guid: d3c4cdfa4e91f2d49b48fffd1311322d, type: 3}
      propertyPath: m_Layer
      value: 9
      objectReference: {fileID: 0}
    - target: {fileID: 100052, guid: d3c4cdfa4e91f2d49b48fffd1311322d, type: 3}
      propertyPath: m_Layer
      value: 9
      objectReference: {fileID: 0}
    - target: {fileID: 100054, guid: d3c4cdfa4e91f2d49b48fffd1311322d, type: 3}
      propertyPath: m_Layer
      value: 9
      objectReference: {fileID: 0}
    - target: {fileID: 100056, guid: d3c4cdfa4e91f2d49b48fffd1311322d, type: 3}
      propertyPath: m_Layer
      value: 9
      objectReference: {fileID: 0}
    - target: {fileID: 100058, guid: d3c4cdfa4e91f2d49b48fffd1311322d, type: 3}
      propertyPath: m_Layer
      value: 9
      objectReference: {fileID: 0}
    - target: {fileID: 100060, guid: d3c4cdfa4e91f2d49b48fffd1311322d, type: 3}
      propertyPath: m_Layer
      value: 9
      objectReference: {fileID: 0}
    - target: {fileID: 100062, guid: d3c4cdfa4e91f2d49b48fffd1311322d, type: 3}
      propertyPath: m_Layer
      value: 9
      objectReference: {fileID: 0}
    - target: {fileID: 100064, guid: d3c4cdfa4e91f2d49b48fffd1311322d, type: 3}
      propertyPath: m_Layer
      value: 9
      objectReference: {fileID: 0}
    - target: {fileID: 100066, guid: d3c4cdfa4e91f2d49b48fffd1311322d, type: 3}
      propertyPath: m_Layer
      value: 9
      objectReference: {fileID: 0}
    - target: {fileID: 100068, guid: d3c4cdfa4e91f2d49b48fffd1311322d, type: 3}
      propertyPath: m_Layer
      value: 9
      objectReference: {fileID: 0}
    - target: {fileID: 100070, guid: d3c4cdfa4e91f2d49b48fffd1311322d, type: 3}
      propertyPath: m_Layer
      value: 9
      objectReference: {fileID: 0}
    - target: {fileID: 100072, guid: d3c4cdfa4e91f2d49b48fffd1311322d, type: 3}
      propertyPath: m_Layer
      value: 9
      objectReference: {fileID: 0}
    - target: {fileID: 100074, guid: d3c4cdfa4e91f2d49b48fffd1311322d, type: 3}
      propertyPath: m_Layer
      value: 9
      objectReference: {fileID: 0}
    - target: {fileID: 100076, guid: d3c4cdfa4e91f2d49b48fffd1311322d, type: 3}
      propertyPath: m_Layer
      value: 9
      objectReference: {fileID: 0}
    - target: {fileID: 100078, guid: d3c4cdfa4e91f2d49b48fffd1311322d, type: 3}
      propertyPath: m_Layer
      value: 9
      objectReference: {fileID: 0}
    - target: {fileID: 100080, guid: d3c4cdfa4e91f2d49b48fffd1311322d, type: 3}
      propertyPath: m_Layer
      value: 9
      objectReference: {fileID: 0}
    - target: {fileID: 100082, guid: d3c4cdfa4e91f2d49b48fffd1311322d, type: 3}
      propertyPath: m_Layer
      value: 9
      objectReference: {fileID: 0}
    - target: {fileID: 100084, guid: d3c4cdfa4e91f2d49b48fffd1311322d, type: 3}
      propertyPath: m_Layer
      value: 9
      objectReference: {fileID: 0}
    - target: {fileID: 100086, guid: d3c4cdfa4e91f2d49b48fffd1311322d, type: 3}
      propertyPath: m_Layer
      value: 9
      objectReference: {fileID: 0}
    - target: {fileID: 100088, guid: d3c4cdfa4e91f2d49b48fffd1311322d, type: 3}
      propertyPath: m_Layer
      value: 9
      objectReference: {fileID: 0}
    - target: {fileID: 100090, guid: d3c4cdfa4e91f2d49b48fffd1311322d, type: 3}
      propertyPath: m_Layer
      value: 9
      objectReference: {fileID: 0}
    - target: {fileID: 100092, guid: d3c4cdfa4e91f2d49b48fffd1311322d, type: 3}
      propertyPath: m_Layer
      value: 9
      objectReference: {fileID: 0}
    - target: {fileID: 100094, guid: d3c4cdfa4e91f2d49b48fffd1311322d, type: 3}
      propertyPath: m_Layer
      value: 9
      objectReference: {fileID: 0}
    - target: {fileID: 100096, guid: d3c4cdfa4e91f2d49b48fffd1311322d, type: 3}
      propertyPath: m_Layer
      value: 9
      objectReference: {fileID: 0}
    - target: {fileID: 100098, guid: d3c4cdfa4e91f2d49b48fffd1311322d, type: 3}
      propertyPath: m_Layer
      value: 9
      objectReference: {fileID: 0}
    - target: {fileID: 100100, guid: d3c4cdfa4e91f2d49b48fffd1311322d, type: 3}
      propertyPath: m_Layer
      value: 9
      objectReference: {fileID: 0}
    - target: {fileID: 100102, guid: d3c4cdfa4e91f2d49b48fffd1311322d, type: 3}
      propertyPath: m_Layer
      value: 9
      objectReference: {fileID: 0}
    - target: {fileID: 100104, guid: d3c4cdfa4e91f2d49b48fffd1311322d, type: 3}
      propertyPath: m_Layer
      value: 9
      objectReference: {fileID: 0}
    - target: {fileID: 400042, guid: d3c4cdfa4e91f2d49b48fffd1311322d, type: 3}
      propertyPath: m_RootOrder
      value: 2
      objectReference: {fileID: 0}
    - target: {fileID: 400042, guid: d3c4cdfa4e91f2d49b48fffd1311322d, type: 3}
      propertyPath: m_LocalPosition.x
      value: 0
      objectReference: {fileID: 0}
    - target: {fileID: 400042, guid: d3c4cdfa4e91f2d49b48fffd1311322d, type: 3}
      propertyPath: m_LocalPosition.y
      value: -0.115
      objectReference: {fileID: 0}
    - target: {fileID: 400042, guid: d3c4cdfa4e91f2d49b48fffd1311322d, type: 3}
      propertyPath: m_LocalPosition.z
      value: 0
      objectReference: {fileID: 0}
    - target: {fileID: 400042, guid: d3c4cdfa4e91f2d49b48fffd1311322d, type: 3}
      propertyPath: m_LocalRotation.w
      value: 1
      objectReference: {fileID: 0}
    - target: {fileID: 400042, guid: d3c4cdfa4e91f2d49b48fffd1311322d, type: 3}
      propertyPath: m_LocalRotation.x
      value: -0
      objectReference: {fileID: 0}
    - target: {fileID: 400042, guid: d3c4cdfa4e91f2d49b48fffd1311322d, type: 3}
      propertyPath: m_LocalRotation.y
      value: -0
      objectReference: {fileID: 0}
    - target: {fileID: 400042, guid: d3c4cdfa4e91f2d49b48fffd1311322d, type: 3}
      propertyPath: m_LocalRotation.z
      value: -0
      objectReference: {fileID: 0}
    - target: {fileID: 400042, guid: d3c4cdfa4e91f2d49b48fffd1311322d, type: 3}
      propertyPath: m_LocalEulerAnglesHint.x
      value: 0
      objectReference: {fileID: 0}
    - target: {fileID: 400042, guid: d3c4cdfa4e91f2d49b48fffd1311322d, type: 3}
      propertyPath: m_LocalEulerAnglesHint.y
      value: 0
      objectReference: {fileID: 0}
    - target: {fileID: 400042, guid: d3c4cdfa4e91f2d49b48fffd1311322d, type: 3}
      propertyPath: m_LocalEulerAnglesHint.z
      value: 0
      objectReference: {fileID: 0}
    - target: {fileID: 2300000, guid: d3c4cdfa4e91f2d49b48fffd1311322d, type: 3}
      propertyPath: m_Materials.Array.data[0]
      value: 
      objectReference: {fileID: 2100000, guid: f0bfa53a23cfef74d9fe4c5fba57a001, type: 2}
    - target: {fileID: 2300002, guid: d3c4cdfa4e91f2d49b48fffd1311322d, type: 3}
      propertyPath: m_Materials.Array.data[0]
      value: 
      objectReference: {fileID: 2100000, guid: f0bfa53a23cfef74d9fe4c5fba57a001, type: 2}
    - target: {fileID: 13700000, guid: d3c4cdfa4e91f2d49b48fffd1311322d, type: 3}
      propertyPath: m_Materials.Array.data[0]
      value: 
      objectReference: {fileID: 2100000, guid: f0bfa53a23cfef74d9fe4c5fba57a001, type: 2}
    - target: {fileID: 13700002, guid: d3c4cdfa4e91f2d49b48fffd1311322d, type: 3}
      propertyPath: m_Materials.Array.data[0]
      value: 
      objectReference: {fileID: 2100000, guid: f0bfa53a23cfef74d9fe4c5fba57a001, type: 2}
    - target: {fileID: 13700004, guid: d3c4cdfa4e91f2d49b48fffd1311322d, type: 3}
      propertyPath: m_Materials.Array.data[0]
      value: 
      objectReference: {fileID: 2100000, guid: 12e871305bf5a774b9ed2c3bbfa44607, type: 2}
    - target: {fileID: 13700006, guid: d3c4cdfa4e91f2d49b48fffd1311322d, type: 3}
      propertyPath: m_Materials.Array.data[0]
      value: 
      objectReference: {fileID: 2100000, guid: 64a3abb41d537ca418c6ad0610a73b5a, type: 2}
    - target: {fileID: 4831819186358481131, guid: d3c4cdfa4e91f2d49b48fffd1311322d,
        type: 3}
      propertyPath: _characterReference
      value: 
      objectReference: {fileID: 1709371865068281388}
    m_RemovedComponents: []
  m_SourcePrefab: {fileID: 100100000, guid: d3c4cdfa4e91f2d49b48fffd1311322d, type: 3}
--- !u!95 &6225479546925410786 stripped
Animator:
  m_CorrespondingSourceObject: {fileID: 9500000, guid: d3c4cdfa4e91f2d49b48fffd1311322d,
    type: 3}
  m_PrefabInstance: {fileID: 6225479546915921026}
  m_PrefabAsset: {fileID: 0}
--- !u!114 &1543407951886314601 stripped
MonoBehaviour:
  m_CorrespondingSourceObject: {fileID: 4831819186358481131, guid: d3c4cdfa4e91f2d49b48fffd1311322d,
    type: 3}
  m_PrefabInstance: {fileID: 6225479546915921026}
  m_PrefabAsset: {fileID: 0}
  m_GameObject: {fileID: 0}
  m_Enabled: 1
  m_EditorHideFlags: 0
  m_Script: {fileID: 11500000, guid: 91cbc0657f711c544bf43f0d70be4cba, type: 3}
  m_Name: 
  m_EditorClassIdentifier: 
--- !u!1001 &7370829597727644064
PrefabInstance:
  m_ObjectHideFlags: 0
  serializedVersion: 2
  m_Modification:
    m_TransformParent: {fileID: 0}
    m_Modifications:
    - target: {fileID: 8210795289163646859, guid: d3d80cd2a8877a7429c994f430e5b139,
        type: 3}
      propertyPath: m_RootOrder
      value: 0
      objectReference: {fileID: 0}
    - target: {fileID: 8210795289163646859, guid: d3d80cd2a8877a7429c994f430e5b139,
        type: 3}
      propertyPath: m_LocalPosition.x
      value: 3.292759
      objectReference: {fileID: 0}
    - target: {fileID: 8210795289163646859, guid: d3d80cd2a8877a7429c994f430e5b139,
        type: 3}
      propertyPath: m_LocalPosition.y
      value: 0.636
      objectReference: {fileID: 0}
    - target: {fileID: 8210795289163646859, guid: d3d80cd2a8877a7429c994f430e5b139,
        type: 3}
      propertyPath: m_LocalPosition.z
      value: -5.1869926
      objectReference: {fileID: 0}
    - target: {fileID: 8210795289163646859, guid: d3d80cd2a8877a7429c994f430e5b139,
        type: 3}
      propertyPath: m_LocalRotation.w
      value: 1
      objectReference: {fileID: 0}
    - target: {fileID: 8210795289163646859, guid: d3d80cd2a8877a7429c994f430e5b139,
        type: 3}
      propertyPath: m_LocalRotation.x
      value: -0
      objectReference: {fileID: 0}
    - target: {fileID: 8210795289163646859, guid: d3d80cd2a8877a7429c994f430e5b139,
        type: 3}
      propertyPath: m_LocalRotation.y
      value: -0
      objectReference: {fileID: 0}
    - target: {fileID: 8210795289163646859, guid: d3d80cd2a8877a7429c994f430e5b139,
        type: 3}
      propertyPath: m_LocalRotation.z
      value: -0
      objectReference: {fileID: 0}
    - target: {fileID: 8210795289163646859, guid: d3d80cd2a8877a7429c994f430e5b139,
        type: 3}
      propertyPath: m_LocalEulerAnglesHint.x
      value: 0
      objectReference: {fileID: 0}
    - target: {fileID: 8210795289163646859, guid: d3d80cd2a8877a7429c994f430e5b139,
        type: 3}
      propertyPath: m_LocalEulerAnglesHint.y
      value: 0
      objectReference: {fileID: 0}
    - target: {fileID: 8210795289163646859, guid: d3d80cd2a8877a7429c994f430e5b139,
        type: 3}
      propertyPath: m_LocalEulerAnglesHint.z
      value: 0
      objectReference: {fileID: 0}
    - target: {fileID: 8210795289163646860, guid: d3d80cd2a8877a7429c994f430e5b139,
        type: 3}
      propertyPath: _animator
      value: 
      objectReference: {fileID: 6225479546925410786}
    - target: {fileID: 8210795289163646860, guid: d3d80cd2a8877a7429c994f430e5b139,
        type: 3}
      propertyPath: _armorData
      value: 
      objectReference: {fileID: 11400000, guid: e27228d1ab422414bbf3996d5ba6d374,
        type: 2}
    - target: {fileID: 8210795289163646860, guid: d3d80cd2a8877a7429c994f430e5b139,
        type: 3}
      propertyPath: _weaponData
      value: 
      objectReference: {fileID: 11400000, guid: 57feb501f5e58b9498ffadb0d73ac9f5,
        type: 2}
    - target: {fileID: 8210795289163646860, guid: d3d80cd2a8877a7429c994f430e5b139,
        type: 3}
      propertyPath: _characterData
      value: 
      objectReference: {fileID: 11400000, guid: 658d0a3ddccce6b40bbf5a9d7f729287,
        type: 2}
    - target: {fileID: 8210795289163646860, guid: d3d80cd2a8877a7429c994f430e5b139,
        type: 3}
      propertyPath: _animationHandle
      value: 
      objectReference: {fileID: 1543407951886314601}
    - target: {fileID: 8210795289163646863, guid: d3d80cd2a8877a7429c994f430e5b139,
        type: 3}
      propertyPath: m_Name
      value: Skeleton Warrior
      objectReference: {fileID: 0}
    - target: {fileID: 8210795290775511106, guid: d3d80cd2a8877a7429c994f430e5b139,
        type: 3}
      propertyPath: m_IsActive
      value: 0
      objectReference: {fileID: 0}
    m_RemovedComponents:
    - {fileID: 8210795289040017807, guid: d3d80cd2a8877a7429c994f430e5b139, type: 3}
    - {fileID: 8210795290782766044, guid: d3d80cd2a8877a7429c994f430e5b139, type: 3}
  m_SourcePrefab: {fileID: 100100000, guid: d3d80cd2a8877a7429c994f430e5b139, type: 3}
--- !u!4 &1709371865068281387 stripped
Transform:
  m_CorrespondingSourceObject: {fileID: 8210795289163646859, guid: d3d80cd2a8877a7429c994f430e5b139,
    type: 3}
  m_PrefabInstance: {fileID: 7370829597727644064}
  m_PrefabAsset: {fileID: 0}
--- !u!114 &1709371865068281388 stripped
MonoBehaviour:
  m_CorrespondingSourceObject: {fileID: 8210795289163646860, guid: d3d80cd2a8877a7429c994f430e5b139,
    type: 3}
  m_PrefabInstance: {fileID: 7370829597727644064}
  m_PrefabAsset: {fileID: 0}
  m_GameObject: {fileID: 0}
  m_Enabled: 1
  m_EditorHideFlags: 0
  m_Script: {fileID: 11500000, guid: 217495f83a46eda47a307efb1e5a9a4c, type: 3}
  m_Name: 
  m_EditorClassIdentifier: 
