%YAML 1.1
%TAG !u! tag:unity3d.com,2011:
--- !u!1001 &5352829683918584569
PrefabInstance:
  m_ObjectHideFlags: 0
  serializedVersion: 2
  m_Modification:
    m_TransformParent: {fileID: 0}
    m_Modifications:
    - target: {fileID: 2701000886026989664, guid: 82d743da11c88f6418f914b4ce20c8aa,
        type: 3}
      propertyPath: m_audioClip
      value: 
      objectReference: {fileID: 8300000, guid: 863ad7f426a8a7f42aacb5e7ed7caa71, type: 3}
    - target: {fileID: 2701000886026989664, guid: 82d743da11c88f6418f914b4ce20c8aa,
        type: 3}
      propertyPath: OutputAudioMixerGroup
      value: 
      objectReference: {fileID: -5151862091525221296, guid: 98ea2087996ae5c469139d2ea90f1031,
        type: 2}
    - target: {fileID: 2701000886026989664, guid: 82d743da11c88f6418f914b4ce20c8aa,
        type: 3}
      propertyPath: panLevelCustomCurve.m_Curve.Array.data[0].value
      value: 0
      objectReference: {fileID: 0}
    - target: {fileID: 7320408970249336684, guid: 82d743da11c88f6418f914b4ce20c8aa,
        type: 3}
      propertyPath: m_Name
      value: Thunder_3
      objectReference: {fileID: 0}
    - target: {fileID: 7320408970249336686, guid: 82d743da11c88f6418f914b4ce20c8aa,
        type: 3}
      propertyPath: m_RootOrder
      value: 0
      objectReference: {fileID: 0}
    - target: {fileID: 7320408970249336686, guid: 82d743da11c88f6418f914b4ce20c8aa,
        type: 3}
      propertyPath: m_LocalPosition.x
      value: 1.17
      objectReference: {fileID: 0}
    - target: {fileID: 7320408970249336686, guid: 82d743da11c88f6418f914b4ce20c8aa,
        type: 3}
      propertyPath: m_LocalPosition.y
      value: 1.35
      objectReference: {fileID: 0}
    - target: {fileID: 7320408970249336686, guid: 82d743da11c88f6418f914b4ce20c8aa,
        type: 3}
      propertyPath: m_LocalPosition.z
      value: -4.21
      objectReference: {fileID: 0}
    - target: {fileID: 7320408970249336686, guid: 82d743da11c88f6418f914b4ce20c8aa,
        type: 3}
      propertyPath: m_LocalRotation.w
      value: 1
      objectReference: {fileID: 0}
    - target: {fileID: 7320408970249336686, guid: 82d743da11c88f6418f914b4ce20c8aa,
        type: 3}
      propertyPath: m_LocalRotation.x
      value: 0
      objectReference: {fileID: 0}
    - target: {fileID: 7320408970249336686, guid: 82d743da11c88f6418f914b4ce20c8aa,
        type: 3}
      propertyPath: m_LocalRotation.y
      value: 0
      objectReference: {fileID: 0}
    - target: {fileID: 7320408970249336686, guid: 82d743da11c88f6418f914b4ce20c8aa,
        type: 3}
      propertyPath: m_LocalRotation.z
      value: 0
      objectReference: {fileID: 0}
    - target: {fileID: 7320408970249336686, guid: 82d743da11c88f6418f914b4ce20c8aa,
        type: 3}
      propertyPath: m_LocalEulerAnglesHint.x
      value: 0
      objectReference: {fileID: 0}
    - target: {fileID: 7320408970249336686, guid: 82d743da11c88f6418f914b4ce20c8aa,
        type: 3}
      propertyPath: m_LocalEulerAnglesHint.y
      value: 0
      objectReference: {fileID: 0}
    - target: {fileID: 7320408970249336686, guid: 82d743da11c88f6418f914b4ce20c8aa,
        type: 3}
      propertyPath: m_LocalEulerAnglesHint.z
      value: 0
      objectReference: {fileID: 0}
    m_RemovedComponents: []
  m_SourcePrefab: {fileID: 100100000, guid: 82d743da11c88f6418f914b4ce20c8aa, type: 3}
