%YAML 1.1
%TAG !u! tag:unity3d.com,2011:
--- !u!114 &11400000
MonoBehaviour:
  m_ObjectHideFlags: 0
  m_CorrespondingSourceObject: {fileID: 0}
  m_PrefabInstance: {fileID: 0}
  m_PrefabAsset: {fileID: 0}
  m_GameObject: {fileID: 0}
  m_Enabled: 1
  m_EditorHideFlags: 0
  m_Script: {fileID: 11500000, guid: 6a1c19abb8c9b6647bc932f7eedd5142, type: 3}
  m_Name: PlayerBaseBow
  m_EditorClassIdentifier: 
  Name: Base Bow
  Damage: 1
  MaxAmmo: 8
  ShootAudios: 1100000010000000
  ReloadAudios: 
