<?xml version="1.0" encoding="UTF-8"?>
<svg width="494px" height="139px" viewBox="0 0 494 139" version="1.1" xmlns="http://www.w3.org/2000/svg" xmlns:xlink="http://www.w3.org/1999/xlink">
    <!-- Generator: Sketch 51.3 (57544) - http://www.bohemiancoding.com/sketch -->
    <title>logo-patria-amada-brasil-horizontal_pb</title>
    <desc>Created with Sketch.</desc>
    <defs></defs>
    <g id="Page-1" stroke="none" stroke-width="1" fill="none" fill-rule="evenodd">
        <g id="logo-patria-amada-brasil-horizontal_pb">
            <path d="M209.817,83.316 L209.817,104.702 C213.945,104.702 218.076,104.612 221.713,104.612 C232.332,104.612 234.494,98.514 234.494,94.007 C234.494,89.59 231.643,83.316 221.124,83.316 L209.817,83.316 Z M209.817,76.072 L220.141,76.072 C229.382,76.072 231.445,71.122 231.445,66.97 C231.445,62.641 229.578,57.87 220.336,57.87 C217.583,57.87 212.961,57.87 209.817,57.78 L209.817,76.072 Z M220.532,50.712 C234.986,50.712 241.967,56.721 241.967,66.705 C241.967,72.273 238.23,77.131 232.725,79.077 C239.409,80.844 245.211,86.939 245.211,94.54 C245.211,104.348 238.131,111.77 221.812,111.77 C213.848,111.77 207.457,111.591 200.083,111.505 L199.493,110.886 L199.493,51.596 L200.083,50.977 C207.261,50.888 214.043,50.712 220.532,50.712 Z" id="Fill-1" fill="#FFFFFF"></path>
            <path d="M263.38,79.606 C267.213,79.517 271.54,79.428 274.293,79.428 C283.929,79.428 286.289,73.951 286.289,68.826 C286.289,63.436 283.929,58.134 274.293,58.134 C271.44,58.134 266.723,58.134 263.38,58.045 L263.38,79.606 Z M284.518,84.908 C287.762,85.969 290.122,88.971 291.499,92.419 L295.825,102.756 C296.808,105.142 297.987,107.528 300.248,109.119 C298.874,110.973 295.825,112.035 293.17,112.035 C289.238,112.035 287.861,110.089 286.289,106.291 L281.371,94.361 C279.702,90.298 277.538,87.118 271.44,87.118 L263.38,87.118 L263.38,111.416 C261.808,111.681 259.838,111.77 258.17,111.77 C256.595,111.77 254.533,111.681 253.056,111.416 L253.056,51.596 L253.646,50.977 C261.02,50.888 268.1,50.712 274.784,50.712 C288.451,50.712 297.103,57.075 297.103,68.826 C297.103,76.956 291.695,82.876 284.518,84.908 Z" id="Fill-2" fill="#FFFFFF"></path>
            <path d="M323.437,89.149 C325.012,89.149 327.667,89.061 328.452,89.061 L338.283,89.061 C338.971,89.061 341.625,89.149 343.202,89.149 L338.676,76.337 C336.909,71.211 334.843,65.027 333.466,60.345 L332.976,60.345 C331.994,64.319 330.222,69.888 329.14,73.157 L323.437,89.149 Z M320.783,96.747 L315.573,111.505 C314.294,111.77 312.624,111.859 311.051,111.859 C309.181,111.859 307.314,111.591 305.937,111.24 L305.642,110.797 L327.863,51.066 C329.435,50.802 332.189,50.712 333.861,50.712 C335.532,50.712 338.283,50.802 339.759,51.066 L361.784,110.797 C360.307,111.681 357.948,112.035 355.687,112.035 C352.443,112.035 350.771,110.973 349.494,107.087 L345.856,96.747 C344.184,96.747 340.742,96.836 339.955,96.836 L326.486,96.836 C325.698,96.836 322.455,96.747 320.783,96.747 Z" id="Fill-3" fill="#FFFFFF"></path>
            <path d="M371.113,98.693 C376.816,102.048 384.091,104.702 390.874,104.702 C398.837,104.702 403.359,101.254 403.458,96.394 C403.458,92.241 400.214,89.061 394.511,86.853 L382.91,82.346 C374.651,79.164 369.441,74.57 369.441,67.059 C369.441,57.427 378.484,49.918 391.661,49.918 C399.821,49.918 407.39,52.215 412.504,54.511 C412.405,57.162 410.833,60.077 408.668,61.847 C403.557,59.547 396.872,57.691 391.857,57.691 C384.582,57.691 380.059,61.314 380.059,65.999 C380.059,69.888 383.403,72.095 388.219,73.951 L399.625,78.369 C408.079,81.549 414.372,86.939 414.372,94.805 C414.372,104.966 406.506,112.564 390.285,112.564 C382.122,112.564 373.274,110.089 366.687,105.937 C366.982,103.199 368.948,100.281 371.113,98.693" id="Fill-4" fill="#FFFFFF"></path>
            <path d="M426.588,51.066 C428.065,50.802 430.226,50.712 431.798,50.712 C433.374,50.712 435.436,50.802 437.011,51.066 L437.011,111.416 C435.436,111.681 433.374,111.77 431.798,111.77 C430.226,111.77 428.065,111.681 426.588,111.416 L426.588,51.066" id="Fill-5" fill="#FFFFFF"></path>
            <path d="M492.865,103.286 C492.865,104.259 492.765,105.85 492.57,106.998 C491.98,110.003 489.521,111.505 485.785,111.505 L460.125,111.505 C456.586,111.505 454.028,109.473 454.028,105.672 L454.028,51.242 L454.716,50.712 L458.649,50.712 C462.975,50.712 464.55,52.568 464.55,56.721 L464.55,103.64 C467.595,103.375 470.644,103.286 473.298,103.286 L492.865,103.286" id="Fill-6" fill="#FFFFFF"></path>
            <path d="M205.458,26.241 C206.929,26.195 208.533,26.15 209.2,26.15 C213.162,26.15 213.962,22.9 213.962,20.542 C213.962,18.138 213.162,14.93 209.2,14.93 C208.087,14.93 206.795,14.93 205.458,14.885 L205.458,26.241 Z M209.554,30.782 L205.458,30.782 L205.458,40.889 C204.525,41.068 203.322,41.11 202.476,41.11 C201.675,41.11 200.429,41.068 199.493,40.889 L199.493,10.702 L199.805,10.435 C203.367,10.344 206.35,10.256 209.554,10.256 C215.7,10.256 220.107,13.597 220.107,20.542 C220.107,27.266 215.7,30.782 209.554,30.782 Z" id="Fill-7" fill="#FFFFFF"></path>
            <path d="M228.702,29.27 C229.326,29.27 230.259,29.224 230.706,29.224 L234.534,29.224 C234.934,29.224 235.78,29.27 236.405,29.27 L235.068,24.725 C234.313,22.188 233.331,18.759 232.664,16.088 L232.397,16.088 C231.952,18.359 231.017,21.566 230.439,23.613 L228.702,29.27 Z M227.231,33.986 L225.139,40.935 C224.381,41.11 223.494,41.156 222.556,41.156 C221.623,41.156 220.419,41.022 219.707,40.756 L219.486,40.443 L229.414,10.477 C230.393,10.344 231.864,10.256 232.888,10.256 C233.822,10.256 235.38,10.344 236.317,10.522 L246.066,40.489 C245.22,40.977 243.795,41.247 242.637,41.247 C240.724,41.247 239.788,40.577 239.076,38.039 L237.83,33.986 C237.163,33.986 236.092,34.032 235.647,34.032 L229.414,34.032 C228.968,34.032 227.944,34.032 227.231,33.986 Z" id="Fill-8" fill="#FFFFFF"></path>
            <path d="M252.256,18.717 C252.256,17.513 252.298,16.667 252.298,15.421 L252.256,15.421 C251.631,15.421 250.207,15.464 249.583,15.464 L244.641,15.464 C244.462,14.576 244.417,13.685 244.417,12.972 C244.417,12.305 244.462,11.368 244.641,10.477 L265.925,10.477 C266.101,11.102 266.235,12.035 266.235,12.793 C266.235,14.751 265.213,15.464 263.031,15.464 L260.939,15.464 C260.314,15.464 258.889,15.421 258.265,15.421 L258.222,15.421 C258.222,16.667 258.265,17.513 258.265,18.717 L258.265,40.889 C257.24,41.068 256.127,41.11 255.24,41.11 C254.39,41.11 253.278,41.068 252.256,40.889 L252.256,18.717" id="Fill-9" fill="#FFFFFF"></path>
            <path d="M275.987,24.592 C277.545,24.504 279.237,24.458 280.083,24.458 C283.957,24.458 284.845,22.1 284.845,19.65 C284.845,17.159 283.957,14.842 280.083,14.842 C279.012,14.842 277.367,14.842 275.987,14.797 L275.987,24.592 Z M285.424,27.799 C287.028,28.378 288.095,29.891 288.719,31.716 L290.369,36.215 C290.811,37.46 291.481,38.664 292.46,39.464 C291.703,40.531 290.056,41.247 288.498,41.247 C286.315,41.247 285.557,40.043 284.711,37.727 L282.841,32.428 C282.174,30.649 281.283,29.224 278.7,29.224 L275.987,29.224 L275.987,40.889 C275.004,41.068 273.847,41.11 273,41.11 C272.247,41.11 270.998,41.068 270.063,40.889 L270.063,10.702 L270.375,10.435 C273.938,10.344 277.321,10.256 280.528,10.256 C286.715,10.256 290.99,13.327 290.99,19.65 C290.99,23.879 288.319,26.774 285.424,27.799 Z" id="Fill-10" fill="#FFFFFF"></path>
            <path d="M297.268,10.477 C298.16,10.301 299.451,10.256 300.251,10.256 C301.097,10.256 302.255,10.301 303.234,10.477 L303.234,40.889 C302.255,41.068 301.097,41.11 300.251,41.11 C299.451,41.11 298.16,41.068 297.268,40.889 L297.268,10.477" id="Fill-11" fill="#FFFFFF"></path>
            <path d="M316.903,29.27 C317.528,29.27 318.461,29.224 318.907,29.224 L322.736,29.224 C323.136,29.224 323.982,29.27 324.606,29.27 L323.269,24.725 C322.514,22.188 321.533,18.759 320.866,16.088 L320.599,16.088 C320.153,18.359 319.219,21.566 318.64,23.613 L316.903,29.27 Z M315.433,33.986 L313.341,40.935 C312.583,41.11 311.692,41.156 310.758,41.156 C309.825,41.156 308.622,41.022 307.909,40.756 L307.687,40.443 L317.616,10.477 C318.595,10.344 320.065,10.256 321.089,10.256 C322.024,10.256 323.582,10.344 324.515,10.522 L334.268,40.489 C333.422,40.977 331.998,41.247 330.839,41.247 C328.926,41.247 327.99,40.577 327.277,38.039 L326.031,33.986 C325.364,33.986 324.294,34.032 323.848,34.032 L317.616,34.032 C317.17,34.032 316.145,34.032 315.433,33.986 Z" id="Fill-12" fill="#FFFFFF"></path>
            <path d="M354.528,29.27 C355.152,29.27 356.085,29.224 356.531,29.224 L360.36,29.224 C360.76,29.224 361.606,29.27 362.23,29.27 L360.893,24.725 C360.139,22.188 359.157,18.759 358.49,16.088 L358.223,16.088 C357.777,18.359 356.843,21.566 356.264,23.613 L354.528,29.27 Z M353.057,33.986 L350.965,40.935 C350.208,41.11 349.319,41.156 348.382,41.156 C347.449,41.156 346.246,41.022 345.533,40.756 L345.312,40.443 L355.24,10.477 C356.219,10.344 357.689,10.256 358.714,10.256 C359.648,10.256 361.206,10.344 362.142,10.522 L371.892,40.489 C371.046,40.977 369.622,41.247 368.463,41.247 C366.55,41.247 365.614,40.577 364.901,38.039 L363.655,33.986 C362.989,33.986 361.918,34.032 361.472,34.032 L355.24,34.032 C354.794,34.032 353.769,34.032 353.057,33.986 Z" id="Fill-13" fill="#FFFFFF"></path>
            <path d="M377.721,10.522 C379.013,10.301 380.708,10.21 381.729,10.21 C382.799,10.21 384.266,10.301 385.515,10.522 L388.944,22.858 C389.256,24.104 390.369,28.69 390.635,30.47 L390.948,30.47 C391.214,28.69 392.328,24.104 392.639,22.858 L396.023,10.522 C397.36,10.301 398.785,10.21 399.806,10.21 C400.876,10.21 402.522,10.301 403.859,10.522 L406.217,40.801 C405.372,41.022 404.171,41.11 403.192,41.11 C402.255,41.11 401.41,41.068 400.564,40.935 L399.718,26.641 C399.54,23.879 399.364,19.784 399.364,16.979 L399.051,16.979 L393.84,36.348 C392.952,36.481 391.615,36.569 390.769,36.569 C389.965,36.569 388.632,36.481 387.741,36.348 L382.533,16.979 L382.22,16.979 C382.174,19.784 382.042,23.879 381.863,26.641 L381.017,40.935 C380.171,41.068 379.283,41.11 378.346,41.11 C377.413,41.11 376.208,41.022 375.363,40.801 L377.721,10.522" id="Fill-14" fill="#FFFFFF"></path>
            <path d="M418.911,29.27 C419.535,29.27 420.469,29.224 420.915,29.224 L424.744,29.224 C425.143,29.224 425.989,29.27 426.614,29.27 L425.277,24.725 C424.522,22.188 423.54,18.759 422.873,16.088 L422.606,16.088 C422.161,18.359 421.227,21.566 420.648,23.613 L418.911,29.27 Z M417.44,33.986 L415.348,40.935 C414.59,41.11 413.703,41.156 412.766,41.156 C411.832,41.156 410.628,41.022 409.917,40.756 L409.695,40.443 L419.623,10.477 C420.602,10.344 422.073,10.256 423.097,10.256 C424.031,10.256 425.589,10.344 426.526,10.522 L436.275,40.489 C435.429,40.977 434.004,41.247 432.846,41.247 C430.933,41.247 429.997,40.577 429.285,38.039 L428.039,33.986 C427.372,33.986 426.301,34.032 425.856,34.032 L419.623,34.032 C419.177,34.032 418.153,34.032 417.44,33.986 Z" id="Fill-15" fill="#FFFFFF"></path>
            <path d="M451.412,14.976 C449.72,14.976 448.34,14.976 446.558,14.93 L446.558,36.436 C448.34,36.393 449.72,36.393 451.412,36.393 C457.244,36.393 458.089,30.558 458.089,25.662 C458.089,20.763 457.244,14.976 451.412,14.976 Z M459.381,38.885 C457.423,40.489 453.815,41.11 451.412,41.11 C447.67,41.11 444.779,41.022 440.904,40.935 L440.592,40.668 L440.592,10.702 L440.904,10.435 C444.733,10.301 447.67,10.256 451.412,10.256 C453.815,10.256 457.423,10.88 459.381,12.481 C463.477,15.776 464.235,20.496 464.235,25.662 C464.235,30.87 463.522,35.59 459.381,38.885 Z" id="Fill-16" fill="#FFFFFF"></path>
            <path d="M475.5,29.27 C476.125,29.27 477.058,29.224 477.503,29.224 L481.333,29.224 C481.733,29.224 482.579,29.27 483.203,29.27 L481.866,24.725 C481.111,22.188 480.128,18.759 479.462,16.088 L479.195,16.088 C478.75,18.359 477.816,21.566 477.237,23.613 L475.5,29.27 Z M474.03,33.986 L471.938,40.935 C471.18,41.11 470.289,41.156 469.355,41.156 C468.421,41.156 467.217,41.022 466.505,40.756 L466.284,40.443 L476.212,10.477 C477.191,10.344 478.662,10.256 479.686,10.256 C480.62,10.256 482.178,10.344 483.112,10.522 L492.865,40.489 C492.018,40.977 490.593,41.247 489.436,41.247 C487.523,41.247 486.586,40.577 485.874,38.039 L484.627,33.986 C483.96,33.986 482.89,34.032 482.445,34.032 L476.212,34.032 C475.766,34.032 474.742,34.032 474.03,33.986 Z" id="Fill-17" fill="#FFFFFF"></path>
            <path d="M238.171,0.064 C239.051,0.526 240.253,1.92 240.565,3.244 L233.19,7.627 C232.447,7.357 231.766,6.372 231.545,5.632 L238.171,0.064" id="Fill-18" fill="#FFFFFF"></path>
            <path d="M206.85,129.925 L210.249,129.903 C211.778,129.903 212.542,130.625 212.542,132.067 L212.542,137.76 C210.681,138.351 208.726,138.646 206.677,138.646 C205.638,138.646 204.719,138.474 203.917,138.126 C203.117,137.781 202.446,137.283 201.905,136.634 C201.365,135.985 200.957,135.187 200.683,134.242 C200.408,133.298 200.271,132.226 200.271,131.028 C200.271,129.716 200.462,128.572 200.845,127.598 C201.227,126.624 201.739,125.812 202.381,125.163 C203.023,124.515 203.762,124.027 204.6,123.702 C205.436,123.378 206.309,123.216 207.218,123.216 C209.094,123.216 210.855,123.734 212.5,124.773 C212.485,125.004 212.43,125.239 212.337,125.477 C212.243,125.715 212.127,125.946 211.991,126.169 C211.853,126.393 211.695,126.596 211.514,126.775 C211.333,126.957 211.15,127.111 210.962,127.241 C209.764,126.462 208.552,126.072 207.327,126.072 C204.974,126.072 203.798,127.717 203.798,131.007 C203.798,134.283 205.003,135.919 207.413,135.919 C207.745,135.919 208.066,135.905 208.376,135.877 C208.686,135.847 208.993,135.805 209.296,135.747 L209.296,134.297 C209.296,133.964 209.299,133.676 209.307,133.431 C209.314,133.186 209.325,132.976 209.339,132.804 L208.257,132.804 C207.637,132.804 207.208,132.685 206.969,132.447 C206.731,132.208 206.613,131.836 206.613,131.331 C206.613,130.898 206.692,130.429 206.85,129.925" id="Fill-19" fill="#FFFFFF"></path>
            <path d="M225.917,134.297 C226.307,135.423 227.093,135.985 228.277,135.985 C228.869,135.985 229.348,135.837 229.716,135.541 C230.083,135.246 230.373,134.871 230.582,134.416 C230.791,133.961 230.931,133.452 231.004,132.89 C231.076,132.327 231.112,131.771 231.112,131.224 C231.112,130.718 231.094,130.156 231.058,129.535 C231.022,128.915 230.917,128.334 230.744,127.793 C230.571,127.252 230.296,126.798 229.921,126.43 C229.546,126.062 228.998,125.878 228.277,125.878 C227.584,125.878 227.054,126.055 226.686,126.407 C226.318,126.761 226.043,127.197 225.864,127.717 C225.683,128.236 225.571,128.789 225.528,129.373 C225.485,129.957 225.463,130.473 225.463,130.921 C225.463,131.584 225.496,132.175 225.56,132.694 C225.625,133.214 225.745,133.748 225.917,134.297 Z M224.165,137.283 C222.621,135.999 221.849,133.885 221.849,130.942 C221.849,129.672 221.997,128.558 222.292,127.598 C222.588,126.64 223.013,125.834 223.569,125.186 C224.125,124.536 224.799,124.046 225.593,123.713 C226.386,123.382 227.282,123.216 228.277,123.216 C229.273,123.216 230.17,123.382 230.971,123.713 C231.772,124.046 232.45,124.54 233.005,125.195 C233.561,125.853 233.987,126.661 234.283,127.619 C234.578,128.579 234.726,129.686 234.726,130.942 C234.726,132.198 234.578,133.305 234.283,134.265 C233.987,135.225 233.561,136.029 233.005,136.677 C232.45,137.327 231.772,137.816 230.971,138.149 C230.17,138.48 229.273,138.646 228.277,138.646 C226.632,138.646 225.261,138.192 224.165,137.283 Z" id="Fill-20" fill="#FFFFFF"></path>
            <path d="M249.573,135.423 L252.408,123.541 C252.754,123.454 253.201,123.41 253.75,123.41 C254.5,123.41 255.091,123.49 255.524,123.648 L255.655,123.822 L251.607,138.322 C250.785,138.408 249.958,138.452 249.128,138.452 C248.299,138.452 247.701,138.348 247.333,138.138 C246.964,137.929 246.687,137.514 246.5,136.894 L242.907,123.843 C243.686,123.512 244.328,123.345 244.833,123.345 C245.439,123.345 245.886,123.482 246.174,123.757 C246.462,124.03 246.687,124.463 246.846,125.055 L248.512,131.224 C248.772,132.19 249.045,133.503 249.334,135.162 C249.363,135.335 249.443,135.423 249.573,135.423" id="Fill-21" fill="#FFFFFF"></path>
            <path d="M268.315,133.95 L268.293,135.509 L268.293,135.53 C268.955,135.502 269.487,135.486 269.889,135.486 L274.894,135.486 C274.894,136.021 274.873,136.432 274.829,136.721 C274.657,137.832 273.92,138.387 272.622,138.387 L266.865,138.387 C266.244,138.387 265.757,138.208 265.404,137.846 C265.05,137.485 264.874,136.994 264.874,136.374 L264.874,123.692 L265.025,123.541 L274.353,123.541 C274.44,123.959 274.483,124.414 274.483,124.904 C274.483,125.394 274.382,125.906 274.18,126.44 L268.293,126.44 L268.315,127.999 L268.315,129.514 C268.688,129.499 269.176,129.492 269.78,129.492 L273.077,129.492 C273.206,129.895 273.271,130.357 273.271,130.877 C273.271,131.396 273.206,131.872 273.077,132.305 L268.315,132.305 L268.315,133.95" id="Fill-22" fill="#FFFFFF"></path>
            <path d="M288.161,125.985 L288.161,130.249 C288.81,130.249 289.366,130.238 289.827,130.217 C290.289,130.196 290.661,130.108 290.942,129.957 C291.223,129.804 291.436,129.59 291.581,129.314 C291.724,129.039 291.797,128.64 291.797,128.118 C291.797,126.71 291.119,126.008 289.763,126.008 C289.43,126.008 289.131,126.008 288.865,126.008 C288.597,126.008 288.363,126.001 288.161,125.985 Z M295.325,128.106 C295.325,128.583 295.252,129.034 295.108,129.459 C294.963,129.886 294.773,130.268 294.535,130.606 C294.296,130.946 294.015,131.242 293.691,131.494 C293.366,131.746 293.03,131.937 292.684,132.067 C293.434,132.342 293.99,133.006 294.35,134.058 L295,135.898 C295.245,136.62 295.606,137.153 296.082,137.499 C295.866,137.788 295.541,138.03 295.108,138.225 C294.675,138.42 294.199,138.518 293.679,138.518 C293.161,138.518 292.756,138.369 292.467,138.073 C292.178,137.777 291.912,137.262 291.667,136.525 L290.887,134.253 C290.729,133.82 290.516,133.489 290.249,133.258 C289.982,133.027 289.582,132.911 289.048,132.911 L288.161,132.911 L288.161,138.322 C287.699,138.408 287.122,138.452 286.429,138.452 C285.737,138.452 285.167,138.408 284.72,138.322 L284.72,123.648 L284.872,123.497 C286.126,123.468 287.183,123.447 288.042,123.432 C288.9,123.417 289.575,123.41 290.066,123.41 C290.859,123.41 291.581,123.508 292.23,123.702 C292.878,123.897 293.431,124.189 293.885,124.58 C294.339,124.969 294.693,125.459 294.946,126.051 C295.198,126.643 295.325,127.328 295.325,128.106 Z" id="Fill-23" fill="#FFFFFF"></path>
            <path d="M317.097,123.389 L317.249,123.541 L317.249,138.257 C316.67,138.387 315.989,138.452 315.203,138.452 C314.417,138.452 313.72,138.408 313.115,138.322 L309.716,130.574 C309.312,129.695 308.901,128.677 308.483,127.523 L308.417,127.544 C308.591,129.651 308.677,131.808 308.677,134.016 L308.677,138.322 C308.23,138.408 307.689,138.452 307.054,138.452 C306.419,138.452 305.885,138.408 305.454,138.322 L305.454,123.605 C306.001,123.476 306.662,123.41 307.433,123.41 C308.205,123.41 308.894,123.454 309.5,123.541 L312.855,131.266 C313.46,132.694 313.908,133.791 314.197,134.556 L314.283,134.512 C314.11,132.508 314.023,130.38 314.023,128.129 L314.023,125.489 C314.023,124.738 314.174,124.2 314.478,123.876 C314.781,123.55 315.271,123.389 315.95,123.389 L317.097,123.389" id="Fill-24" fill="#FFFFFF"></path>
            <path d="M331.143,134.297 C331.532,135.423 332.319,135.985 333.501,135.985 C334.093,135.985 334.573,135.837 334.941,135.541 C335.309,135.246 335.597,134.871 335.806,134.416 C336.016,133.961 336.156,133.452 336.229,132.89 C336.3,132.327 336.337,131.771 336.337,131.224 C336.337,130.718 336.319,130.156 336.283,129.535 C336.247,128.915 336.142,128.334 335.969,127.793 C335.795,127.252 335.522,126.798 335.147,126.43 C334.771,126.062 334.223,125.878 333.501,125.878 C332.809,125.878 332.279,126.055 331.911,126.407 C331.542,126.761 331.269,127.197 331.088,127.717 C330.908,128.236 330.796,128.789 330.752,129.373 C330.709,129.957 330.688,130.473 330.688,130.921 C330.688,131.584 330.72,132.175 330.786,132.694 C330.85,133.214 330.969,133.748 331.143,134.297 Z M329.389,137.283 C327.845,135.999 327.074,133.885 327.074,130.942 C327.074,129.672 327.221,128.558 327.517,127.598 C327.813,126.64 328.239,125.834 328.794,125.186 C329.35,124.536 330.025,124.046 330.818,123.713 C331.612,123.382 332.506,123.216 333.501,123.216 C334.498,123.216 335.396,123.382 336.196,123.713 C336.997,124.046 337.675,124.54 338.231,125.195 C338.786,125.853 339.211,126.661 339.507,127.619 C339.803,128.579 339.951,129.686 339.951,130.942 C339.951,132.198 339.803,133.305 339.507,134.265 C339.211,135.225 338.786,136.029 338.231,136.677 C337.675,137.327 336.997,137.816 336.196,138.149 C335.396,138.48 334.498,138.646 333.501,138.646 C331.857,138.646 330.486,138.192 329.389,137.283 Z" id="Fill-25" fill="#FFFFFF"></path>
            <path d="M365.402,126.484 L365.423,128.171 L365.423,129.535 L370.078,129.535 C370.192,129.968 370.25,130.441 370.25,130.953 C370.25,131.466 370.192,131.937 370.078,132.37 L365.423,132.37 L365.423,138.322 C364.965,138.408 364.392,138.452 363.703,138.452 C363.015,138.452 362.441,138.408 361.983,138.322 L361.983,123.671 L362.134,123.541 L371.397,123.541 C371.484,123.901 371.527,124.352 371.527,124.893 C371.527,125.433 371.378,125.834 371.082,126.094 C370.786,126.354 370.319,126.484 369.681,126.484 L365.402,126.484" id="Fill-26" fill="#FFFFFF"></path>
            <path d="M384.404,133.95 L384.382,135.509 L384.382,135.53 C385.043,135.502 385.576,135.486 385.979,135.486 L390.983,135.486 C390.983,136.021 390.961,136.432 390.918,136.721 C390.746,137.832 390.009,138.387 388.711,138.387 L382.954,138.387 C382.333,138.387 381.846,138.208 381.493,137.846 C381.139,137.485 380.962,136.994 380.962,136.374 L380.962,123.692 L381.115,123.541 L390.443,123.541 C390.529,123.959 390.572,124.414 390.572,124.904 C390.572,125.394 390.471,125.906 390.27,126.44 L384.382,126.44 L384.404,127.999 L384.404,129.514 C384.778,129.499 385.266,129.492 385.869,129.492 L389.166,129.492 C389.295,129.895 389.36,130.357 389.36,130.877 C389.36,131.396 389.295,131.872 389.166,132.305 L384.404,132.305 L384.404,133.95" id="Fill-27" fill="#FFFFFF"></path>
            <path d="M406.393,135.747 C408.296,135.747 409.25,134.145 409.25,130.942 C409.25,127.726 408.296,126.116 406.393,126.116 C405.93,126.116 405.523,126.116 405.169,126.116 C404.816,126.116 404.509,126.108 404.25,126.094 L404.25,135.768 C404.509,135.754 404.816,135.747 405.169,135.747 C405.523,135.747 405.93,135.747 406.393,135.747 Z M410.375,137.369 C409.913,137.745 409.307,138.019 408.556,138.192 C407.806,138.366 406.977,138.452 406.068,138.452 C405.621,138.452 404.975,138.444 404.131,138.43 C403.287,138.416 402.23,138.394 400.96,138.366 L400.809,138.214 L400.809,123.648 L400.96,123.497 C401.797,123.468 402.667,123.447 403.568,123.432 C404.47,123.417 405.418,123.41 406.414,123.41 C407.641,123.41 408.665,123.605 409.488,123.995 C410.31,124.384 410.966,124.918 411.457,125.596 C411.947,126.274 412.293,127.071 412.496,127.987 C412.698,128.905 412.798,129.889 412.798,130.942 C412.798,132.384 412.632,133.633 412.301,134.687 C411.969,135.74 411.328,136.634 410.375,137.369 Z" id="Fill-28" fill="#FFFFFF"></path>
            <path d="M426.086,133.95 L426.066,135.509 L426.066,135.53 C426.727,135.502 427.259,135.486 427.662,135.486 L432.667,135.486 C432.667,136.021 432.644,136.432 432.601,136.721 C432.428,137.832 431.692,138.387 430.394,138.387 L424.637,138.387 C424.016,138.387 423.529,138.208 423.176,137.846 C422.822,137.485 422.646,136.994 422.646,136.374 L422.646,123.692 L422.797,123.541 L432.125,123.541 C432.211,123.959 432.255,124.414 432.255,124.904 C432.255,125.394 432.155,125.906 431.953,126.44 L426.066,126.44 L426.086,127.999 L426.086,129.514 C426.46,129.499 426.949,129.492 427.552,129.492 L430.848,129.492 C430.978,129.895 431.043,130.357 431.043,130.877 C431.043,131.396 430.978,131.872 430.848,132.305 L426.086,132.305 L426.086,133.95" id="Fill-29" fill="#FFFFFF"></path>
            <path d="M445.933,125.985 L445.933,130.249 C446.583,130.249 447.138,130.238 447.599,130.217 C448.061,130.196 448.432,130.108 448.714,129.957 C448.996,129.804 449.208,129.59 449.353,129.314 C449.497,129.039 449.57,128.64 449.57,128.118 C449.57,126.71 448.89,126.008 447.535,126.008 C447.203,126.008 446.904,126.008 446.636,126.008 C446.369,126.008 446.135,126.001 445.933,125.985 Z M453.096,128.106 C453.096,128.583 453.024,129.034 452.88,129.459 C452.736,129.886 452.545,130.268 452.306,130.606 C452.069,130.946 451.787,131.242 451.462,131.494 C451.138,131.746 450.802,131.937 450.457,132.067 C451.207,132.342 451.762,133.006 452.123,134.058 L452.772,135.898 C453.017,136.62 453.378,137.153 453.854,137.499 C453.638,137.788 453.313,138.03 452.88,138.225 C452.448,138.42 451.971,138.518 451.452,138.518 C450.933,138.518 450.529,138.369 450.24,138.073 C449.951,137.777 449.684,137.262 449.439,136.525 L448.66,134.253 C448.501,133.82 448.289,133.489 448.021,133.258 C447.754,133.027 447.354,132.911 446.821,132.911 L445.933,132.911 L445.933,138.322 C445.471,138.408 444.894,138.452 444.202,138.452 C443.509,138.452 442.939,138.408 442.492,138.322 L442.492,123.648 L442.644,123.497 C443.899,123.468 444.956,123.447 445.814,123.432 C446.672,123.417 447.346,123.41 447.838,123.41 C448.63,123.41 449.353,123.508 450.001,123.702 C450.651,123.897 451.203,124.189 451.658,124.58 C452.112,124.969 452.465,125.459 452.718,126.051 C452.97,126.643 453.096,127.328 453.096,128.106 Z" id="Fill-30" fill="#FFFFFF"></path>
            <path d="M466.752,132.5 L467.619,132.478 L469.199,132.478 C469.271,132.478 469.397,132.482 469.577,132.489 C469.757,132.497 469.891,132.5 469.978,132.5 L469.61,131.159 C469.263,129.947 468.867,128.46 468.419,126.7 L468.29,126.7 C468.174,127.32 467.828,128.698 467.251,130.834 L466.752,132.5 Z M466.818,135.227 C466.428,135.227 466.14,135.22 465.952,135.206 L465.021,138.343 C464.675,138.43 464.192,138.474 463.572,138.474 C462.878,138.474 462.317,138.394 461.883,138.236 L461.775,138.063 L466.537,123.541 C467.099,123.454 467.755,123.41 468.506,123.41 C469.357,123.41 470.035,123.461 470.541,123.562 L475.215,138.105 C474.709,138.38 474.14,138.518 473.505,138.518 C472.754,138.518 472.229,138.387 471.925,138.126 C471.623,137.868 471.363,137.369 471.146,136.634 L470.735,135.206 C470.547,135.22 470.266,135.227 469.891,135.227 L466.818,135.227 Z" id="Fill-31" fill="#FFFFFF"></path>
            <path d="M489.917,135.4 L493.675,135.4 C493.675,135.978 493.639,136.472 493.568,136.882 C493.495,137.294 493.264,137.648 492.875,137.943 C492.486,138.238 491.973,138.387 491.338,138.387 L486.448,138.387 C485.827,138.387 485.336,138.208 484.975,137.846 C484.615,137.485 484.434,136.994 484.434,136.374 L484.434,123.541 L484.585,123.389 L485.854,123.389 C487.202,123.389 487.875,124.125 487.875,125.596 L487.875,135.486 C488.512,135.43 489.193,135.4 489.917,135.4" id="Fill-32" fill="#FFFFFF"></path>
            <polygon id="Fill-33" fill="#FFFFFE" points="0.745 138.481 181.872 138.481 181.872 10.28 0.745 10.28"></polygon>
            <polyline id="Fill-34" fill="#4D4E4C" points="0.745 10.261 0.745 79.968 72.824 21.809 181.872 69.909 181.872 10.261 0.745 10.261"></polyline>
            <path d="M0.745,79.968 L0.745,129.392 C0.745,129.392 6.511,124.353 17.266,117.208 C22.394,85.339 50.019,60.995 83.334,60.995 C98.428,60.995 112.354,65.993 123.549,74.423 C141.455,71.122 160.969,69.317 181.872,69.909 L72.824,21.809 L0.745,79.968" id="Fill-35" fill="#B4B5B4"></path>
            <path d="M83.334,60.995 C50.019,60.995 22.394,85.339 17.266,117.208 C37.187,103.973 74.241,83.512 123.549,74.423 C112.354,65.993 98.428,60.995 83.334,60.995" id="Fill-36" fill="#1A1919"></path>
            <path d="M123.549,74.423 C74.241,83.512 37.187,103.973 17.266,117.208 C6.511,124.353 0.745,129.392 0.745,129.392 L0.745,138.5 C0.745,138.5 6.045,134.077 16.409,127.967 C37.426,115.576 79.299,96.235 140.247,92.697 C153.258,91.941 167.139,91.906 181.872,92.813 L181.872,69.909 C160.969,69.317 141.455,71.122 123.549,74.423" id="Fill-37" fill="#FFFFFE"></path>
            <path d="M140.247,92.697 C79.299,96.235 37.426,115.576 16.409,127.967 C6.045,134.077 0.745,138.5 0.745,138.5 L181.872,138.5 L181.872,92.813 C167.139,91.906 153.258,91.941 140.247,92.697" id="Fill-38" fill="#4D4E4C"></path>
        </g>
    </g>
</svg>