<?xml version="1.0" encoding="iso-8859-1"?>
<svg xmlns="http://www.w3.org/2000/svg" xmlns:xlink="http://www.w3.org/1999/xlink" version="1.1" id="Capa_1" x="0px" y="0px" viewBox="0 0 512 512" style="enable-background:new 0 0 512 512;" xml:space="preserve" width="512px" height="512px">
<g>
	<g>
		<path d="M442,126c-38.598,0-70,31.402-70,70c0,11.403,2.73,22.426,7.876,32.296l-27.557,26.669C341.973,249.12,330.25,246,318,246    c-12.243,0-23.962,3.118-34.308,8.961l-27.565-26.672C261.271,218.424,264,207.403,264,196c0-38.598-31.402-70-70-70    c-38.598,0-70,31.402-70,70c0,11.406,2.73,22.429,7.871,32.29l-27.563,26.67C93.962,249.118,82.244,246,70,246    c-38.598,0-70,31.402-70,70c0,38.598,31.402,70,70,70s70-31.402,70-70c0-11.402-2.73-22.426-7.876-32.295l27.561-26.668    C170.027,262.881,181.748,266,194,266c12.255,0,23.979-3.121,34.317-8.961l27.559,26.666C250.73,293.574,248,304.597,248,316    c0,38.598,31.402,70,70,70c38.598,0,70-31.402,70-70c0-11.401-2.728-22.421-7.868-32.285l27.562-26.674    C418.039,262.882,429.757,266,442,266c38.598,0,70-31.402,70-70C512,157.402,480.598,126,442,126z M70,346    c-16.542,0-30-13.458-30-30s13.458-30,30-30c16.729,0,30,13.622,30,30C100,332.542,86.542,346,70,346z M194,226    c-16.662,0-30-13.539-30-30c0-16.542,13.458-30,30-30s30,13.458,30,30C224,212.376,210.748,226,194,226z M318,346    c-16.542,0-30-13.458-30-30c0-16.401,13.266-30,30-30c16.619,0,30,13.51,30,30C348,332.542,334.542,346,318,346z M442,226    c-16.797,0-30-13.691-30-30c0-16.542,13.458-30,30-30s30,13.458,30,30S458.542,226,442,226z" fill="#FFFFFF"/>
	</g>
</g>
<g>
</g>
<g>
</g>
<g>
</g>
<g>
</g>
<g>
</g>
<g>
</g>
<g>
</g>
<g>
</g>
<g>
</g>
<g>
</g>
<g>
</g>
<g>
</g>
<g>
</g>
<g>
</g>
<g>
</g>
</svg>
