<?xml version="1.0" standalone="no"?>
<!DOCTYPE svg PUBLIC "-//W3C//DTD SVG 20010904//EN"
 "http://www.w3.org/TR/2001/REC-SVG-20010904/DTD/svg10.dtd">
<svg version="1.0" xmlns="http://www.w3.org/2000/svg"
 width="624.000000pt" height="624.000000pt" viewBox="0 0 624.000000 624.000000"
 preserveAspectRatio="xMidYMid meet">
<metadata>
Created by potrace 1.11, written by Peter Selinger 2001-2013
</metadata>
<g transform="translate(0.000000,624.000000) scale(0.100000,-0.100000)"
fill="#000000" stroke="none">
<path d="M2977 6235 c-1 -2 -50 -5 -109 -9 -59 -3 -113 -8 -120 -11 -7 -2 -35
-6 -63 -9 -47 -6 -74 -10 -127 -20 -146 -29 -181 -37 -187 -41 -4 -2 -22 -7
-39 -10 -16 -3 -79 -20 -139 -39 -371 -116 -714 -299 -1023 -545 -140 -111
-433 -407 -499 -504 -8 -12 -18 -24 -21 -27 -15 -12 -146 -202 -195 -282 -178
-292 -341 -716 -394 -1028 -6 -36 -13 -76 -16 -90 -3 -14 -8 -52 -11 -85 -4
-33 -8 -63 -10 -66 -7 -13 -18 -230 -18 -354 1 -123 9 -284 19 -350 10 -73 25
-172 29 -190 6 -31 18 -104 18 -112 0 -5 4 -18 9 -31 5 -13 11 -37 14 -55 11
-62 85 -295 128 -403 52 -128 123 -278 174 -366 20 -35 41 -72 47 -83 39 -70
164 -248 245 -350 426 -534 1038 -924 1695 -1081 118 -28 119 -28 186 -39 25
-4 52 -9 60 -10 56 -10 108 -16 250 -30 64 -7 419 -7 470 -1 19 2 67 7 105 11
39 3 77 8 85 10 8 2 38 6 65 10 170 21 425 89 635 168 580 221 1112 646 1468
1173 170 252 318 568 402 859 18 61 34 117 35 125 33 148 48 229 61 325 3 28
8 59 10 70 22 114 22 581 0 705 -2 14 -7 48 -10 75 -3 28 -11 77 -17 110 -5
33 -13 74 -15 90 -19 107 -118 442 -154 520 -5 11 -29 66 -54 123 -63 145
-157 316 -255 462 -46 69 -86 127 -90 130 -4 3 -18 21 -31 40 -14 19 -34 46
-46 60 -12 14 -41 48 -64 75 -153 180 -378 384 -570 516 -36 24 -67 46 -70 49
-3 3 -55 36 -116 72 -122 73 -250 139 -364 187 -41 18 -84 36 -95 41 -11 5
-40 16 -65 25 -25 9 -63 22 -85 30 -139 48 -415 114 -550 130 -27 4 -61 8 -75
10 -86 13 -501 29 -513 20z"/>
</g>
</svg>
