<?xml version="1.0" encoding="UTF-8"?>
<svg width="54px" height="54px" viewBox="0 0 54 54" version="1.1" xmlns="http://www.w3.org/2000/svg" xmlns:xlink="http://www.w3.org/1999/xlink">
    <!-- Generator: Sketch 51 (57462) - http://www.bohemiancoding.com/sketch -->
    <title>ico_svg_wrong_empty</title>
    <desc>Created with Sketch.</desc>
    <defs></defs>
    <g id="Page-1" stroke="none" stroke-width="1" fill="none" fill-rule="evenodd">
        <g id="ico_svg_wrong_empty" transform="translate(1.000000, 1.000000)" fill="#D80027" fill-rule="nonzero" stroke="#AA0422">
            <path d="M48.4622232,12.9352073 C46.1396355,8.95620046 42.9891936,5.80575854 39.0100683,3.48328929 C35.0302323,1.1609385 30.6856856,0 25.9731116,0 C21.2610114,0 16.9151617,1.1609385 12.9360364,3.48328929 C8.95667426,5.80540319 5.80623235,8.9558451 3.48364465,12.9352073 C1.1609385,16.9148064 0,21.260656 0,25.9724009 C0,30.6843827 1.16129385,35.0295216 3.48328929,39.0093576 C5.80575854,42.9883645 8.95620046,46.1388064 12.9355626,48.4615125 C16.9151617,50.7837449 21.260656,51.9448018 25.9726378,51.9448018 C30.6846196,51.9448018 35.0305877,50.7837449 39.0099499,48.4615125 C42.9890752,46.1396355 46.1393986,42.9883645 48.4617494,39.0093576 C50.7837449,35.029877 51.9445649,30.6841458 51.9445649,25.9724009 C51.9446834,21.2601822 50.7837449,16.9142141 48.4622232,12.9352073 Z" id="Shape"></path>
        </g>
    </g>
</svg>