<?xml version="1.0" encoding="UTF-8"?>
<svg width="100px" height="100px" viewBox="0 0 100 100" version="1.1" xmlns="http://www.w3.org/2000/svg" xmlns:xlink="http://www.w3.org/1999/xlink">
    <!-- Generator: Sketch 51 (57462) - http://www.bohemiancoding.com/sketch -->
    <title>ico_search_black</title>
    <desc>Created with Sketch.</desc>
    <defs>
        <linearGradient x1="87.4904136%" y1="87.4705309%" x2="36.5679741%" y2="36.5488984%" id="linearGradient-1">
            <stop stop-color="#97AAAA" offset="0%"></stop>
            <stop stop-color="#E8EFEE" offset="100%"></stop>
        </linearGradient>
        <radialGradient cx="52.9764501%" cy="53.6835888%" fx="52.9764501%" fy="53.6835888%" r="48.9082167%" id="radialGradient-2">
            <stop stop-color="#FFFFFF" stop-opacity="0" offset="0.01%"></stop>
            <stop stop-color="#FDFDFD" stop-opacity="0.482" offset="48.2%"></stop>
            <stop stop-color="#F6F7F7" stop-opacity="0.655" offset="65.6%"></stop>
            <stop stop-color="#EBEDEC" stop-opacity="0.779" offset="77.9%"></stop>
            <stop stop-color="#DADDDD" stop-opacity="0.879" offset="87.9%"></stop>
            <stop stop-color="#C4CAC9" stop-opacity="0.964" offset="96.4%"></stop>
            <stop stop-color="#B8BFBE" offset="100%"></stop>
        </radialGradient>
        <linearGradient x1="50.0025186%" y1="9.16896898%" x2="50.0025186%" y2="122.914925%" id="linearGradient-3">
            <stop stop-color="#5B6A6A" offset="0%"></stop>
            <stop stop-color="#303033" offset="100%"></stop>
        </linearGradient>
        <linearGradient x1="41.0685754%" y1="45.4860779%" x2="62.3441972%" y2="66.7615821%" id="linearGradient-4">
            <stop stop-color="#5B6A6A" offset="0%"></stop>
            <stop stop-color="#303033" offset="100%"></stop>
        </linearGradient>
        <linearGradient x1="31.0661957%" y1="68.9323217%" x2="71.4551424%" y2="28.5441159%" id="linearGradient-5">
            <stop stop-color="#97AAAA" offset="0%"></stop>
            <stop stop-color="#E8EFEE" offset="100%"></stop>
        </linearGradient>
        <linearGradient x1="95.3254247%" y1="4.6766194%" x2="-12.2190634%" y2="112.206929%" id="linearGradient-6">
            <stop stop-color="#97AAAA" offset="0%"></stop>
            <stop stop-color="#E8EFEE" offset="100%"></stop>
        </linearGradient>
        <linearGradient x1="11.8066884%" y1="88.1890068%" x2="93.2765538%" y2="6.71914139%" id="linearGradient-7">
            <stop stop-color="#97AAAA" offset="0%"></stop>
            <stop stop-color="#E8EFEE" offset="100%"></stop>
        </linearGradient>
    </defs>
    <g id="Page-1" stroke="none" stroke-width="1" fill="none" fill-rule="evenodd">
        <g id="icons" transform="translate(-9197.000000, -676.000000)" fill-rule="nonzero">
            <g id="ico_search_black" transform="translate(9197.000000, 676.000000)">
                <polygon id="Shape" fill="url(#linearGradient-1)" points="35.4240234 71.1742187 28.8257812 64.5757812 34.5503906 58.8509766 41.1488281 65.4496094"></polygon>
                <circle id="Oval" fill="url(#radialGradient-2)" cx="62.64375" cy="37.35625" r="35.0646484"></circle>
                <path d="M62.64375,0 C42.0125,0 25.2875,16.725 25.2875,37.35625 C25.2875,57.9875 42.0125,74.7125 62.64375,74.7125 C83.275,74.7125 100,57.9876953 100,37.35625 C100,16.7248047 83.275,0 62.64375,0 Z M62.64375,68.5150391 C45.4351562,68.5150391 31.4849609,54.5648438 31.4849609,37.35625 C31.4849609,20.1476563 45.4351562,6.19746094 62.64375,6.19746094 C79.8523437,6.19746094 93.8025391,20.1478516 93.8025391,37.35625 C93.8025391,54.5646484 79.8519531,68.5150391 62.64375,68.5150391 Z" id="Shape" fill="url(#linearGradient-3)"></path>
                <path d="M5.10039063,98.8955078 L1.10449219,94.8996094 C-0.368164062,93.4269531 -0.368164062,91.0390625 1.10449219,89.5662109 L26.0019531,64.66875 L35.3310547,73.9978516 L10.4337891,98.8955078 C8.9609375,100.368164 6.57304688,100.368164 5.10039063,98.8955078 Z" id="Shape" fill="url(#linearGradient-4)"></path>
                <path d="M29.4783203,61.9455078 L38.0546875,70.521875 C39.4142578,71.8814453 39.4142578,74.0857422 38.0546875,75.4455078 L37.6238281,75.8763672 C36.2642578,77.2359375 34.0599609,77.2359375 32.7001953,75.8763672 L24.1238281,67.3 C22.7642578,65.9404297 22.7642578,63.7361328 24.1238281,62.3763672 L24.5546875,61.9455078 C25.9142578,60.5855469 28.1185547,60.5855469 29.4783203,61.9455078 Z" id="Shape" fill="url(#linearGradient-5)"></path>
                <path d="M31.0652344,63.5322266 L36.4677734,68.9347656 C37.6109375,70.0779297 37.6109375,71.9310547 36.4677734,73.0742188 L35.2525391,74.2894531 C34.109375,75.4326172 32.25625,75.4326172 31.1130859,74.2894531 L25.7105469,68.8869141 C24.5673828,67.74375 24.5673828,65.890625 25.7105469,64.7474609 L26.9257812,63.5322266 C28.0689453,62.3894531 29.9222656,62.3894531 31.0652344,63.5322266 Z" id="Shape" fill="url(#linearGradient-6)"></path>
                <path d="M33.0513672,65.5185547 L34.4814453,66.9486328 C35.2367188,67.7039063 35.2367188,68.928125 34.4814453,69.6832031 L31.8617188,72.3029297 C31.1064453,73.0582031 29.8822266,73.0582031 29.1271484,72.3029297 L27.6970703,70.8728516 C26.9417969,70.1175781 26.9417969,68.8933594 27.6970703,68.1382812 L30.3167969,65.5185547 C31.0720703,64.7632813 32.2962891,64.7632813 33.0513672,65.5185547 Z" id="Shape" fill="url(#linearGradient-7)"></path>
            </g>
        </g>
    </g>
</svg>