[
    {
        "codigo": "1",
        "nombre": "Arroz",
        "distribuidor": "Arroz de Boyacá",
        "precio": 2500
    },
    {
        "codigo": "2",
        "nombre": "Chocolate",
        "distribuidor": "Chocolate de Boyacá",
        "precio": 1500,
        "Calorias":25
    },
    {
        "codigo": "3",
        "nombre": "Papa",
        "precio": 2600
    }
]