{
	"sites": 
	[
		"http://www.paginalucrativa.com.br/?id=41635", 
		"http://www.paudefogo.com.br", 
		"http://www.csvidatv.com.br", 
		"http://www.morangovip.com.br"
	], 
	
	"callback": "http://calback.com.br/teste"
}