{
  "data": [
    {
      "id": 6,
      "body": "Praesent in varius sapien. Donec blandit congue ultrices. In hendrerit, urna sit amet vestibulum convallis, metus justo iaculis \nnibh, eu dictum neque nulla ac arcu. Integer eget purus id felis dignissim aliquam scelerisque eu metus. Nam pellentesque euismod \ntristique. Nullam luctus fermentum consequat. Etiam condimentum ultricies neque ac consequat. Morbi imperdiet convallis mattis. \nFusce vestibulum enim ornare, aliquam mi quis, tristique diam. Nulla mollis lectus et leo euismod, sed malesuada libero ullamcorper. \nCurabitur sit amet odio in neque bibendum facilisis at ac leo. Vestibulum molestie nibh libero, vel euismod justo bibendum sit amet. Fusce eget faucibus arcu.",
      "author_id": 1,
      "created_at": "2020-07-06T15:14:32.000000Z",
      "updated_at": "2020-07-06T15:14:32.000000Z",
      "comments_count": 0,
      "favorites_count": 0,
      "is_favorite": false,
      "author": {
        "id": 1,
        "full_name": "Geovanny Reilly",
        "email": "durgan.justice@example.net",
        "phone_number": "6397714215907",
        "created_at": "2020-07-05T06:39:23.000000Z",
        "updated_at": "2020-07-05T06:39:23.000000Z",
        "email_verified": true,
        "phone_number_verified": false,
        "verified": true,
        "avatar_permanent_url": "http://baseplate-api.test/api/v1/users/1/avatar",
        "avatar_permanent_thumb_url": "http://baseplate-api.test/api/v1/users/1/avatar/thumb",
        "mine": true,
        "avatar": null
      },
      "photo": {
        "id": 35,
        "name": "272725",
        "file_name": "272725.jpg",
        "collection_name": "post_attachment_collection",
        "mime_type": "image/jpeg",
        "size": 560742,
        "created_at": "2020-07-06T15:14:32.000000Z",
        "url": "http://localhost/storage/35/272725.jpg",
        "thumb_url": "http://localhost/storage/35/conversions/272725-thumb.jpg"
      }
    },
    {
      "id": 5,
      "body": "Praesent in varius sapien. Donec blandit congue ultrices. In hendrerit, urna sit amet vestibulum convallis, metus justo iaculis \nnibh, eu dictum neque nulla ac arcu. Integer eget purus id felis dignissim aliquam scelerisque eu metus. Nam pellentesque euismod \ntristique. Nullam luctus fermentum consequat. Etiam condimentum ultricies neque ac consequat. Morbi imperdiet convallis mattis. \nFusce vestibulum enim ornare, aliquam mi quis, tristique diam. Nulla mollis lectus et leo euismod, sed malesuada libero ullamcorper. \nCurabitur sit amet odio in neque bibendum facilisis at ac leo. Vestibulum molestie nibh libero, vel euismod justo bibendum sit amet. Fusce eget faucibus arcu.",
      "author_id": 1,
      "created_at": "2020-07-06T14:56:55.000000Z",
      "updated_at": "2020-07-06T14:56:55.000000Z",
      "comments_count": 0,
      "favorites_count": 0,
      "is_favorite": false,
      "author": {
        "id": 1,
        "full_name": "Geovanny Reilly",
        "email": "durgan.justice@example.net",
        "phone_number": "6397714215907",
        "created_at": "2020-07-05T06:39:23.000000Z",
        "updated_at": "2020-07-05T06:39:23.000000Z",
        "email_verified": true,
        "phone_number_verified": false,
        "verified": true,
        "avatar_permanent_url": "http://baseplate-api.test/api/v1/users/1/avatar",
        "avatar_permanent_thumb_url": "http://baseplate-api.test/api/v1/users/1/avatar/thumb",
        "mine": true,
        "avatar": null
      },
      "photo": {
        "id": 29,
        "name": "272725",
        "file_name": "272725.jpg",
        "collection_name": "post_attachment_collection",
        "mime_type": "image/jpeg",
        "size": 560742,
        "created_at": "2020-07-06T14:41:16.000000Z",
        "url": "http://localhost/storage/29/272725.jpg",
        "thumb_url": "http://localhost/storage/29/conversions/272725-thumb.jpg"
      }
    },
    {
      "id": 4,
      "body": "Aliquam vitae est aliquam, tempor purus non, finibus ante. Sed tellus ipsum, maximus id sapien et, mollis pharetra nisi. \nMaecenas nunc purus, fermentum vitae tortor et, viverra fermentum neque. Nulla nec velit et leo tempus dapibus. Ut gravida \nleo leo, nec venenatis leo euismod id.",
      "author_id": 1,
      "created_at": "2020-07-06T14:44:21.000000Z",
      "updated_at": "2020-07-06T14:44:21.000000Z",
      "comments_count": 0,
      "favorites_count": 0,
      "is_favorite": false,
      "author": {
        "id": 1,
        "full_name": "Geovanny Reilly",
        "email": "durgan.justice@example.net",
        "phone_number": "6397714215907",
        "created_at": "2020-07-05T06:39:23.000000Z",
        "updated_at": "2020-07-05T06:39:23.000000Z",
        "email_verified": true,
        "phone_number_verified": false,
        "verified": true,
        "avatar_permanent_url": "http://baseplate-api.test/api/v1/users/1/avatar",
        "avatar_permanent_thumb_url": "http://baseplate-api.test/api/v1/users/1/avatar/thumb",
        "mine": true,
        "avatar": null
      },
      "photo": {
        "id": 28,
        "name": "272725",
        "file_name": "272725.jpg",
        "collection_name": "post_attachment_collection",
        "mime_type": "image/jpeg",
        "size": 560742,
        "created_at": "2020-07-06T14:36:52.000000Z",
        "url": "http://localhost/storage/28/272725.jpg",
        "thumb_url": "http://localhost/storage/28/conversions/272725-thumb.jpg"
      }
    },
    {
      "id": 3,
      "body": "Nulla sagittis euismod nunc eu volutpat. Nulla consectetur dui et sapien viverra pulvinar. Etiam metus tellus, fermentum \nat mollis quis, lobortis sed lectus. Duis nec velit in tellus finibus molestie sit amet et sem. In pharetra sodales felis \nut venenatis. Cras accumsan massa ac scelerisque aliquam. Proin ullamcorper interdum elit, quis blandit velit porttitor \nsuscipit. Morbi in rutrum augue.",
      "author_id": 3,
      "created_at": "2020-07-06T14:44:13.000000Z",
      "updated_at": "2020-07-06T14:44:13.000000Z",
      "comments_count": 0,
      "favorites_count": 0,
      "is_favorite": false,
      "author": {
        "id": 3,
        "full_name": "Adrianna Quitzon",
        "email": "lexi58@example.org",
        "phone_number": "6397006730368",
        "created_at": "2020-07-05T06:39:23.000000Z",
        "updated_at": "2020-07-05T06:39:23.000000Z",
        "email_verified": true,
        "phone_number_verified": false,
        "verified": true,
        "avatar_permanent_url": "http://baseplate-api.test/api/v1/users/3/avatar",
        "avatar_permanent_thumb_url": "http://baseplate-api.test/api/v1/users/3/avatar/thumb",
        "mine": false,
        "avatar": null
      },
      "photo": {
        "id": 27,
        "name": "272725",
        "file_name": "272725.jpg",
        "collection_name": "post_attachment_collection",
        "mime_type": "image/jpeg",
        "size": 560742,
        "created_at": "2020-07-06T14:36:06.000000Z",
        "url": "http://localhost/storage/27/272725.jpg",
        "thumb_url": "http://localhost/storage/27/conversions/272725-thumb.jpg"
      }
    },
    {
      "id": 2,
      "body": "Suspendisse lobortis lacinia enim, at euismod lectus porta non. Phasellus ultricies eros quis sapien sodales sodales. \nSuspendisse tempor nisl nec rutrum tempor. Sed at ipsum purus. Sed bibendum euismod odio id tincidunt. In vel dolor at \nnisl lacinia tristique. Pellentesque efficitur imperdiet libero eget maximus. Mauris tempor, quam vel ornare imperdiet, \nnunc nunc convallis lorem, sit amet convallis enim enim at odio. Etiam euismod, lacus id tristique facilisis, ex lectus \ndignissim elit, quis ornare massa odio vitae enim. Nullam id mattis sem, ac molestie neque. Cras egestas, sapien at \niaculis tincidunt, nisi magna tincidunt lorem, et ullamcorper erat augue sed ligula.",
      "author_id": 2,
      "created_at": "2020-07-06T14:43:59.000000Z",
      "updated_at": "2020-07-06T14:43:59.000000Z",
      "comments_count": 0,
      "favorites_count": 0,
      "is_favorite": false,
      "author": {
        "id": 2,
        "full_name": "Joesph Gibson",
        "email": "gutkowski.marc@example.org",
        "phone_number": "6393322511677",
        "created_at": "2020-07-05T06:39:23.000000Z",
        "updated_at": "2020-07-05T06:39:23.000000Z",
        "email_verified": true,
        "phone_number_verified": false,
        "verified": true,
        "avatar_permanent_url": "http://baseplate-api.test/api/v1/users/2/avatar",
        "avatar_permanent_thumb_url": "http://baseplate-api.test/api/v1/users/2/avatar/thumb",
        "mine": false,
        "avatar": null
      },
      "photo": {
        "id": 26,
        "name": "272725",
        "file_name": "272725.jpg",
        "collection_name": "post_attachment_collection",
        "mime_type": "image/jpeg",
        "size": 560742,
        "created_at": "2020-07-06T14:35:39.000000Z",
        "url": "http://localhost/storage/26/272725.jpg",
        "thumb_url": "http://localhost/storage/26/conversions/272725-thumb.jpg"
      }
    },
    {
      "id": 1,
      "body": "Hello World",
      "author_id": 1,
      "created_at": "2020-07-06T14:43:19.000000Z",
      "updated_at": "2020-07-06T15:20:41.000000Z",
      "comments_count": 0,
      "favorites_count": 0,
      "is_favorite": false,
      "author": {
        "id": 1,
        "full_name": "Geovanny Reilly",
        "email": "durgan.justice@example.net",
        "phone_number": "6397714215907",
        "created_at": "2020-07-05T06:39:23.000000Z",
        "updated_at": "2020-07-05T06:39:23.000000Z",
        "email_verified": true,
        "phone_number_verified": false,
        "verified": true,
        "avatar_permanent_url": "http://baseplate-api.test/api/v1/users/1/avatar",
        "avatar_permanent_thumb_url": "http://baseplate-api.test/api/v1/users/1/avatar/thumb",
        "mine": true,
        "avatar": null
      },
      "photo": {
        "id": 25,
        "name": "272725",
        "file_name": "272725.jpg",
        "collection_name": "post_attachment_collection",
        "mime_type": "image/jpeg",
        "size": 560742,
        "created_at": "2020-07-06T14:35:22.000000Z",
        "url": "http://localhost/storage/25/272725.jpg",
        "thumb_url": "http://localhost/storage/25/conversions/272725-thumb.jpg"
      }
    }
  ],
  "links": {
    "first": "http://baseplate-api.test/api/v1/posts?page=1",
    "last": "http://baseplate-api.test/api/v1/posts?page=1",
    "prev": null,
    "next": null
  },
  "meta": {
    "current_page": 1,
    "from": 1,
    "last_page": 1,
    "path": "http://baseplate-api.test/api/v1/posts",
    "per_page": 10,
    "to": 6,
    "total": 6
  },
  "http_status": 200,
  "success": true
}
