{
  "object": "list",
  "url": "/v1/accounts/acct_1032D82eZvKYlo2C/external_accounts",
  "has_more": false,
  "data": [
    {
      "id": "ba_1HbqTk2eZvKYlo2CrqtD86JN",
      "object": "bank_account",
      "account_holder_name": "Jane Austen",
      "account_holder_type": "individual",
      "bank_name": "STRIPE TEST BANK",
      "country": "US",
      "currency": "usd",
      "fingerprint": "1JWtPxqbdX5Gamtc",
      "last4": "6789",
      "metadata": {},
      "routing_number": "110000000",
      "status": "new",
      "account": "acct_1032D82eZvKYlo2C"
    },
    {
      "id": "ba_1HbqTk2eZvKYlo2CrqtD86JN",
      "object": "bank_account",
      "account_holder_name": "Jane Austen",
      "account_holder_type": "individual",
      "bank_name": "STRIPE TEST BANK",
      "country": "US",
      "currency": "usd",
      "fingerprint": "1JWtPxqbdX5Gamtc",
      "last4": "6789",
      "metadata": {},
      "routing_number": "110000000",
      "status": "new",
      "account": "acct_1032D82eZvKYlo2C"
    }
  ],
  "http_status": 200,
  "success": true
}
