{
  "data": {
    "id": 27,
    "name": "d94edc981e4baf728c5eb7a93b75444d",
    "file_name": "d94edc981e4baf728c5eb7a93b75444d.jpeg",
    "collection_name": "avatar",
    "mime_type": "image/jpeg",
    "size": 81423,
    "created_at": "2020-04-30T03:24:52.000000Z",
    "url": "https://baseplate-api.test/storage/27/d94edc981e4baf728c5eb7a93b75444d.jpeg",
    "thumb_url": "https://baseplate-api.test/storage/27/conversions/d94edc981e4baf728c5eb7a93b75444d-thumb.jpg"
  },
  "http_status": 201,
  "success": true
}
