{
  "data": [
    {
      "id": "f8cdaa2e-4131-4a2e-a609-ce23e5cbdf61",
      "type": "follow",
      "notifiable_id": 2,
      "actor_id": 93,
      "message": "Icie Abshire III started following you",
      "read_at": null,
      "read": false,
      "created_at": "2020-06-25T02:54:04.000000Z",
      "notifiable": {
        "id": 2,
        "full_name": "Dr. Amalia Schultz MD",
        "email": "kszyr.vercobrador@appetiser.com.au",
        "phone_number": "6396152442551",
        "created_at": "2020-05-28T01:06:00.000000Z",
        "updated_at": "2020-06-05T07:41:34.000000Z",
        "email_verified": true,
        "phone_number_verified": false,
        "verified": true,
        "avatar_permanent_url": "https://baseplate.test/api/v1/users/2/avatar",
        "avatar_permanent_thumb_url": "https://baseplate.test/api/v1/users/2/avatar/thumb",
        "mine": true,
        "avatar": {
          "id": 1,
          "name": "457356df2cd688363088c837c5bd21f0",
          "file_name": "457356df2cd688363088c837c5bd21f0.jpeg",
          "collection_name": "avatar",
          "mime_type": "image/jpeg",
          "size": 81423,
          "created_at": "2020-06-22T07:04:15.000000Z",
          "url": "http://localhost:8000/storage/1/457356df2cd688363088c837c5bd21f0.jpeg",
          "thumb_url": "http://localhost:8000/storage/1/conversions/457356df2cd688363088c837c5bd21f0-thumb.jpg"
        }
      },
      "actor": {
        "id": 93,
        "full_name": "Icie Abshire III",
        "email": "ereynolds@example.com",
        "phone_number": "6392731311826",
        "created_at": "2020-05-28T01:06:01.000000Z",
        "updated_at": "2020-05-28T01:06:01.000000Z",
        "email_verified": true,
        "phone_number_verified": false,
        "verified": true,
        "avatar_permanent_url": "https://baseplate.test/api/v1/users/93/avatar",
        "avatar_permanent_thumb_url": "https://baseplate.test/api/v1/users/93/avatar/thumb",
        "mine": false,
        "avatar": null
      }
    },
    {
      "id": "691a5ef5-c46b-427e-9932-3abd4b0e4e9a",
      "type": "like",
      "notifiable_id": 2,
      "actor_id": 42,
      "message": "Marisa Mosciski liked your post",
      "read_at": null,
      "read": false,
      "created_at": "2020-06-25T02:53:51.000000Z",
      "notifiable": {
        "id": 2,
        "full_name": "Dr. Amalia Schultz MD",
        "email": "kszyr.vercobrador@appetiser.com.au",
        "phone_number": "6396152442551",
        "created_at": "2020-05-28T01:06:00.000000Z",
        "updated_at": "2020-06-05T07:41:34.000000Z",
        "email_verified": true,
        "phone_number_verified": false,
        "verified": true,
        "avatar_permanent_url": "https://baseplate.test/api/v1/users/2/avatar",
        "avatar_permanent_thumb_url": "https://baseplate.test/api/v1/users/2/avatar/thumb",
        "mine": true,
        "avatar": {
          "id": 1,
          "name": "457356df2cd688363088c837c5bd21f0",
          "file_name": "457356df2cd688363088c837c5bd21f0.jpeg",
          "collection_name": "avatar",
          "mime_type": "image/jpeg",
          "size": 81423,
          "created_at": "2020-06-22T07:04:15.000000Z",
          "url": "http://localhost:8000/storage/1/457356df2cd688363088c837c5bd21f0.jpeg",
          "thumb_url": "http://localhost:8000/storage/1/conversions/457356df2cd688363088c837c5bd21f0-thumb.jpg"
        }
      },
      "actor": {
        "id": 42,
        "full_name": "Marisa Mosciski",
        "email": "mbahringer@example.com",
        "phone_number": "6397435284846",
        "created_at": "2020-05-28T01:06:01.000000Z",
        "updated_at": "2020-05-28T01:06:01.000000Z",
        "email_verified": true,
        "phone_number_verified": false,
        "verified": true,
        "avatar_permanent_url": "https://baseplate.test/api/v1/users/42/avatar",
        "avatar_permanent_thumb_url": "https://baseplate.test/api/v1/users/42/avatar/thumb",
        "mine": false,
        "avatar": null
      }
    },
    {
      "id": "5e7fbed9-7e50-4beb-973f-ad9a03ac1b26",
      "type": "like",
      "notifiable_id": 2,
      "actor_id": 74,
      "message": "Robyn Effertz V liked your post",
      "read_at": null,
      "read": false,
      "created_at": "2020-06-25T02:48:30.000000Z",
      "notifiable": {
        "id": 2,
        "full_name": "Dr. Amalia Schultz MD",
        "email": "kszyr.vercobrador@appetiser.com.au",
        "phone_number": "6396152442551",
        "created_at": "2020-05-28T01:06:00.000000Z",
        "updated_at": "2020-06-05T07:41:34.000000Z",
        "email_verified": true,
        "phone_number_verified": false,
        "verified": true,
        "avatar_permanent_url": "https://baseplate.test/api/v1/users/2/avatar",
        "avatar_permanent_thumb_url": "https://baseplate.test/api/v1/users/2/avatar/thumb",
        "mine": true,
        "avatar": {
          "id": 1,
          "name": "457356df2cd688363088c837c5bd21f0",
          "file_name": "457356df2cd688363088c837c5bd21f0.jpeg",
          "collection_name": "avatar",
          "mime_type": "image/jpeg",
          "size": 81423,
          "created_at": "2020-06-22T07:04:15.000000Z",
          "url": "http://localhost:8000/storage/1/457356df2cd688363088c837c5bd21f0.jpeg",
          "thumb_url": "http://localhost:8000/storage/1/conversions/457356df2cd688363088c837c5bd21f0-thumb.jpg"
        }
      },
      "actor": {
        "id": 74,
        "full_name": "Robyn Effertz V",
        "email": "rubie91@example.net",
        "phone_number": "6399117386527",
        "created_at": "2020-05-28T01:06:01.000000Z",
        "updated_at": "2020-05-28T01:06:01.000000Z",
        "email_verified": true,
        "phone_number_verified": false,
        "verified": true,
        "avatar_permanent_url": "https://baseplate.test/api/v1/users/74/avatar",
        "avatar_permanent_thumb_url": "https://baseplate.test/api/v1/users/74/avatar/thumb",
        "mine": false,
        "avatar": null
      }
    }
  ],
  "links": {
    "first": "https://baseplate.test/api/v1/notifications/unread?page=1",
    "last": "https://baseplate.test/api/v1/notifications/unread?page=1",
    "prev": null,
    "next": null
  },
  "meta": {
    "current_page": 1,
    "from": 1,
    "last_page": 1,
    "path": "https://baseplate.test/api/v1/notifications/unread",
    "per_page": 10,
    "to": 3,
    "total": 3
  },
  "http_status": 200,
  "success": true
}
