{
  "data": [
    {
      "id": 9,
      "body": "Aliquam vitae est aliquam, tempor purus non, finibus ante. Sed tellus ipsum, maximus id sapien et, mollis pharetra nisi. \nMaecenas nunc purus, fermentum vitae tortor et, viverra fermentum neque. Nulla nec velit et leo tempus dapibus. Ut gravida \nleo leo, nec venenatis leo euismod id.",
      "author_id": 1,
      "created_at": "2020-07-06T16:03:58.000000Z",
      "updated_at": "2020-07-06T16:03:58.000000Z",
      "author": {
        "id": 1,
        "full_name": "Geovanny Reilly",
        "email": "durgan.justice@example.net",
        "phone_number": "6397714215907",
        "created_at": "2020-07-05T06:39:23.000000Z",
        "updated_at": "2020-07-05T06:39:23.000000Z",
        "email_verified": true,
        "phone_number_verified": false,
        "verified": true,
        "avatar_permanent_url": "http://baseplate-api.test/api/v1/users/1/avatar",
        "avatar_permanent_thumb_url": "http://baseplate-api.test/api/v1/users/1/avatar/thumb",
        "mine": true,
        "avatar": null
      },
      "responses": []
    },
    {
      "id": 7,
      "body": "Aliquam vitae est aliquam, tempor purus non, finibus ante. Sed tellus ipsum, maximus id sapien et, mollis pharetra nisi. \nMaecenas nunc purus, fermentum vitae tortor et, viverra fermentum neque. Nulla nec velit et leo tempus dapibus. Ut gravida \nleo leo, nec venenatis leo euismod id.",
      "author_id": 1,
      "created_at": "2020-07-06T15:46:11.000000Z",
      "updated_at": "2020-07-06T15:46:11.000000Z",
      "author": {
        "id": 1,
        "full_name": "Geovanny Reilly",
        "email": "durgan.justice@example.net",
        "phone_number": "6397714215907",
        "created_at": "2020-07-05T06:39:23.000000Z",
        "updated_at": "2020-07-05T06:39:23.000000Z",
        "email_verified": true,
        "phone_number_verified": false,
        "verified": true,
        "avatar_permanent_url": "http://baseplate-api.test/api/v1/users/1/avatar",
        "avatar_permanent_thumb_url": "http://baseplate-api.test/api/v1/users/1/avatar/thumb",
        "mine": true,
        "avatar": null
      },
      "responses": [
        {
          "id": 8,
          "body": "Good Evening!",
          "author_id": 1,
          "created_at": "2020-07-06T16:03:45.000000Z",
          "updated_at": "2020-07-06T16:03:45.000000Z",
          "author": {
            "id": 1,
            "full_name": "Geovanny Reilly",
            "email": "durgan.justice@example.net",
            "phone_number": "6397714215907",
            "created_at": "2020-07-05T06:39:23.000000Z",
            "updated_at": "2020-07-05T06:39:23.000000Z",
            "email_verified": true,
            "phone_number_verified": false,
            "verified": true,
            "avatar_permanent_url": "http://baseplate-api.test/api/v1/users/1/avatar",
            "avatar_permanent_thumb_url": "http://baseplate-api.test/api/v1/users/1/avatar/thumb",
            "mine": true,
            "avatar": null
          }
        }
      ]
    }
  ],
  "links": {
    "first": "http://baseplate-api.test/api/v1/posts/1/comments?page=1",
    "last": "http://baseplate-api.test/api/v1/posts/1/comments?page=1",
    "prev": null,
    "next": null
  },
  "meta": {
    "current_page": 1,
    "from": 1,
    "last_page": 1,
    "path": "http://baseplate-api.test/api/v1/posts/1/comments",
    "per_page": 10,
    "to": 2,
    "total": 2
  },
  "http_status": 200,
  "success": true
}
