{
  "data": {
    "id": 6,
    "user_id": 39,
    "token": "fOyAHvBm9Dg:APA91bE2tiywB-l12L2A4GTl60an9PYwdLT17syTSr96-ULUPLqWOJL3aur_lMN0BG4xeFOVHjF4gLChtqUGvw02Jz_EfIqNx6Q-uUMR_hMkre5hf3ZjcZS67pU8FMs-v98QYtDBfzp9",
    "device_id": "C52343E3-8A85-4311-85CA-9C9A40C8C6B8",
    "channel": "fcm",
    "user_agent": null,
    "valid_until": null,
    "deleted_at": null,
    "created_at": "2020-06-24T10:41:03.000000Z",
    "updated_at": "2020-06-24T10:41:03.000000Z"
  },
  "http_status": 200,
  "success": true
}
