<svg width="52" height="53" viewBox="0 0 52 53" fill="none" xmlns="http://www.w3.org/2000/svg">
<path d="M0 0.688965V52.6871H51.7616V34.1747H48.0641V48.9668H3.7451L3.7315 4.4229L48.0641 4.40922V8.13119H51.7616V0.688965H0Z" fill="white"/>
</svg>
