<svg width="9" height="12" viewBox="0 0 9 12" fill="none" xmlns="http://www.w3.org/2000/svg" xmlns:xlink="http://www.w3.org/1999/xlink">
<rect width="9" height="12" fill="url(#pattern0)"/>
<defs>
<pattern id="pattern0" patternContentUnits="objectBoundingBox" width="1" height="1">
<use xlink:href="#image0_22_16" transform="scale(0.111111 0.0833333)"/>
</pattern>
<image id="image0_22_16" width="9" height="12" xlink:href="data:image/png;base64,iVBORw0KGgoAAAANSUhEUgAAAAkAAAAMCAYAAACwXJejAAAAdklEQVQYlY2RUQ2AMAwFD4IApAwF8IMOsICj4QAH4IBaIBhAAikZyVK2hPtZutzat63ol3MHHCBAQ4IyCITV5aSYOiVVph6ALqovwFtpTDRq7bgktpMHDrtnpRnY/gSP0eCij7maG1lEg0/hRA6n0vsdnywPIDd20xTROZ0meQAAAABJRU5ErkJggg=="/>
</defs>
</svg>
