---------1(2)
------------0(3)
---------------0(4)
------------------0(5)
------1(1)
---------0(2)
------------------1(5)
---------------1(4)
------------0(3)
------------------1(5)
---------------------0(6)
---------------0(4)
------------------0(5)
---/(0)
------------1(3)
---------------0(4)
------------------0(5)
---------------------0(6)
---------1(2)
------------0(3)
---------------0(4)
------0(1)
---------------1(4)
------------1(3)
---------0(2)
------------------1(5)
---------------1(4)
------------------0(5)
---------------------0(6)
------------0(3)
---------------------1(6)
------------------1(5)
---------------0(4)
---------------------1(6)
------------------0(5)
---------------------------1(8)
------------------------1(7)
---------------------0(6)
Nullak szama: 21