module gitlab.com/edhi-uchiha/golang/advanced

go 1.15

require (
	github.com/gin-gonic/gin v1.6.3
	github.com/go-sql-driver/mysql v1.5.0
	github.com/google/uuid v1.1.2
	github.com/spf13/viper v1.7.1
)
