<?xml version="1.0" encoding="UTF-8"?>
<session version="1.0">
<refactoring comment="Rename Java project &apos;curso-cap10-uma-experiencia-comparable&apos; to &apos;curso-cap10.1-uma-experiencia-comparable&apos;&#x0A;- Original element: &apos;curso-cap10-uma-experiencia-comparable&apos;&#x0A;- Renamed element: &apos;curso-cap10-uma-experiencia-comparable&apos;&#x0A;- Update references to refactored element" description="Rename Java project &apos;curso-cap10-uma-experiencia-comparable&apos;" flags="7" id="org.eclipse.jdt.ui.rename.java.project" input="=curso-cap10-uma-experiencia-comparable" name="curso-cap10.1-uma-experiencia-comparable" references="true" stamp="1600472715232" version="1.0"/>
</session>