<svg width="490" height="969" viewBox="0 0 490 969" fill="none" xmlns="http://www.w3.org/2000/svg">
<g opacity="0.6" filter="url(#filter0_f_12_25)">
<ellipse cx="-169.5" cy="329.5" rx="259.5" ry="239.5" fill="#2A1968"/>
</g>
<defs>
<filter id="filter0_f_12_25" x="-829" y="-310" width="1319" height="1279" filterUnits="userSpaceOnUse" color-interpolation-filters="sRGB">
<feFlood flood-opacity="0" result="BackgroundImageFix"/>
<feBlend mode="normal" in="SourceGraphic" in2="BackgroundImageFix" result="shape"/>
<feGaussianBlur stdDeviation="200" result="effect1_foregroundBlur_12_25"/>
</filter>
</defs>
</svg>
