<svg width="509" height="96" viewBox="0 0 509 96" fill="none" xmlns="http://www.w3.org/2000/svg">
<path d="M65.4803 0.724142C48.0189 -3.24436 14.5512 10.6454 0 18.0863V93.4882H504V62.7323C488.457 51.9843 446.06 28.0078 400.819 18.0863C344.268 5.68449 293.669 40.4095 226.205 40.4095C158.74 40.4095 87.3071 5.68477 65.4803 0.724142Z" fill="#1F8795" fill-opacity="0.33"/>
<path d="M88.2992 17.0947C55.7575 15.5073 15.874 33.2994 0 42.3939V95.4729H506.48V17.0947C487.961 22.5514 442.786 33.465 410.244 33.465C369.567 33.465 327.402 17.0947 304.583 17.0947C281.764 17.0947 230.173 50.8272 201.402 53.8036C172.63 56.7799 128.976 19.0789 88.2992 17.0947Z" fill="#1F8795" fill-opacity="0.33"/>
<path d="M256.961 44.3778C148.224 48.3464 40.3465 18.9133 0 3.70068V93.4881H505.984V27.0156C510.118 19.244 511.044 3.70068 481.677 3.70068C444.969 3.70068 392.882 39.4172 256.961 44.3778Z" fill="#1F8795" fill-opacity="0.33"/>
</svg>
