<svg width="24" height="22" viewBox="0 0 24 22" fill="none" xmlns="http://www.w3.org/2000/svg">
<path d="M17.4166 21.5943H6.58458C4.81212 21.687 3.0744 21.0783 1.74715 19.8999C1.15373 19.272 0.693701 18.5304 0.394851 17.7198C0.0960004 16.9092 -0.0354756 16.0464 0.00836058 15.1836V6.4105C-0.0358148 5.54846 0.0954038 4.68643 0.394073 3.87658C0.692742 3.06673 1.15265 2.32592 1.74595 1.69898C3.07478 0.522918 4.81252 -0.0838927 6.58458 0.00935431H17.413C19.1847 -0.0838333 20.9221 0.52299 22.2505 1.69898C22.8444 2.32566 23.3049 3.06635 23.6042 3.8762C23.9035 4.68605 24.0353 5.54822 23.9917 6.4105V6.45487H18.9096C17.7895 6.44523 16.711 6.87871 15.9091 7.66084C15.1072 8.44297 14.6469 9.51035 14.6286 10.6304C14.6275 11.1823 14.7378 11.7288 14.9529 12.2372C15.1681 12.7455 15.4836 13.2052 15.8805 13.5887C16.6905 14.3795 17.7788 14.8205 18.9108 14.8167H23.9917V15.1836C24.0356 16.0463 23.9043 16.909 23.6056 17.7196C23.307 18.5302 22.8472 19.2719 22.2541 19.8999C20.9269 21.0784 19.1891 21.6871 17.4166 21.5943ZM5.69121 4.65612C5.45248 4.65545 5.22305 4.74859 5.05236 4.91547C4.88166 5.08236 4.78336 5.30962 4.77864 5.5483C4.7781 5.66632 4.80141 5.78324 4.84715 5.89204C4.8929 6.00084 4.96014 6.09928 5.04486 6.18146C5.21751 6.35143 5.45012 6.44663 5.6924 6.44648H12.4677C12.71 6.44663 12.9426 6.35143 13.1152 6.18146C13.2 6.09905 13.2672 6.0004 13.313 5.89141C13.3587 5.78241 13.382 5.66531 13.3815 5.5471C13.3764 5.30738 13.277 5.07933 13.1048 4.9125C12.9325 4.74567 12.7015 4.65354 12.4617 4.65612H5.69121Z" fill="white"/>
<path opacity="0.4" d="M16.8411 11.1616C16.957 11.7095 17.2595 12.2003 17.6968 12.5501C18.1342 12.9 18.6794 13.0874 19.2394 13.0802H23.1367C23.3665 13.0761 23.5854 12.9813 23.7456 12.8164C23.9058 12.6515 23.9943 12.4299 23.9917 12.2V9.16376C23.9936 8.93325 23.9043 8.71134 23.7432 8.54644C23.5821 8.38154 23.3624 8.28704 23.1319 8.28357H19.1423C18.5118 8.29273 17.9107 8.55168 17.4709 9.00358C17.0312 9.45547 16.7887 10.0634 16.7967 10.6939C16.7964 10.8508 16.8112 11.0075 16.8411 11.1616Z" fill="white"/>
<path d="M19.195 11.8811C19.8573 11.8811 20.3942 11.3442 20.3942 10.6819C20.3942 10.0196 19.8573 9.48273 19.195 9.48273C18.5327 9.48273 17.9958 10.0196 17.9958 10.6819C17.9958 11.3442 18.5327 11.8811 19.195 11.8811Z" fill="white"/>
</svg>
