<svg width="513" height="97" viewBox="0 0 513 97" fill="none" xmlns="http://www.w3.org/2000/svg">
<path d="M66 0.999711C48.4 -3.00029 14.6667 10.9997 0 18.4997V94.5H508V63.5C492.333 52.6667 449.6 28.4999 404 18.4997C347 5.99942 296 41 228 41C160 41 88 5.99971 66 0.999711Z" fill="#41ABF3" fill-opacity="0.34"/>
<path d="M89 17.4997C56.2 15.8997 16 33.8331 0 42.9997V96.5H510.5V17.4997C491.833 22.9998 446.3 34 413.5 34C372.5 34 330 17.4997 307 17.4997C284 17.4997 232 51.5 203 54.5C174 57.5 130 19.4997 89 17.4997Z" fill="#41ABF3" fill-opacity="0.34"/>
<path d="M259 45C149.4 49 40.6667 19.3333 0 4V94.5H510V27.5C514.167 19.6667 515.1 4 485.5 4C448.5 4 396 40 259 45Z" fill="#41ABF3" fill-opacity="0.33"/>
</svg>
