<svg width="24" height="23" viewBox="0 0 24 23" fill="none" xmlns="http://www.w3.org/2000/svg">
<path opacity="0.4" d="M13.1619 0.73811L15.8288 6.10318C15.9258 6.2953 16.0679 6.46109 16.2429 6.58638C16.4179 6.71167 16.6206 6.79275 16.8337 6.82268L22.8295 7.69567C23.1801 7.74463 23.4973 7.92992 23.7121 8.21131C23.8172 8.34913 23.8937 8.50662 23.9369 8.67448C23.9802 8.84234 23.9894 9.01716 23.9639 9.18863C23.9217 9.47648 23.7866 9.74263 23.579 9.9465L19.2332 14.1592C19.0772 14.3038 18.9602 14.4855 18.8929 14.6873C18.8256 14.8891 18.8103 15.1046 18.8483 15.314L19.918 21.2366C19.9731 21.5801 19.8922 21.9315 19.6925 22.2163C19.4928 22.5011 19.19 22.6968 18.8483 22.762C18.5556 22.8081 18.2559 22.7603 17.9921 22.6253L12.6426 19.8384C12.4468 19.7396 12.2306 19.6882 12.0113 19.6882C11.7919 19.6882 11.5757 19.7396 11.3799 19.8384L6.03521 22.6253C5.71946 22.7935 5.35042 22.8317 5.00693 22.7315C4.66344 22.6314 4.37273 22.4009 4.19689 22.0893C4.06168 21.8316 4.01292 21.5373 4.05779 21.2498L5.12745 15.326C5.16511 15.1165 5.1496 14.9009 5.08235 14.6989C5.0151 14.4969 4.89826 14.3151 4.74251 14.17L0.397937 9.9549C0.150822 9.71647 0.00808535 9.38995 0.000895661 9.04665C-0.00629403 8.70334 0.122648 8.37113 0.359564 8.12257L0.39434 8.0878C0.600506 7.87795 0.872078 7.74471 1.1642 7.71006L7.16003 6.83587C7.3731 6.80574 7.57573 6.72459 7.75069 6.59932C7.92565 6.47405 8.06777 6.30836 8.16493 6.11637L10.7443 0.73811C10.8566 0.512174 11.031 0.322919 11.247 0.192517C11.463 0.0621153 11.7117 -0.00403287 11.9639 0.00182249H12.1246C12.3449 0.0287348 12.555 0.110009 12.7361 0.238329C12.9171 0.366648 13.0635 0.537984 13.1619 0.736911" fill="white"/>
<path d="M11.9819 19.6885C11.7501 19.6958 11.5232 19.7578 11.32 19.8696L5.99566 22.6504C5.68118 22.8009 5.32161 22.8276 4.98837 22.7252C4.65513 22.6228 4.3726 22.3987 4.19691 22.0976C4.06118 21.8428 4.01234 21.5506 4.05781 21.2654L5.12507 15.3511C5.1608 15.1396 5.14442 14.9226 5.07734 14.7189C5.01026 14.5151 4.89452 14.3308 4.74013 14.1819L0.393157 9.97646C0.145267 9.73345 0.00390138 9.40203 7.95443e-05 9.05492C-0.00374229 8.70781 0.130292 8.37336 0.372772 8.12495L0.393157 8.10576C0.598814 7.90152 0.86435 7.76833 1.15103 7.72563L7.15285 6.83705C7.3663 6.80948 7.56956 6.72929 7.74434 6.6037C7.91912 6.47811 8.05994 6.31105 8.15416 6.11755L10.7659 0.676932C10.887 0.461353 11.0659 0.2839 11.2824 0.164605C11.499 0.045309 11.7446 -0.0110802 11.9915 0.00180186C11.9819 0.361552 11.9819 19.4439 11.9819 19.6861" fill="white"/>
</svg>
