GAMS 25.1.3  r4e34d435fbd Released Oct 30, 2018 WEX-WEI x86 64bit/MS Windows                                                                                                                                                           09/01/21 13:59:45 Page 1
G e n e r a l   A l g e b r a i c   M o d e l i n g   S y s t e m
C o m p i l a t i o n


   1  Sets
   2      t   'time, 24x 1hr' /1*24/
   3      source  'sources of energy'     /"A", "B","store"/
   4      gen(source) 'power generators'    /"A", "B"/
   5      batt(source)   'stores of energy'  /"store"/
   6      days 'indicative days for demand/generation' /"Winter", "Summer", "Test"/;
   7   
   8  Table dem(days, t)   'demand data for different indicative days'
INCLUDE    C:\Projects\my_first_dispatch_model\demand.csv
  11  ,1,2,3,4,5,6,7,8,9,10,11,12,13,14,15,16,17,18,19,20,21,22,23,24
  12  winter,15,15,15,16,17,20,21,20,19,19,19,20,20,19,19,19,20,21,21,20,19,19,17,16
  13  summer,10,10,10,11,11.5,13,14,13,12,13,13,13,12,13,13,12,14,13,13,12,12,12,12,11
  14  test,8,10,12,14,16,18,20,22,23,24,23,22,20,21,20,18,16,13.5,11,10,9,8,7,8.5
  16  ;
  17   
  18  Parameters
  19      demand(t)       'aggregate energy demand per hour (MWh)'
  20   
  21      capacity(source)   'generating capacity by generator (MWh per hour)'
  22      /   A   14,
  23          B   7,
  24          store   5 /
  25      price(gen)      'price per unit energy output of each generator (EUR per MWh)'
  26      /   A   40,
  27          B   50 /
  28   
  29      ramp_lim(source)   'limiting rate of output change for each generator (MW per hour)'
  30      /   A   2,
  31          B   3,
  32          store   +INF/
  33   
  34      volume(batt)    'storage volumes (MWh)'
  35      /   store   20/;
  36   
  37  demand(t) = dem("Test", t);
  38   
  39  Variables
  40      output(source, t)  'actual energy generated by each station at time t (MWh)'
  41      charge(batt, t) 'stored energy in each store at time t (MWh)'
  42      demandp(t)      'demand at time t as a variable (MWh)'
  43      cost_tot        'total cost of energy generated in the model horizon (EUR)';
  44   
  45  * constrain generation using upper bound instead of equation eqcapacity(t)
  46  * output.up(gen,t) = capacity(gen);
  47   
  48  * fix demand variable to the input demand time series parameter
  49  demandp.fx(t) = demand(t);
  50   
  51  Positive variables
  52      spill(t)            'energy oversupply in time period t (MWh)'
  53      loss(t)             'energy undersupply in time period t, i.e. loss of load (MWh)'
  54      charge(batt,t);
  55   
GAMS 25.1.3  r4e34d435fbd Released Oct 30, 2018 WEX-WEI x86 64bit/MS Windows                                                                                                                                                           09/01/21 13:59:45 Page 2
G e n e r a l   A l g e b r a i c   M o d e l i n g   S y s t e m
C o m p i l a t i o n


  56  Scalars
  57      spill_price     'cost of one MWh of spill (EUR)'    /10/
  58      lol_price       'cost of one MWh of loss of load (EUR)'     /500/;
  59   
  60  *basic model plus ramping
  61  Equations
  62      eqgenerator(gen,t)  'generators cant produce negative power'
  63      eqbatt(batt, t)     'stores cannot accept power higher than their rating'
  64      eqcharge(batt,t)    'stored charge cannot exceed storage volume'
  65      eqenergy(batt,t)    'conservation of energy to/stored/from battery'
  66      eqcapacity(source,t)   'capacity constraints'
  67      eqramp_lim(source,t)   'ramp rate limited to ramp_lim parameters'
  68      eqconserv(t)        'sum of outputs must equal demand at each time step'
  69      eqcost_tot          'grand total cost = sum of output*price over all time over all generators';
  70   
  71  eqgenerator(gen,t)..    output(gen, t) =g= 0;
  72   
  73  eqbatt(batt,t)..        output(batt, t) =g= -capacity(batt);
  74   
  75  eqcharge(batt,t)..      charge(batt, t) =l= volume(batt);
  76   
  77  eqcapacity(source,t)..     output(source,t) =l= capacity(source);
  78   
  79  eqenergy(batt,t)..      charge(batt,t) =e= charge(batt, t--1) - output(batt, t);
  80   
  81  eqramp_lim(source,t)..     abs(output(source, t) - output(source, t--1)) =l= ramp_lim(source);
  82   
  83  eqconserv(t)..          demandp(t) =e= sum(source, output(source, t)) - spill(t) + loss(t);
  84   
  85  eqcost_tot..            cost_tot =e= sum((gen,t), output(gen, t) * price(gen)) + sum(t, spill(t) * spill_price + loss(t) * lol_price);
  86   
  87   
  88  model first_dispatch /all/;
  89   
  90  solve first_dispatch using dnlp minimizing cost_tot;
  91   
  92  * display cost_tot.l, output.l, report_level;
  93   
  94  execute_UNLOAD 'outputs.gdx', output.l demandp.l charge.l;
  95   
  96  execute "python main.py";
  97   
GAMS 25.1.3  r4e34d435fbd Released Oct 30, 2018 WEX-WEI x86 64bit/MS Windows                                                                                                                                                           09/01/21 13:59:45 Page 3
G e n e r a l   A l g e b r a i c   M o d e l i n g   S y s t e m
Include File Summary


   SEQ   GLOBAL TYPE      PARENT   LOCAL  FILENAME

     1        1 INPUT          0       0  C:\Projects\my_first_dispatch_model\dispatch_model.gms
     2       10 INCLUDE        1      10  .C:\Projects\my_first_dispatch_model\demand.csv


COMPILATION TIME     =        0.016 SECONDS      3 MB  25.1.3 r4e34d435fbd WEX-WEI
GAMS 25.1.3  r4e34d435fbd Released Oct 30, 2018 WEX-WEI x86 64bit/MS Windows                                                                                                                                                           09/01/21 13:59:45 Page 4
G e n e r a l   A l g e b r a i c   M o d e l i n g   S y s t e m
Equation Listing    SOLVE first_dispatch Using DNLP From line 90


---- eqgenerator  =G=  generators cant produce negative power

eqgenerator(A,1)..  output(A,1) =G= 0 ; (LHS = 0)
     
eqgenerator(A,2)..  output(A,2) =G= 0 ; (LHS = 0)
     
eqgenerator(A,3)..  output(A,3) =G= 0 ; (LHS = 0)
     
REMAINING 45 ENTRIES SKIPPED


---- eqbatt  =G=  stores cannot accept power higher than their rating

eqbatt(store,1)..  output(store,1) =G= -5 ; (LHS = 0)
     
eqbatt(store,2)..  output(store,2) =G= -5 ; (LHS = 0)
     
eqbatt(store,3)..  output(store,3) =G= -5 ; (LHS = 0)
     
REMAINING 21 ENTRIES SKIPPED


---- eqcharge  =L=  stored charge cannot exceed storage volume

eqcharge(store,1)..  charge(store,1) =L= 20 ; (LHS = 0)
     
eqcharge(store,2)..  charge(store,2) =L= 20 ; (LHS = 0)
     
eqcharge(store,3)..  charge(store,3) =L= 20 ; (LHS = 0)
     
REMAINING 21 ENTRIES SKIPPED


---- eqenergy  =E=  conservation of energy to/stored/from battery

eqenergy(store,1)..  output(store,1) + charge(store,1) - charge(store,24) =E= 0 ; (LHS = 0)
     
eqenergy(store,2)..  output(store,2) - charge(store,1) + charge(store,2) =E= 0 ; (LHS = 0)
     
eqenergy(store,3)..  output(store,3) - charge(store,2) + charge(store,3) =E= 0 ; (LHS = 0)
     
REMAINING 21 ENTRIES SKIPPED


---- eqcapacity  =L=  capacity constraints

eqcapacity(A,1)..  output(A,1) =L= 14 ; (LHS = 0)
     
eqcapacity(A,2)..  output(A,2) =L= 14 ; (LHS = 0)
     
GAMS 25.1.3  r4e34d435fbd Released Oct 30, 2018 WEX-WEI x86 64bit/MS Windows                                                                                                                                                           09/01/21 13:59:45 Page 5
G e n e r a l   A l g e b r a i c   M o d e l i n g   S y s t e m
Equation Listing    SOLVE first_dispatch Using DNLP From line 90


     eqcapacity  =L=  capacity constraints

eqcapacity(A,3)..  output(A,3) =L= 14 ; (LHS = 0)
     
REMAINING 69 ENTRIES SKIPPED


---- eqramp_lim  =L=  ramp rate limited to ramp_lim parameters

eqramp_lim(A,1)..  (1)*output(A,1) - (1)*output(A,24) =L= 2 ; (LHS = 0)
     
eqramp_lim(A,2)..  - (1)*output(A,1) + (1)*output(A,2) =L= 2 ; (LHS = 0)
     
eqramp_lim(A,3)..  - (1)*output(A,2) + (1)*output(A,3) =L= 2 ; (LHS = 0)
     
REMAINING 69 ENTRIES SKIPPED


---- eqconserv  =E=  sum of outputs must equal demand at each time step

eqconserv(1)..  - output(A,1) - output(B,1) - output(store,1) + demandp(1) + spill(1) - loss(1) =E= 0 ; (LHS = 8, INFES = 8 ****)
     
eqconserv(2)..  - output(A,2) - output(B,2) - output(store,2) + demandp(2) + spill(2) - loss(2) =E= 0 ; (LHS = 10, INFES = 10 ****)
     
eqconserv(3)..  - output(A,3) - output(B,3) - output(store,3) + demandp(3) + spill(3) - loss(3) =E= 0 ; (LHS = 12, INFES = 12 ****)
     
REMAINING 21 ENTRIES SKIPPED


---- eqcost_tot  =E=  grand total cost = sum of output*price over all time over all generators

eqcost_tot..  - 40*output(A,1) - 40*output(A,2) - 40*output(A,3) - 40*output(A,4) - 40*output(A,5) - 40*output(A,6) - 40*output(A,7) - 40*output(A,8) - 40*output(A,9) - 40*output(A,10) - 40*output(A,11) - 40*output(A,12) - 40*output(A,13)
     
      - 40*output(A,14) - 40*output(A,15) - 40*output(A,16) - 40*output(A,17) - 40*output(A,18) - 40*output(A,19) - 40*output(A,20) - 40*output(A,21) - 40*output(A,22) - 40*output(A,23) - 40*output(A,24) - 50*output(B,1) - 50*output(B,2) - 50*output(B,3)
     
      - 50*output(B,4) - 50*output(B,5) - 50*output(B,6) - 50*output(B,7) - 50*output(B,8) - 50*output(B,9) - 50*output(B,10) - 50*output(B,11) - 50*output(B,12) - 50*output(B,13) - 50*output(B,14) - 50*output(B,15) - 50*output(B,16) - 50*output(B,17)
     
      - 50*output(B,18) - 50*output(B,19) - 50*output(B,20) - 50*output(B,21) - 50*output(B,22) - 50*output(B,23) - 50*output(B,24) + cost_tot - 10*spill(1) - 10*spill(2) - 10*spill(3) - 10*spill(4) - 10*spill(5) - 10*spill(6) - 10*spill(7) - 10*spill(8)
     
      - 10*spill(9) - 10*spill(10) - 10*spill(11) - 10*spill(12) - 10*spill(13) - 10*spill(14) - 10*spill(15) - 10*spill(16) - 10*spill(17) - 10*spill(18) - 10*spill(19) - 10*spill(20) - 10*spill(21) - 10*spill(22) - 10*spill(23) - 10*spill(24)
     
      - 500*loss(1) - 500*loss(2) - 500*loss(3) - 500*loss(4) - 500*loss(5) - 500*loss(6) - 500*loss(7) - 500*loss(8) - 500*loss(9) - 500*loss(10) - 500*loss(11) - 500*loss(12) - 500*loss(13) - 500*loss(14) - 500*loss(15) - 500*loss(16) - 500*loss(17)
     
      - 500*loss(18) - 500*loss(19) - 500*loss(20) - 500*loss(21) - 500*loss(22) - 500*loss(23) - 500*loss(24) =E= 0 ; (LHS = 0)
     
GAMS 25.1.3  r4e34d435fbd Released Oct 30, 2018 WEX-WEI x86 64bit/MS Windows                                                                                                                                                           09/01/21 13:59:45 Page 6
G e n e r a l   A l g e b r a i c   M o d e l i n g   S y s t e m
Column Listing      SOLVE first_dispatch Using DNLP From line 90


---- output  actual energy generated by each station at time t (MWh)

output(A,1)
                (.LO, .L, .UP, .M = -INF, 0, +INF, 0)
        1       eqgenerator(A,1)
        1       eqcapacity(A,1)
       (1)      eqramp_lim(A,1)
      (-1)      eqramp_lim(A,2)
       -1       eqconserv(1)
      -40       eqcost_tot

output(A,2)
                (.LO, .L, .UP, .M = -INF, 0, +INF, 0)
        1       eqgenerator(A,2)
        1       eqcapacity(A,2)
       (1)      eqramp_lim(A,2)
      (-1)      eqramp_lim(A,3)
       -1       eqconserv(2)
      -40       eqcost_tot

output(A,3)
                (.LO, .L, .UP, .M = -INF, 0, +INF, 0)
        1       eqgenerator(A,3)
        1       eqcapacity(A,3)
       (1)      eqramp_lim(A,3)
      (-1)      eqramp_lim(A,4)
       -1       eqconserv(3)
      -40       eqcost_tot

REMAINING 69 ENTRIES SKIPPED

---- charge  stored energy in each store at time t (MWh)

charge(store,1)
                (.LO, .L, .UP, .M = 0, 0, +INF, 0)
        1       eqcharge(store,1)
        1       eqenergy(store,1)
       -1       eqenergy(store,2)

charge(store,2)
                (.LO, .L, .UP, .M = 0, 0, +INF, 0)
        1       eqcharge(store,2)
        1       eqenergy(store,2)
       -1       eqenergy(store,3)

charge(store,3)
                (.LO, .L, .UP, .M = 0, 0, +INF, 0)
        1       eqcharge(store,3)
        1       eqenergy(store,3)
       -1       eqenergy(store,4)

REMAINING 21 ENTRIES SKIPPED
GAMS 25.1.3  r4e34d435fbd Released Oct 30, 2018 WEX-WEI x86 64bit/MS Windows                                                                                                                                                           09/01/21 13:59:45 Page 7
G e n e r a l   A l g e b r a i c   M o d e l i n g   S y s t e m
Column Listing      SOLVE first_dispatch Using DNLP From line 90


---- demandp  demand at time t as a variable (MWh)

demandp(1)
                (.LO, .L, .UP, .M = 8, 8, 8, 0)
        1       eqconserv(1)

demandp(2)
                (.LO, .L, .UP, .M = 10, 10, 10, 0)
        1       eqconserv(2)

demandp(3)
                (.LO, .L, .UP, .M = 12, 12, 12, 0)
        1       eqconserv(3)

REMAINING 21 ENTRIES SKIPPED

---- cost_tot  total cost of energy generated in the model horizon (EUR)

cost_tot
                (.LO, .L, .UP, .M = -INF, 0, +INF, 0)
        1       eqcost_tot


---- spill  energy oversupply in time period t (MWh)

spill(1)
                (.LO, .L, .UP, .M = 0, 0, +INF, 0)
        1       eqconserv(1)
      -10       eqcost_tot

spill(2)
                (.LO, .L, .UP, .M = 0, 0, +INF, 0)
        1       eqconserv(2)
      -10       eqcost_tot

spill(3)
                (.LO, .L, .UP, .M = 0, 0, +INF, 0)
        1       eqconserv(3)
      -10       eqcost_tot

REMAINING 21 ENTRIES SKIPPED

---- loss  energy undersupply in time period t, i.e. loss of load (MWh)

loss(1)
                (.LO, .L, .UP, .M = 0, 0, +INF, 0)
       -1       eqconserv(1)
     -500       eqcost_tot

loss(2)
                (.LO, .L, .UP, .M = 0, 0, +INF, 0)
       -1       eqconserv(2)
     -500       eqcost_tot
GAMS 25.1.3  r4e34d435fbd Released Oct 30, 2018 WEX-WEI x86 64bit/MS Windows                                                                                                                                                           09/01/21 13:59:45 Page 8
G e n e r a l   A l g e b r a i c   M o d e l i n g   S y s t e m
Column Listing      SOLVE first_dispatch Using DNLP From line 90


     loss  energy undersupply in time period t, i.e. loss of load (MWh)


loss(3)
                (.LO, .L, .UP, .M = 0, 0, +INF, 0)
       -1       eqconserv(3)
     -500       eqcost_tot

REMAINING 21 ENTRIES SKIPPED
GAMS 25.1.3  r4e34d435fbd Released Oct 30, 2018 WEX-WEI x86 64bit/MS Windows                                                                                                                                                           09/01/21 13:59:45 Page 9
G e n e r a l   A l g e b r a i c   M o d e l i n g   S y s t e m
Model Statistics    SOLVE first_dispatch Using DNLP From line 90


MODEL STATISTICS

BLOCKS OF EQUATIONS           8     SINGLE EQUATIONS          289
BLOCKS OF VARIABLES           6     SINGLE VARIABLES          169
NON ZERO ELEMENTS           625     NON LINEAR N-Z            144
DERIVATIVE POOL              20     CONSTANT POOL              16
CODE LENGTH                 360


GENERATION TIME      =        0.000 SECONDS      4 MB  25.1.3 r4e34d435fbd WEX-WEI


EXECUTION TIME       =        0.000 SECONDS      4 MB  25.1.3 r4e34d435fbd WEX-WEI
GAMS 25.1.3  r4e34d435fbd Released Oct 30, 2018 WEX-WEI x86 64bit/MS Windows                                                                                                                                                          09/01/21 13:59:45 Page 10
G e n e r a l   A l g e b r a i c   M o d e l i n g   S y s t e m
Solution Report     SOLVE first_dispatch Using DNLP From line 90


               S O L V E      S U M M A R Y

     MODEL   first_dispatch      OBJECTIVE  cost_tot
     TYPE    DNLP                DIRECTION  MINIMIZE
     SOLVER  CONOPT              FROM LINE  90

**** SOLVER STATUS     1 Normal Completion         
**** MODEL STATUS      2 Locally Optimal           
**** OBJECTIVE VALUE            15570.0000

 RESOURCE USAGE, LIMIT          0.016      1000.000
 ITERATION COUNT, LIMIT        21    2000000000
 EVALUATION ERRORS              0             0
CONOPT 3         25.1.3 r4e34d435fbd Released Oct 30, 2018 WEI x86 64bit/MS Wi
 
 
    C O N O P T 3   version 3.17I
    Copyright (C)   ARKI Consulting and Development A/S
                    Bagsvaerdvej 246 A
                    DK-2880 Bagsvaerd, Denmark
 
 
    The model has 169 variables and 289 constraints
    with 625 Jacobian elements, 144 of which are nonlinear.
    The Hessian of the Lagrangian has 72 elements on the diagonal,
    72 elements below the diagonal, and 72 nonlinear variables.
 
                   Pre-triangular equations:   0
                   Post-triangular equations:  25
                   Definitional equations:     24
 
 
 ** Optimal solution. Reduced gradient less than tolerance.
 
 
 CONOPT time Total                            0.009 seconds
   of which: Function evaluations             0.000 =  0.0%
             1st Derivative evaluations       0.000 =  0.0%
 

---- EQU eqgenerator  generators cant produce negative power

            LOWER          LEVEL          UPPER         MARGINAL

A.1           .            11.8802        +INF             .          
A.2           .            13.8802        +INF             .          
A.3           .            13.7061        +INF             .          
A.4           .            14.0000        +INF             .          
A.5           .            14.0000        +INF             .          
A.6           .            14.0000        +INF             .          
A.7           .            14.0000        +INF             .          
A.8           .            14.0000        +INF             .          
A.9           .            14.0000        +INF             .          
GAMS 25.1.3  r4e34d435fbd Released Oct 30, 2018 WEX-WEI x86 64bit/MS Windows                                                                                                                                                          09/01/21 13:59:45 Page 11
G e n e r a l   A l g e b r a i c   M o d e l i n g   S y s t e m
Solution Report     SOLVE first_dispatch Using DNLP From line 90


     EQU eqgenerator  generators cant produce negative power

            LOWER          LEVEL          UPPER         MARGINAL

A.10          .            14.0000        +INF             .          
A.11          .            14.0000        +INF             .          
A.12          .            14.0000        +INF             .          
A.13          .            14.0000        +INF             .          
A.14          .            14.0000        +INF             .          
A.15          .            14.0000        +INF             .          
A.16          .            14.0000        +INF             .          
A.17          .            14.0000        +INF             .          
A.18          .            13.5000        +INF             .          
A.19          .            11.5000        +INF             .          
A.20          .             9.5000        +INF             .          
A.21          .             9.0000        +INF             .          
A.22          .            10.4383        +INF             .          
A.23          .            12.0000        +INF             .          
A.24          .            11.5952        +INF             .          
B.1           .              .            +INF           10.0000      
B.2           .              .            +INF           10.0000      
B.3           .              .            +INF           10.0000      
B.4           .              .            +INF           10.0000      
B.5           .             0.1507        +INF            EPS         
B.6           .             2.3065        +INF             .          
B.7           .             5.1342        +INF             .          
B.8           .             5.8316        +INF             .          
B.9           .             5.8316        +INF             .          
B.10          .             5.8316        +INF             .          
B.11          .             4.7751        +INF             .          
B.12          .             6.3109        +INF             .          
B.13          .             5.8277        +INF             .          
B.14          .             7.0000        +INF             .          
B.15          .             6.0000        +INF             .          
B.16          .             4.5000        +INF             .          
B.17          .             1.5000        +INF             .          
B.18          .              .            +INF           10.0000      
B.19          .              .            +INF           10.0000      
B.20          .              .            +INF           10.0000      
B.21          .              .            +INF           10.0000      
B.22          .              .            +INF           10.0000      
B.23          .              .            +INF           10.0000      
B.24          .              .            +INF           10.0000      

---- EQU eqbatt  stores cannot accept power higher than their rating

                LOWER          LEVEL          UPPER         MARGINAL

store.1         -5.0000        -3.8802        +INF             .          
store.2         -5.0000        -3.8802        +INF             .          
store.3         -5.0000        -1.7061        +INF             .          
store.4         -5.0000   -8.88178E-16        +INF             .          
store.5         -5.0000         1.8493        +INF             .          
GAMS 25.1.3  r4e34d435fbd Released Oct 30, 2018 WEX-WEI x86 64bit/MS Windows                                                                                                                                                          09/01/21 13:59:45 Page 12
G e n e r a l   A l g e b r a i c   M o d e l i n g   S y s t e m
Solution Report     SOLVE first_dispatch Using DNLP From line 90


     EQU eqbatt  stores cannot accept power higher than their rating

                LOWER          LEVEL          UPPER         MARGINAL

store.6         -5.0000         1.6935        +INF             .          
store.7         -5.0000         0.8658        +INF             .          
store.8         -5.0000         2.1684        +INF             .          
store.9         -5.0000         3.1684        +INF             .          
store.10        -5.0000         4.1684        +INF             .          
store.11        -5.0000         4.2249        +INF             .          
store.12        -5.0000         1.6891        +INF             .          
store.13        -5.0000         0.1723        +INF             .          
store.14        -5.0000          .            +INF             .          
store.15        -5.0000          .            +INF             .          
store.16        -5.0000        -0.5000        +INF             .          
store.17        -5.0000         0.5000        +INF             .          
store.18        -5.0000          .            +INF             .          
store.19        -5.0000        -0.5000        +INF             .          
store.20        -5.0000         0.5000        +INF             .          
store.21        -5.0000          .            +INF             .          
store.22        -5.0000        -2.4383        +INF             .          
store.23        -5.0000        -5.0000        +INF            EPS         
store.24        -5.0000        -3.0952        +INF            EPS         

---- EQU eqcharge  stored charge cannot exceed storage volume

                LOWER          LEVEL          UPPER         MARGINAL

store.1         -INF           14.4137        20.0000          .          
store.2         -INF           18.2939        20.0000          .          
store.3         -INF           20.0000        20.0000          .          
store.4         -INF           20.0000        20.0000       -10.0000      
store.5         -INF           18.1507        20.0000          .          
store.6         -INF           16.4572        20.0000          .          
store.7         -INF           15.5915        20.0000          .          
store.8         -INF           13.4231        20.0000          .          
store.9         -INF           10.2547        20.0000          .          
store.10        -INF            6.0862        20.0000          .          
store.11        -INF            1.8614        20.0000          .          
store.12        -INF            0.1723        20.0000          .          
store.13        -INF             .            20.0000          .          
store.14        -INF             .            20.0000          .          
store.15        -INF             .            20.0000          .          
store.16        -INF            0.5000        20.0000          .          
store.17        -INF             .            20.0000          .          
store.18        -INF             .            20.0000          .          
store.19        -INF            0.5000        20.0000          .          
store.20        -INF             .            20.0000          .          
store.21        -INF             .            20.0000          .          
store.22        -INF            2.4383        20.0000          .          
store.23        -INF            7.4383        20.0000          .          
store.24        -INF           10.5335        20.0000          .          
GAMS 25.1.3  r4e34d435fbd Released Oct 30, 2018 WEX-WEI x86 64bit/MS Windows                                                                                                                                                          09/01/21 13:59:45 Page 13
G e n e r a l   A l g e b r a i c   M o d e l i n g   S y s t e m
Solution Report     SOLVE first_dispatch Using DNLP From line 90


---- EQU eqenergy  conservation of energy to/stored/from battery

                LOWER          LEVEL          UPPER         MARGINAL

store.1           .              .              .           -40.0000      
store.2           .              .              .           -40.0000      
store.3           .              .              .           -40.0000      
store.4           .              .              .           -40.0000      
store.5           .              .              .           -50.0000      
store.6           .              .              .           -50.0000      
store.7           .              .              .           -50.0000      
store.8           .              .              .           -50.0000      
store.9           .              .              .           -50.0000      
store.10          .              .              .           -50.0000      
store.11          .              .              .           -50.0000      
store.12          .              .              .           -50.0000      
store.13          .              .              .           -50.0000      
store.14          .              .              .           -50.0000      
store.15          .              .              .           -50.0000      
store.16          .              .              .           -50.0000      
store.17          .              .              .           -50.0000      
store.18          .              .              .           -40.0000      
store.19          .              .              .           -40.0000      
store.20          .              .              .           -40.0000      
store.21          .              .              .           -40.0000      
store.22          .              .              .           -40.0000      
store.23          .              .              .           -40.0000      
store.24          .              .              .           -40.0000      

---- EQU eqcapacity  capacity constraints

                LOWER          LEVEL          UPPER         MARGINAL

A    .1         -INF           11.8802        14.0000          .          
A    .2         -INF           13.8802        14.0000          .          
A    .3         -INF           13.7061        14.0000         EPS         
A    .4         -INF           14.0000        14.0000         EPS         
A    .5         -INF           14.0000        14.0000       -10.0000      
A    .6         -INF           14.0000        14.0000       -10.0000      
A    .7         -INF           14.0000        14.0000       -10.0000      
A    .8         -INF           14.0000        14.0000       -10.0000      
A    .9         -INF           14.0000        14.0000       -10.0000      
A    .10        -INF           14.0000        14.0000       -10.0000      
A    .11        -INF           14.0000        14.0000       -10.0000      
A    .12        -INF           14.0000        14.0000       -10.0000      
A    .13        -INF           14.0000        14.0000       -10.0000      
A    .14        -INF           14.0000        14.0000       -10.0000      
A    .15        -INF           14.0000        14.0000       -10.0000      
A    .16        -INF           14.0000        14.0000       -10.0000      
A    .17        -INF           14.0000        14.0000       -10.0000      
A    .18        -INF           13.5000        14.0000          .          
A    .19        -INF           11.5000        14.0000          .          
A    .20        -INF            9.5000        14.0000          .          
GAMS 25.1.3  r4e34d435fbd Released Oct 30, 2018 WEX-WEI x86 64bit/MS Windows                                                                                                                                                          09/01/21 13:59:45 Page 14
G e n e r a l   A l g e b r a i c   M o d e l i n g   S y s t e m
Solution Report     SOLVE first_dispatch Using DNLP From line 90


     EQU eqcapacity  capacity constraints

                LOWER          LEVEL          UPPER         MARGINAL

A    .21        -INF            9.0000        14.0000          .          
A    .22        -INF           10.4383        14.0000          .          
A    .23        -INF           12.0000        14.0000          .          
A    .24        -INF           11.5952        14.0000          .          
B    .1         -INF             .             7.0000          .          
B    .2         -INF             .             7.0000          .          
B    .3         -INF             .             7.0000          .          
B    .4         -INF             .             7.0000          .          
B    .5         -INF            0.1507         7.0000          .          
B    .6         -INF            2.3065         7.0000          .          
B    .7         -INF            5.1342         7.0000          .          
B    .8         -INF            5.8316         7.0000         EPS         
B    .9         -INF            5.8316         7.0000         EPS         
B    .10        -INF            5.8316         7.0000         EPS         
B    .11        -INF            4.7751         7.0000          .          
B    .12        -INF            6.3109         7.0000         EPS         
B    .13        -INF            5.8277         7.0000          .          
B    .14        -INF            7.0000         7.0000          .          
B    .15        -INF            6.0000         7.0000          .          
B    .16        -INF            4.5000         7.0000          .          
B    .17        -INF            1.5000         7.0000          .          
B    .18        -INF             .             7.0000          .          
B    .19        -INF             .             7.0000          .          
B    .20        -INF             .             7.0000          .          
B    .21        -INF             .             7.0000          .          
B    .22        -INF             .             7.0000          .          
B    .23        -INF             .             7.0000          .          
B    .24        -INF             .             7.0000          .          
store.1         -INF           -3.8802         5.0000          .          
store.2         -INF           -3.8802         5.0000          .          
store.3         -INF           -1.7061         5.0000          .          
store.4         -INF      -8.88178E-16         5.0000          .          
store.5         -INF            1.8493         5.0000          .          
store.6         -INF            1.6935         5.0000          .          
store.7         -INF            0.8658         5.0000          .          
store.8         -INF            2.1684         5.0000          .          
store.9         -INF            3.1684         5.0000          .          
store.10        -INF            4.1684         5.0000          .          
store.11        -INF            4.2249         5.0000         EPS         
store.12        -INF            1.6891         5.0000          .          
store.13        -INF            0.1723         5.0000          .          
store.14        -INF             .             5.0000          .          
store.15        -INF             .             5.0000          .          
store.16        -INF           -0.5000         5.0000          .          
store.17        -INF            0.5000         5.0000          .          
store.18        -INF             .             5.0000          .          
store.19        -INF           -0.5000         5.0000          .          
store.20        -INF            0.5000         5.0000          .          
store.21        -INF             .             5.0000          .          
GAMS 25.1.3  r4e34d435fbd Released Oct 30, 2018 WEX-WEI x86 64bit/MS Windows                                                                                                                                                          09/01/21 13:59:45 Page 15
G e n e r a l   A l g e b r a i c   M o d e l i n g   S y s t e m
Solution Report     SOLVE first_dispatch Using DNLP From line 90


     EQU eqcapacity  capacity constraints

                LOWER          LEVEL          UPPER         MARGINAL

store.22        -INF           -2.4383         5.0000          .          
store.23        -INF           -5.0000         5.0000          .          
store.24        -INF           -3.0952         5.0000          .          

---- EQU eqramp_lim  ramp rate limited to ramp_lim parameters

                LOWER          LEVEL          UPPER         MARGINAL

A    .1         -INF            0.2850         2.0000          .          
A    .2         -INF            2.0000         2.0000         EPS         
A    .3         -INF            0.1741         2.0000          .          
A    .4         -INF            0.2939         2.0000          .          
A    .5         -INF             .             2.0000          .          
A    .6         -INF             .             2.0000          .          
A    .7         -INF             .             2.0000          .          
A    .8         -INF             .             2.0000          .          
A    .9         -INF             .             2.0000          .          
A    .10        -INF             .             2.0000          .          
A    .11        -INF             .             2.0000          .          
A    .12        -INF             .             2.0000          .          
A    .13        -INF             .             2.0000          .          
A    .14        -INF             .             2.0000          .          
A    .15        -INF             .             2.0000          .          
A    .16        -INF             .             2.0000          .          
A    .17        -INF             .             2.0000          .          
A    .18        -INF            0.5000         2.0000          .          
A    .19        -INF            2.0000         2.0000         EPS         
A    .20        -INF            2.0000         2.0000          .          
A    .21        -INF            0.5000         2.0000          .          
A    .22        -INF            1.4383         2.0000          .          
A    .23        -INF            1.5617         2.0000         EPS         
A    .24        -INF            0.4048         2.0000          .          
B    .1         -INF             .             3.0000          .          
B    .2         -INF             .             3.0000          .          
B    .3         -INF             .             3.0000          .          
B    .4         -INF             .             3.0000          .          
B    .5         -INF            0.1507         3.0000          .          
B    .6         -INF            2.1558         3.0000          .          
B    .7         -INF            2.8277         3.0000         EPS         
B    .8         -INF            0.6974         3.0000          .          
B    .9         -INF             .             3.0000          .          
B    .10        -INF             .             3.0000          .          
B    .11        -INF            1.0565         3.0000          .          
B    .12        -INF            1.5357         3.0000          .          
B    .13        -INF            0.4832         3.0000          .          
B    .14        -INF            1.1723         3.0000          .          
B    .15        -INF            1.0000         3.0000          .          
B    .16        -INF            1.5000         3.0000          .          
B    .17        -INF            3.0000         3.0000         EPS         
GAMS 25.1.3  r4e34d435fbd Released Oct 30, 2018 WEX-WEI x86 64bit/MS Windows                                                                                                                                                          09/01/21 13:59:45 Page 16
G e n e r a l   A l g e b r a i c   M o d e l i n g   S y s t e m
Solution Report     SOLVE first_dispatch Using DNLP From line 90


     EQU eqramp_lim  ramp rate limited to ramp_lim parameters

                LOWER          LEVEL          UPPER         MARGINAL

B    .18        -INF            1.5000         3.0000          .          
B    .19        -INF             .             3.0000          .          
B    .20        -INF             .             3.0000          .          
B    .21        -INF             .             3.0000          .          
B    .22        -INF             .             3.0000          .          
B    .23        -INF             .             3.0000          .          
B    .24        -INF             .             3.0000          .          
store.1         -INF            0.7850        +INF             .          
store.2         -INF      8.881784E-16        +INF             .          
store.3         -INF            2.1741        +INF             .          
store.4         -INF            1.7061        +INF             .          
store.5         -INF            1.8493        +INF             .          
store.6         -INF            0.1558        +INF             .          
store.7         -INF            0.8277        +INF             .          
store.8         -INF            1.3026        +INF             .          
store.9         -INF            1.0000        +INF             .          
store.10        -INF            1.0000        +INF             .          
store.11        -INF            0.0565        +INF             .          
store.12        -INF            2.5357        +INF             .          
store.13        -INF            1.5168        +INF             .          
store.14        -INF            0.1723        +INF             .          
store.15        -INF             .            +INF             .          
store.16        -INF            0.5000        +INF             .          
store.17        -INF            1.0000        +INF             .          
store.18        -INF            0.5000        +INF             .          
store.19        -INF            0.5000        +INF             .          
store.20        -INF            1.0000        +INF             .          
store.21        -INF            0.5000        +INF             .          
store.22        -INF            2.4383        +INF             .          
store.23        -INF            2.5617        +INF             .          
store.24        -INF            1.9048        +INF             .          

---- EQU eqconserv  sum of outputs must equal demand at each time step

          LOWER          LEVEL          UPPER         MARGINAL

1           .              .              .           -40.0000      
2           .              .              .           -40.0000      
3           .              .              .           -40.0000      
4           .              .              .           -40.0000      
5           .              .              .           -50.0000      
6           .              .              .           -50.0000      
7           .              .              .           -50.0000      
8           .              .              .           -50.0000      
9           .              .              .           -50.0000      
10          .              .              .           -50.0000      
11          .              .              .           -50.0000      
12          .              .              .           -50.0000      
13          .              .              .           -50.0000      
GAMS 25.1.3  r4e34d435fbd Released Oct 30, 2018 WEX-WEI x86 64bit/MS Windows                                                                                                                                                          09/01/21 13:59:45 Page 17
G e n e r a l   A l g e b r a i c   M o d e l i n g   S y s t e m
Solution Report     SOLVE first_dispatch Using DNLP From line 90


     EQU eqconserv  sum of outputs must equal demand at each time step

          LOWER          LEVEL          UPPER         MARGINAL

14          .              .              .           -50.0000      
15          .              .              .           -50.0000      
16          .              .              .           -50.0000      
17          .              .              .           -50.0000      
18          .              .              .           -40.0000      
19          .              .              .           -40.0000      
20          .              .              .           -40.0000      
21          .              .              .           -40.0000      
22          .              .              .           -40.0000      
23          .              .              .           -40.0000      
24          .              .              .           -40.0000      

                           LOWER          LEVEL          UPPER         MARGINAL

---- EQU eqcost_tot          .              .              .             1.0000      

  eqcost_tot  grand total cost = sum of output*price over all time over all generators

---- VAR output  actual energy generated by each station at time t (MWh)

                LOWER          LEVEL          UPPER         MARGINAL

A    .1         -INF           11.8802        +INF             .          
A    .2         -INF           13.8802        +INF             .          
A    .3         -INF           13.7061        +INF             .          
A    .4         -INF           14.0000        +INF             .          
A    .5         -INF           14.0000        +INF             .          
A    .6         -INF           14.0000        +INF             .          
A    .7         -INF           14.0000        +INF             .          
A    .8         -INF           14.0000        +INF             .          
A    .9         -INF           14.0000        +INF             .          
A    .10        -INF           14.0000        +INF             .          
A    .11        -INF           14.0000        +INF             .          
A    .12        -INF           14.0000        +INF             .          
A    .13        -INF           14.0000        +INF             .          
A    .14        -INF           14.0000        +INF             .          
A    .15        -INF           14.0000        +INF             .          
A    .16        -INF           14.0000        +INF             .          
A    .17        -INF           14.0000        +INF             .          
A    .18        -INF           13.5000        +INF             .          
A    .19        -INF           11.5000        +INF             .          
A    .20        -INF            9.5000        +INF             .          
A    .21        -INF            9.0000        +INF             .          
A    .22        -INF           10.4383        +INF             .          
A    .23        -INF           12.0000        +INF             .          
A    .24        -INF           11.5952        +INF             .          
B    .1         -INF             .            +INF             .          
B    .2         -INF             .            +INF             .          
B    .3         -INF             .            +INF             .          
GAMS 25.1.3  r4e34d435fbd Released Oct 30, 2018 WEX-WEI x86 64bit/MS Windows                                                                                                                                                          09/01/21 13:59:45 Page 18
G e n e r a l   A l g e b r a i c   M o d e l i n g   S y s t e m
Solution Report     SOLVE first_dispatch Using DNLP From line 90


     VAR output  actual energy generated by each station at time t (MWh)

                LOWER          LEVEL          UPPER         MARGINAL

B    .4         -INF             .            +INF             .          
B    .5         -INF            0.1507        +INF             .          
B    .6         -INF            2.3065        +INF             .          
B    .7         -INF            5.1342        +INF             .          
B    .8         -INF            5.8316        +INF             .          
B    .9         -INF            5.8316        +INF             .          
B    .10        -INF            5.8316        +INF             .          
B    .11        -INF            4.7751        +INF             .          
B    .12        -INF            6.3109        +INF             .          
B    .13        -INF            5.8277        +INF             .          
B    .14        -INF            7.0000        +INF             .          
B    .15        -INF            6.0000        +INF             .          
B    .16        -INF            4.5000        +INF             .          
B    .17        -INF            1.5000        +INF             .          
B    .18        -INF             .            +INF             .          
B    .19        -INF             .            +INF             .          
B    .20        -INF             .            +INF             .          
B    .21        -INF             .            +INF             .          
B    .22        -INF             .            +INF             .          
B    .23        -INF             .            +INF             .          
B    .24        -INF             .            +INF             .          
store.1         -INF           -3.8802        +INF             .          
store.2         -INF           -3.8802        +INF             .          
store.3         -INF           -1.7061        +INF             .          
store.4         -INF      -8.88178E-16        +INF             .          
store.5         -INF            1.8493        +INF             .          
store.6         -INF            1.6935        +INF             .          
store.7         -INF            0.8658        +INF             .          
store.8         -INF            2.1684        +INF             .          
store.9         -INF            3.1684        +INF             .          
store.10        -INF            4.1684        +INF             .          
store.11        -INF            4.2249        +INF             .          
store.12        -INF            1.6891        +INF             .          
store.13        -INF            0.1723        +INF             .          
store.14        -INF             .            +INF             .          
store.15        -INF             .            +INF             .          
store.16        -INF           -0.5000        +INF             .          
store.17        -INF            0.5000        +INF             .          
store.18        -INF             .            +INF             .          
store.19        -INF           -0.5000        +INF             .          
store.20        -INF            0.5000        +INF             .          
store.21        -INF             .            +INF             .          
store.22        -INF           -2.4383        +INF             .          
store.23        -INF           -5.0000        +INF             .          
store.24        -INF           -3.0952        +INF             .          
GAMS 25.1.3  r4e34d435fbd Released Oct 30, 2018 WEX-WEI x86 64bit/MS Windows                                                                                                                                                          09/01/21 13:59:45 Page 19
G e n e r a l   A l g e b r a i c   M o d e l i n g   S y s t e m
Solution Report     SOLVE first_dispatch Using DNLP From line 90


---- VAR charge  stored energy in each store at time t (MWh)

                LOWER          LEVEL          UPPER         MARGINAL

store.1           .            14.4137        +INF             .          
store.2           .            18.2939        +INF             .          
store.3           .            20.0000        +INF             .          
store.4           .            20.0000        +INF             .          
store.5           .            18.1507        +INF             .          
store.6           .            16.4572        +INF             .          
store.7           .            15.5915        +INF             .          
store.8           .            13.4231        +INF             .          
store.9           .            10.2547        +INF             .          
store.10          .             6.0862        +INF             .          
store.11          .             1.8614        +INF             .          
store.12          .             0.1723        +INF            EPS         
store.13          .              .            +INF            EPS         
store.14          .              .            +INF            EPS         
store.15          .              .            +INF            EPS         
store.16          .             0.5000        +INF             .          
store.17          .              .            +INF           10.0000      
store.18          .              .            +INF            EPS         
store.19          .             0.5000        +INF             .          
store.20          .              .            +INF            EPS         
store.21          .              .            +INF            EPS         
store.22          .             2.4383        +INF             .          
store.23          .             7.4383        +INF             .          
store.24          .            10.5335        +INF             .          

---- VAR demandp  demand at time t as a variable (MWh)

          LOWER          LEVEL          UPPER         MARGINAL

1          8.0000         8.0000         8.0000        40.0000      
2         10.0000        10.0000        10.0000        40.0000      
3         12.0000        12.0000        12.0000        40.0000      
4         14.0000        14.0000        14.0000        40.0000      
5         16.0000        16.0000        16.0000        50.0000      
6         18.0000        18.0000        18.0000        50.0000      
7         20.0000        20.0000        20.0000        50.0000      
8         22.0000        22.0000        22.0000        50.0000      
9         23.0000        23.0000        23.0000        50.0000      
10        24.0000        24.0000        24.0000        50.0000      
11        23.0000        23.0000        23.0000        50.0000      
12        22.0000        22.0000        22.0000        50.0000      
13        20.0000        20.0000        20.0000        50.0000      
14        21.0000        21.0000        21.0000        50.0000      
15        20.0000        20.0000        20.0000        50.0000      
16        18.0000        18.0000        18.0000        50.0000      
17        16.0000        16.0000        16.0000        50.0000      
18        13.5000        13.5000        13.5000        40.0000      
19        11.0000        11.0000        11.0000        40.0000      
20        10.0000        10.0000        10.0000        40.0000      
GAMS 25.1.3  r4e34d435fbd Released Oct 30, 2018 WEX-WEI x86 64bit/MS Windows                                                                                                                                                          09/01/21 13:59:45 Page 20
G e n e r a l   A l g e b r a i c   M o d e l i n g   S y s t e m
Solution Report     SOLVE first_dispatch Using DNLP From line 90


     VAR demandp  demand at time t as a variable (MWh)

          LOWER          LEVEL          UPPER         MARGINAL

21         9.0000         9.0000         9.0000        40.0000      
22         8.0000         8.0000         8.0000        40.0000      
23         7.0000         7.0000         7.0000        40.0000      
24         8.5000         8.5000         8.5000        40.0000      

                           LOWER          LEVEL          UPPER         MARGINAL

---- VAR cost_tot          -INF        15570.0000        +INF             .          

  cost_tot  total cost of energy generated in the model horizon (EUR)

---- VAR spill  energy oversupply in time period t (MWh)

          LOWER          LEVEL          UPPER         MARGINAL

1           .              .            +INF           50.0000      
2           .              .            +INF           50.0000      
3           .              .            +INF           50.0000      
4           .              .            +INF           50.0000      
5           .              .            +INF           60.0000      
6           .              .            +INF           60.0000      
7           .              .            +INF           60.0000      
8           .              .            +INF           60.0000      
9           .              .            +INF           60.0000      
10          .              .            +INF           60.0000      
11          .              .            +INF           60.0000      
12          .              .            +INF           60.0000      
13          .              .            +INF           60.0000      
14          .              .            +INF           60.0000      
15          .              .            +INF           60.0000      
16          .              .            +INF           60.0000      
17          .              .            +INF           60.0000      
18          .              .            +INF           50.0000      
19          .              .            +INF           50.0000      
20          .              .            +INF           50.0000      
21          .              .            +INF           50.0000      
22          .              .            +INF           50.0000      
23          .              .            +INF           50.0000      
24          .              .            +INF           50.0000      

---- VAR loss  energy undersupply in time period t, i.e. loss of load (MWh)

          LOWER          LEVEL          UPPER         MARGINAL

1           .              .            +INF          460.0000      
2           .              .            +INF          460.0000      
3           .              .            +INF          460.0000      
4           .              .            +INF          460.0000      
5           .              .            +INF          450.0000      
GAMS 25.1.3  r4e34d435fbd Released Oct 30, 2018 WEX-WEI x86 64bit/MS Windows                                                                                                                                                          09/01/21 13:59:45 Page 21
G e n e r a l   A l g e b r a i c   M o d e l i n g   S y s t e m
Solution Report     SOLVE first_dispatch Using DNLP From line 90


     VAR loss  energy undersupply in time period t, i.e. loss of load (MWh)

          LOWER          LEVEL          UPPER         MARGINAL

6           .              .            +INF          450.0000      
7           .              .            +INF          450.0000      
8           .              .            +INF          450.0000      
9           .              .            +INF          450.0000      
10          .              .            +INF          450.0000      
11          .              .            +INF          450.0000      
12          .              .            +INF          450.0000      
13          .              .            +INF          450.0000      
14          .              .            +INF          450.0000      
15          .              .            +INF          450.0000      
16          .              .            +INF          450.0000      
17          .              .            +INF          450.0000      
18          .              .            +INF          460.0000      
19          .              .            +INF          460.0000      
20          .              .            +INF          460.0000      
21          .              .            +INF          460.0000      
22          .              .            +INF          460.0000      
23          .              .            +INF          460.0000      
24          .              .            +INF          460.0000      


**** REPORT SUMMARY :        0     NONOPT
                             0 INFEASIBLE
                             0  UNBOUNDED
                             0     ERRORS
                             1  PROJECTED
GAMS 25.1.3  r4e34d435fbd Released Oct 30, 2018 WEX-WEI x86 64bit/MS Windows                                                                                                                                                          09/01/21 13:59:45 Page 22
G e n e r a l   A l g e b r a i c   M o d e l i n g   S y s t e m
E x e c u t i o n


EXECUTION TIME       =        7.187 SECONDS      3 MB  25.1.3 r4e34d435fbd WEX-WEI


USER: Large MUD - 20 User License                    S180503:0430CO-WIN
      Aurora Energy Research Limited,                           DC10481


**** FILE SUMMARY

Input      C:\Projects\my_first_dispatch_model\dispatch_model.gms
Output     C:\Projects\my_first_dispatch_model\dispatch_model.lst
