,1,2,3,4,5,6,7,8,9,10,11,12,13,14,15,16,17,18,19,20,21,22,23,24
winter,15,15,15,16,17,20,21,20,19,19,19,20,20,19,19,19,20,21,21,20,19,19,17,16
summer,10,10,10,11,11.5,13,14,13,12,13,13,13,12,13,13,12,14,13,13,12,12,12,12,11
test,8,10,12,14,16,18,20,22,23,24,23,22,20,21,20,18,16,13.5,11,10,9,8,7,8.5
