%YAML 1.1
%TAG !u! tag:unity3d.com,2011:
--- !u!114 &11400000
MonoBehaviour:
  m_ObjectHideFlags: 0
  m_CorrespondingSourceObject: {fileID: 0}
  m_PrefabInstance: {fileID: 0}
  m_PrefabAsset: {fileID: 0}
  m_GameObject: {fileID: 0}
  m_Enabled: 1
  m_EditorHideFlags: 0
  m_Script: {fileID: 11500000, guid: 083b46a49c20617498628ca94ac0dc5c, type: 3}
  m_Name: 7211DA5D-08B0-4E7B-BB7D-1B49B3F5B930
  m_EditorClassIdentifier: 
  objectName: Main_Soundbank
  id: 2228651116
  guid: 7211DA5D-08B0-4E7B-BB7D-1B49B3F5B930
