{
    "groups": [
        {"name": "group5"},
        {"name": "group7", "parent_group":"atosbps/dev-teams/dev-team-d/group5"},
        {"name": "nested_group23", "parent_group":"atosbps/dev-teams/dev-team-d/group5/group7"}
    ],  
    "projects" : [
        {"name": "test3", "group": "atosbps/dev-teams/dev-team-d/group1"}, 
        {"name": "test4", "group": "atosbps/dev-teams/dev-team-d/group1/group2"}
    ]
}