<?xml version="1.0" encoding="utf-8"?>
<!-- Generator: Adobe Illustrator 27.5.0, SVG Export Plug-In . SVG Version: 6.00 Build 0)  -->
<svg version="1.1" id="Calque_1" xmlns="http://www.w3.org/2000/svg" xmlns:xlink="http://www.w3.org/1999/xlink" x="0px" y="0px"
	 viewBox="0 0 680 397" style="enable-background:new 0 0 680 397;" xml:space="preserve">
<style type="text/css">
	.st0{fill:#EC9329;}
	.st1{fill:#22A0A7;}
	.st2{fill:#25A1A8;}
	.st3{display:none;}
	.st4{display:inline;}
</style>
<g>
	<g>
		<g>
			<path class="st0" d="M401,77.6c-42.1,0-76.4,34.3-76.4,76.4c0,42.1,42.5,18.7,42.5,0c0-18.7,15.2-33.9,34-33.9
				c7.2,0,13.8,2.3,19.3,6.1l35.2-25.7C441.6,86.4,422.3,77.6,401,77.6z"/>
		</g>
		<circle class="st0" cx="476.6" cy="41.1" r="21.1"/>
		<polygon class="st0" points="604.2,78.2 604.4,23 604.4,22.7 564.7,22.5 564.6,22.8 564.4,78 508.9,77.8 508.9,77.8 508.7,117.5 
			508.7,117.5 564.2,117.8 564,173.3 564,173.3 603.8,173.5 603.8,173.5 604,118 659.2,118.2 659.5,118.2 659.7,78.4 659.4,78.4 		
			"/>
		<polygon class="st0" points="85.2,61.1 98.5,24 146.1,24 116.9,61.1 		"/>
		<g>
			<polygon class="st1" points="499.8,77.9 499.8,77.9 455.5,77.9 455.5,77.9 455.5,218.8 499.8,218.8 			"/>
			<polygon class="st1" points="369,78.1 369,78.1 324.7,78.1 324.7,78.1 324.7,218.8 369,218.8 			"/>
			<path class="st1" d="M322.9,175H276c-6.2,8.2-16.1,13.6-27.2,13.6c-18.8,0-34.2-15.3-34.2-34.2c0-18.8,15.3-34.2,34.2-34.2
				c9.5,0,18.1,3.9,24.3,10.2h48.8c-10.1-30.7-39-52.9-73-52.9c-42.4,0-76.9,34.5-76.9,76.9c0,26.9,13.9,50.6,34.9,64.4h84
				C306.3,208.7,317.9,193.2,322.9,175z"/>
			<path class="st1" d="M173.6,175.3H127c-3.1,4.1-7.2,7.5-11.9,9.9c-4.6,2.3-9.7,3.6-15.1,3.6c-13.8,0-25.7-8.3-31-20.1
				c-1.9-4.2-3-8.9-3-13.8c0-18.7,15.2-33.9,34-33.9c4.9,0,9.6,1.1,13.8,3l30.9-30.9c-12.6-9.1-28-14.5-44.7-14.5
				c-42.1,0-76.4,34.3-76.4,76.4c0,26.8,13.8,50.4,34.7,64h83.4C157.1,208.8,168.6,193.4,173.6,175.3z"/>
		</g>
		<path class="st0" d="M69,168.6c5.3,11.9,17.2,20.1,31,20.1c5.4,0,10.6-1.3,15.1-3.6l54.2-54.2l2.4-2.4
			c-5.3-14.4-14.8-26.8-27-35.7l-30.9,30.9L69,168.6z"/>
	</g>
	<path class="st2" d="M624.2,254.6H35.5l30.6,57.9l-30.6,57.9h588.6l45.8-57.9L624.2,254.6z M249.3,294.8h-17.6v44.8h-16.3v-44.8
		h-17.7v-12.9h51.7V294.8z M309.9,339.5h-46.3v-57.7h45.2v12.6h-29.1v9.7h25.6v12.2h-25.6v10.5h30.2V339.5z M370.2,331.3
		c-1.9,2.8-4.7,5.1-8.5,6.8c-3.8,1.7-8.5,2.5-14.2,2.5c-4.7,0-9.3-0.6-13.6-1.8c-4.4-1.2-7.9-2.7-10.7-4.6l5.4-12
		c2.6,1.7,5.6,3,8.9,4.1c3.4,1.1,6.7,1.6,10.1,1.6c2.3,0,4.1-0.2,5.4-0.6c1.4-0.4,2.4-1,3-1.6c0.6-0.7,0.9-1.5,0.9-2.4
		c0-1.3-0.6-2.4-1.8-3.1c-1.2-0.8-2.8-1.4-4.7-1.9s-4.1-1-6.4-1.5c-2.3-0.5-4.7-1.1-7-1.9c-2.3-0.8-4.5-1.8-6.4-3
		c-1.9-1.2-3.5-2.9-4.7-4.9c-1.2-2-1.8-4.6-1.8-7.6c0-3.5,0.9-6.6,2.8-9.4c1.9-2.8,4.7-5.1,8.5-6.8c3.8-1.7,8.5-2.6,14.2-2.6
		c3.8,0,7.5,0.4,11.2,1.3c3.7,0.8,6.9,2.1,9.8,3.7l-5,12.1c-2.7-1.5-5.5-2.6-8.2-3.3c-2.7-0.7-5.3-1.1-7.8-1.1
		c-2.3,0-4.1,0.2-5.4,0.7c-1.4,0.5-2.4,1.1-3,1.9c-0.6,0.8-0.9,1.6-0.9,2.6c0,1.3,0.6,2.3,1.8,3s2.7,1.3,4.7,1.8
		c2,0.5,4.1,0.9,6.4,1.4c2.3,0.5,4.7,1.1,7,1.9s4.5,1.7,6.4,3s3.5,2.9,4.7,4.9c1.2,2,1.8,4.5,1.8,7.5
		C373,325.4,372.1,328.5,370.2,331.3z M434.2,294.8h-17.6v44.8h-16.3v-44.8h-17.7v-12.9h51.7V294.8z M491.3,331.3
		c-1.9,2.8-4.7,5.1-8.5,6.8c-3.8,1.7-8.5,2.5-14.2,2.5c-4.7,0-9.3-0.6-13.6-1.8c-4.4-1.2-7.9-2.7-10.7-4.6l5.4-12
		c2.6,1.7,5.6,3,8.9,4.1c3.4,1.1,6.7,1.6,10.1,1.6c2.3,0,4.1-0.2,5.4-0.6c1.4-0.4,2.4-1,3-1.6c0.6-0.7,0.9-1.5,0.9-2.4
		c0-1.3-0.6-2.4-1.8-3.1c-1.2-0.8-2.8-1.4-4.7-1.9c-1.9-0.5-4.1-1-6.4-1.5c-2.3-0.5-4.7-1.1-7-1.9c-2.3-0.8-4.5-1.8-6.4-3
		c-1.9-1.2-3.5-2.9-4.7-4.9c-1.2-2-1.8-4.6-1.8-7.6c0-3.5,0.9-6.6,2.8-9.4c1.9-2.8,4.7-5.1,8.5-6.8c3.8-1.7,8.5-2.6,14.2-2.6
		c3.8,0,7.5,0.4,11.2,1.3c3.7,0.8,6.9,2.1,9.8,3.7l-5,12.1c-2.7-1.5-5.5-2.6-8.2-3.3c-2.7-0.7-5.3-1.1-7.8-1.1
		c-2.3,0-4.1,0.2-5.4,0.7c-1.4,0.5-2.4,1.1-3,1.9c-0.6,0.8-0.9,1.6-0.9,2.6c0,1.3,0.6,2.3,1.8,3c1.2,0.7,2.7,1.3,4.7,1.8
		c2,0.5,4.1,0.9,6.4,1.4c2.3,0.5,4.7,1.1,7,1.9c2.3,0.7,4.5,1.7,6.4,3c1.9,1.2,3.5,2.9,4.7,4.9c1.2,2,1.8,4.5,1.8,7.5
		C494.2,325.4,493.2,328.5,491.3,331.3z"/>
</g>
<g class="st3">
	<g class="st4">
		<g>
			<path class="st0" d="M396.6,76.5c-42.6,0-77.3,34.7-77.3,77.3c0,42.6,42.9,18.9,42.9,0c0-18.9,15.4-34.3,34.3-34.3
				c7.2,0,13.9,2.3,19.5,6.1l35.5-26C437.6,85.3,418.1,76.5,396.6,76.5z"/>
		</g>
		<circle class="st0" cx="473" cy="39.6" r="21.4"/>
		<polygon class="st0" points="602,77.1 602.2,21.3 602.2,20.9 562,20.8 562,21.1 561.8,76.9 505.6,76.7 505.6,76.7 505.4,116.9 
			505.4,116.9 561.6,117.1 561.3,173.3 561.3,173.3 601.5,173.4 601.5,173.4 601.8,117.3 657.6,117.6 657.9,117.6 658.1,77.3 
			657.8,77.3 		"/>
		<polygon class="st0" points="77.3,59.8 90.7,22.3 138.9,22.3 109.3,59.8 		"/>
		<g>
			<polygon class="st1" points="496.4,76.8 496.4,76.8 451.6,76.8 451.6,76.8 451.6,219.3 496.4,219.3 			"/>
			<polygon class="st1" points="364.2,77 364.2,77 319.4,77 319.4,77 319.4,219.3 364.2,219.3 			"/>
			<path class="st1" d="M317.6,175h-47.4c-6.3,8.3-16.3,13.7-27.5,13.7c-19,0-34.5-15.5-34.5-34.5c0-19,15.5-34.5,34.5-34.5
				c9.6,0,18.3,3.9,24.5,10.3h49.3c-10.2-31-39.5-53.5-73.9-53.5c-42.9,0-77.8,34.9-77.8,77.7c0,27.2,14,51.2,35.3,65.1h84.9
				C300.8,209,312.5,193.4,317.6,175z"/>
			<path class="st1" d="M166.7,175.2h-47.1c-3.2,4.2-7.3,7.6-12,10c-4.6,2.3-9.8,3.6-15.3,3.6c-14,0-26-8.4-31.3-20.4
				c-1.9-4.3-3-9-3-14c0-18.9,15.4-34.3,34.3-34.3c5,0,9.7,1.1,14,3L137.5,92c-12.7-9.2-28.3-14.7-45.2-14.7
				c-42.6,0-77.3,34.7-77.3,77.3c0,27.1,14,50.9,35.1,64.7h84.3C149.9,209.1,161.6,193.5,166.7,175.2z"/>
		</g>
		<path class="st0" d="M60.9,168.5c5.4,12,17.4,20.4,31.3,20.4c5.5,0,10.7-1.3,15.3-3.6l54.8-54.8l2.4-2.4
			c-5.3-14.6-15-27.1-27.3-36.1l-31.3,31.3L60.9,168.5z"/>
	</g>
	<g class="st4">
		<path class="st2" d="M620.9,255.8H28.8L59.5,314l-30.7,58.2h592.1L667,314L620.9,255.8z M249.6,271h15.8l-15.6,12.6h-11.3
			L249.6,271z M270.4,346.4h-46.6v-58h45.5V301h-29.3v9.8h25.8v12.3h-25.8v10.6h30.3V346.4z M321,346.4h-16.2l-24.8-58h17.7
			l15.7,37.8l16.1-37.8h16.3L321,346.4z M399,346.4l-4.5-11.3h-24.6l-4.5,11.3h-16.8l25.6-58h16.2l25.7,58H399z M473.1,346.4H429
			v-58h16.4v45h27.7V346.4z"/>
		<polygon class="st2" points="374.7,323 389.6,323 382.2,304.5 		"/>
	</g>
</g>
<g class="st3">
	<g class="st4">
		<g>
			<path class="st0" d="M394.4,76.9c-41.9,0-76,34.1-76,76c0,41.9,42.2,18.6,42.2,0c0-18.6,15.1-33.8,33.8-33.8
				c7.1,0,13.7,2.2,19.2,6l35-25.5C434.7,85.6,415.5,76.9,394.4,76.9z"/>
		</g>
		<circle class="st0" cx="469.5" cy="40.6" r="21"/>
		<polygon class="st0" points="596.4,77.5 596.6,22.6 596.6,22.2 557.1,22.1 557.1,22.4 556.8,77.3 501.6,77 501.6,77 501.4,116.6 
			501.4,116.6 556.7,116.8 556.4,172.1 556.4,172.1 596,172.3 596,172.3 596.2,117 651.1,117.3 651.5,117.3 651.6,77.7 651.3,77.7 
					"/>
		<polygon class="st0" points="80.3,60.5 93.5,23.6 140.8,23.6 111.8,60.5 		"/>
		<g>
			<polygon class="st1" points="492.6,77.2 492.6,77.2 448.5,77.2 448.5,77.2 448.5,217.3 492.6,217.3 			"/>
			<polygon class="st1" points="362.5,77.4 362.5,77.4 318.5,77.4 318.5,77.4 318.5,217.3 362.5,217.3 			"/>
			<path class="st1" d="M316.7,173.8h-46.6c-6.2,8.2-16,13.5-27,13.5c-18.7,0-34-15.2-34-34c0-18.7,15.2-34,34-34
				c9.4,0,18,3.9,24.1,10.1h48.5c-10.1-30.5-38.8-52.6-72.6-52.6c-42.2,0-76.5,34.3-76.5,76.5c0,26.8,13.8,50.4,34.7,64h83.6
				C300.1,207.3,311.7,191.9,316.7,173.8z"/>
			<path class="st1" d="M168.2,174h-46.3c-3.1,4.1-7.2,7.5-11.8,9.8c-4.5,2.3-9.6,3.6-15.1,3.6c-13.7,0-25.5-8.2-30.8-20
				c-1.9-4.2-2.9-8.8-2.9-13.7c0-18.6,15.1-33.8,33.8-33.8c4.9,0,9.5,1.1,13.7,2.9l30.8-30.8C127,83,111.6,77.7,95,77.7
				c-41.9,0-76,34.1-76,76c0,26.6,13.8,50.1,34.5,63.7h82.9C151.7,207.3,163.2,192,168.2,174z"/>
		</g>
		<path class="st0" d="M64.2,167.4c5.3,11.8,17.1,20,30.8,20c5.4,0,10.5-1.3,15.1-3.6l53.9-53.9l2.4-2.4
			c-5.3-14.3-14.7-26.6-26.9-35.5l-30.8,30.8L64.2,167.4z"/>
	</g>
	<g class="st4">
		<g>
			<path class="st2" d="M320.7,314.7h9c3.4,0,5.9-0.7,7.6-2.2c1.7-1.5,2.5-3.5,2.5-6.1c0-2.7-0.8-4.8-2.5-6.2
				c-1.7-1.5-4.2-2.2-7.6-2.2h-9V314.7z"/>
			<path class="st2" d="M616.5,253.5h-585L61.8,311l-30.4,57.5h585L662,311L616.5,253.5z M187.2,320.5c0.8,2,1.9,3.7,3.3,5.2
				c1.4,1.4,3.1,2.5,5,3.3s4.1,1.2,6.5,1.2c2.7,0,5.2-0.6,7.4-1.7c2.2-1.1,4.2-2.8,6.1-5l10.3,9.3c-2.8,3.4-6.3,6.1-10.4,8
				c-4.2,1.9-8.9,2.8-14.2,2.8c-4.5,0-8.7-0.7-12.6-2.2c-3.8-1.5-7.2-3.5-10-6.2c-2.8-2.7-5-5.8-6.6-9.5c-1.6-3.6-2.4-7.6-2.4-12
				c0-4.4,0.8-8.4,2.4-12c1.6-3.6,3.8-6.8,6.6-9.5c2.8-2.7,6.1-4.7,10-6.2c3.9-1.5,8-2.2,12.6-2.2c5.3,0,10,0.9,14.2,2.8
				c4.2,1.9,7.6,4.5,10.4,8l-10.3,9.3c-1.9-2.2-3.9-3.9-6.1-5c-2.2-1.1-4.7-1.7-7.4-1.7c-2.3,0-4.5,0.4-6.5,1.1
				c-2,0.8-3.6,1.9-5,3.3c-1.4,1.4-2.5,3.2-3.3,5.2c-0.8,2-1.2,4.3-1.2,6.7C186,316.2,186.4,318.5,187.2,320.5z M287.3,342.5h-46
				v-57.3h45v12.5h-28.9v9.7h25.5v12.1h-25.5v10.5h30V342.5z M339.9,342.5l-10.4-15.2h-8.8v15.2h-16.2v-57.3h26.2
				c5.2,0,9.8,0.8,13.5,2.5c3.8,1.7,6.7,4.1,8.8,7.3c2.1,3.2,3.1,7,3.1,11.3c0,4.3-1,8-3.1,11.2c-1.9,2.9-4.7,5.2-8.2,6.8l12.4,18.1
				H339.9z M418.4,298h-17.5v44.5h-16.2V298H367v-12.9h51.4V298z M448.8,342.5h-16.2v-57.3h16.2V342.5z M513.5,297.7h-28.7v12.6
				h25.3v12.5h-25.3v19.7h-16.2v-57.3h45V297.7z"/>
		</g>
	</g>
</g>
</svg>
