<?xml version="1.0" encoding="UTF-8" standalone="no"?>
<!-- Generator: Adobe Illustrator 24.0.2, SVG Export Plug-In . SVG Version: 6.00 Build 0)  -->

<svg
   xmlns:dc="http://purl.org/dc/elements/1.1/"
   xmlns:cc="http://creativecommons.org/ns#"
   xmlns:rdf="http://www.w3.org/1999/02/22-rdf-syntax-ns#"
   xmlns:svg="http://www.w3.org/2000/svg"
   xmlns="http://www.w3.org/2000/svg"
   xmlns:sodipodi="http://sodipodi.sourceforge.net/DTD/sodipodi-0.dtd"
   xmlns:inkscape="http://www.inkscape.org/namespaces/inkscape"
   version="1.1"
   id="Calque_1"
   x="0px"
   y="0px"
   viewBox="0 0 792 320.6"
   style="enable-background:new 0 0 792 320.6;"
   xml:space="preserve"
   sodipodi:docname="ecriplus-logo.svg"
   inkscape:version="0.92.5 (2060ec1f9f, 2020-04-08)"><metadata
   id="metadata860"><rdf:RDF><cc:Work
       rdf:about=""><dc:format>image/svg+xml</dc:format><dc:type
         rdf:resource="http://purl.org/dc/dcmitype/StillImage" /><dc:title></dc:title></cc:Work></rdf:RDF></metadata><defs
   id="defs858" /><sodipodi:namedview
   pagecolor="#ffffff"
   bordercolor="#666666"
   borderopacity="1"
   objecttolerance="10"
   gridtolerance="10"
   guidetolerance="10"
   inkscape:pageopacity="0"
   inkscape:pageshadow="2"
   inkscape:window-width="1920"
   inkscape:window-height="1016"
   id="namedview856"
   showgrid="false"
   inkscape:snap-bbox="true"
   inkscape:snap-text-baseline="true"
   inkscape:zoom="0.8030303"
   inkscape:cx="459.1698"
   inkscape:cy="379.42157"
   inkscape:window-x="0"
   inkscape:window-y="27"
   inkscape:window-maximized="1"
   inkscape:current-layer="Calque_1" />
<style
   type="text/css"
   id="style815">
	.st0{fill:#EF9331;}
	.st1{fill:#EC9237;}
	.st2{fill:none;}
	.st3{fill:#00ACC6;}
	.st4{fill:#00ADC7;}
	.st5{font-family:'TruenoUltLt';}
	.st6{font-size:33px;}
	.st7{fill:none;stroke:#00AEEF;stroke-miterlimit:10;}
	.st8{font-family:'TruenoSBd';}
	.st9{font-size:22.5px;}
	.st10{font-size:15px;}
	.st11{font-family:'TruenoLt';}
</style>
<g
   id="g819">
	<path
   class="st0"
   d="M468,87.6c-49.9,0-90.4,40.6-90.4,90.4s50.3,22.1,50.3,0s18-40.2,40.2-40.2c8.5,0,16.3,2.7,22.8,7.2l41.6-30.4   C516,97.9,493.2,87.6,468,87.6z"
   id="path817" />
</g>
<circle
   class="st0"
   cx="557.4"
   cy="44.4"
   r="25"
   id="circle821" />
<polygon
   class="st1"
   points="708.3,88.3 708.6,23 708.6,22.6 661.6,22.4 661.6,22.7 661.3,88.1 595.6,87.8 595.6,87.8 595.4,134.9   595.4,134.9 661.1,135.1 660.8,200.8 660.8,200.9 707.8,201.1 707.8,201.1 708.1,135.4 773.5,135.6 773.8,135.6 774.1,88.6   773.7,88.6 "
   id="polygon823" />
<polygon
   class="st0"
   points="94.3,68 110,24.2 166.3,24.2 131.8,68 "
   id="polygon825" />
<g
   id="g839">
	<path
   class="st2"
   d="M111.8,138.8c-22.2,0-40.2,18-40.2,40.2c0,5.8,1.3,11.3,3.5,16.3l53-53C123.1,140,117.6,138.8,111.8,138.8z"
   id="path827" />
	<polygon
   class="st3"
   points="584.8,87.9 584.8,87.9 532.4,87.9 532.4,87.9 532.4,254.7 584.8,254.7  "
   id="polygon829" />
	<polygon
   class="st3"
   points="430.1,88.2 430.1,88.2 377.7,88.2 377.7,88.2 377.7,254.7 430.1,254.7  "
   id="polygon831" />
	<path
   class="st4"
   d="M375.5,202.9h-55.5c-7.4,9.7-19,16.1-32.2,16.1c-22.3,0-40.4-18.1-40.4-40.4s18.1-40.4,40.4-40.4   c11.2,0,21.4,4.6,28.7,12h57.7c-12-36.3-46.2-62.6-86.4-62.6c-50.2,0-91,40.8-91,91c0,31.8,16.4,59.9,41.3,76.2h99.4   C355.8,242.7,369.6,224.4,375.5,202.9z"
   id="path833" />
	<path
   class="st0"
   d="M75.1,195.3c6.3,14,20.3,23.8,36.7,23.8c6.4,0,12.5-1.5,17.9-4.3l64.2-64.1l2.8-2.8   c-6.3-17.1-17.5-31.7-32-42.2l-36.6,36.6L75.1,195.3z"
   id="path835" />
	<path
   class="st4"
   d="M198.9,203.1h-55.1c-3.7,4.9-8.5,8.9-14.1,11.7c-5.4,2.7-11.5,4.3-17.9,4.3c-16.3,0-30.4-9.8-36.7-23.8   c-2.2-5-3.5-10.5-3.5-16.3c0-22.1,18-40.2,40.2-40.2c5.8,0,11.3,1.3,16.3,3.5l36.6-36.6c-14.9-10.8-33.2-17.2-52.9-17.2   c-49.9,0-90.4,40.6-90.4,90.4c0,31.7,16.4,59.6,41.1,75.7h98.7C179.3,242.8,192.9,224.6,198.9,203.1z"
   id="path837" />
</g>
<rect
   x="58.5"
   y="269.5"
   class="st2"
   width="725.5"
   height="45"
   id="rect841" />
<text
   transform="matrix(1 0 0 1 58.5 293.9733)"
   class="st3 st5 st6"
   id="text843"
   style="-inkscape-font-specification:sans-serif;font-family:sans-serif;font-weight:normal;font-style:normal;font-stretch:normal;font-variant:normal;">ÉVALUER - FORMER - CERTIFIER  </text>

<text
   class="st7 st5 st6"
   id="text845"
   style="font-style:normal;font-variant:normal;font-weight:normal;font-stretch:normal;font-size:33px;font-family:sans-serif;-inkscape-font-specification:sans-serif;fill:none;stroke:#00aeef;stroke-miterlimit:10"
   x="58.5"
   y="293.9733">ÉVALUER - FORMER - CERTIFIER  </text>

<rect
   x="599.6"
   y="263.8"
   class="st2"
   width="175.5"
   height="45"
   id="rect847" />

<text
   transform="matrix(2 0 0 1 773.4727 288.3287)"
   class="st0 st8 st10"
   id="text851"> </text>

<text
   class="st4 st11 st6"
   id="text853"
   transform="matrix(1 0 0 1 780.7029 288.3288)">  </text>

<text
   y="293.9733"
   x="603.3642"
   class="st3 st5 st6"
   id="text843-0"
   style="font-style:normal;font-variant:normal;font-weight:normal;font-stretch:normal;font-size:33px;font-family:sans-serif;-inkscape-font-specification:sans-serif;fill:#ec9237;fill-opacity:1">FRANÇAIS</text>
</svg>