{
  "shaders": [
    {
      "tag": "simple_frag",
      "type": "fragment",
      "path": "data/shaders/compiled_shaders/simple_shader.frag.spv"
    },
    {
      "tag": "simple_vert",
      "type": "vertex",
      "path": "data/shaders/compiled_shaders/simple_shader.vert.spv"
    }
  ],
  "textures": [
    {
      "tag": "dirt",
      "path": "dirt.png"
    }
  ],
  "pipelines": [
    {
      "tag": "simple_pipeline",
      "shaders": {
        "frag": "simple_frag",
        "vert": "simple_vert"
      }
    }
  ],
  "materials": [
    {
      "tag": "simple_material",
      "pipeline": "simple_pipeline"
    }
  ],
  "models": [
    {
      "tag": "color_cube",
      "path": "data/models/colored_cube.obj"
    },
    {
      "tag": "flat_vase",
      "path": "data/models/flat_vase.obj"
    }
  ],
  "meshes": [
    {
      "tag": "color_cube_mesh",
      "model": "color_cube",
      "material": "simple_material"
    },
    {
      "tag": "flat_vase_mesh",
      "model": "flat_vase",
      "material": "simple_material"
    }
  ]
}