{
  "species": "df155812-4351-11ec-a26d-0a580a64102c",
  "absence": null,
  "bias": null,
  "base_layer": {
    "uuid": "482db857-68b0-5d9e-a742-6e3180c82777",
    "layers": [
      "bioclim_01"
    ]
  },
  "predictors": [
    {
      "uuid": "482db857-68b0-5d9e-a742-6e3180c82777",
      "layers": [
        "bioclim_01"
      ]
    }
  ],
  "modelling_region": {
    "method": "convex hull",
    "radius": 0,
    "geojson": "{\"type\":\"Feature\",\"properties\":{},\"geometry\":{\"type\":\"Polygon\",\"coordinates\":[[[146.85,-21.166],[145.8,-16.816667],[145.35084276245496,-14.965275321996364],[142.85,-8.865999999999998],[141.1128,-8.432800000000002],[134.75000000000003,-11.95],[134.73,-14.68],[146.85,-21.166]]]}}"
  },
  "scale_down": "finest-resolution",
  "compress": null,
  "pa_ratio": 1,
  "pa_strategy": "random",
  "pa_sre_quant": 0.025,
  "pa_disk_min": 0,
  "pa_disk_max": null,
  "user": { "uuid": "owner-uuid" },
  "random_seed": 3232
}