{
  "user": { "uuid": "d6b4a45f-5826-4c6b-9dcd-ed52a262b381" },
  "species": "c6509ba6-8624-11eb-8194-0242ac140006",
  "absence": null,
  "bias" : null,
  "predictors": [
    {
      "uuid": "c560b872-31bd-5867-bb12-dea5d9e90442",
      "layers": [
        "mevap",
        "mprec"
      ]
    }
  ],
  "compress":  "gzip",
  "pa_ratio": 1.0,
  "pa_strategy": "random",
  "pa_sre_quant": null,
  "pa_disk_min": 0.0,
  "pa_disk_max": null,
  "tree_complexity": 1,
  "learning_rate":  0.01,
  "bag_fraction":  0.75,
  "n_folds":  10,
  "prev_stratify":  true,
  "family": "bernoulli",
  "n_trees":  50,
  "max_trees":  10000,
  "tolerance_method":  "auto",
  "tolerance_value": 0.001,
  "workdir": "/sdmwork",
  "scale_down": "finest-resolution",
  "random_seed": 1234,
  "unconstraint_map": true,
  "generate_convexhull": false,
  "modelling_region": {
      "method": "convex hull",
      "radius": 1.0,
      "geojson": "{\"type\":\"FeatureCollection\",\"features\":[{\"type\":\"Feature\",\"id\":\"geo_constraints\",\"geometry\":{\"type\":\"Polygon\",\"coordinates\":[[[17081975.86222783,-3198635.9028256694],[17078265.249641217,-3244771.9105849112],[17068988.55119545,-3246872.6247306815],[17035681.202952653,-3244587.770087115],[17007762.83125915,-3207012.7548658494],[17005907.580625594,-3165179.3854764462],[17004927.18987017,-3133656.5419858764],[17026316.11683119,-3133886.9695945433],[17079718.525593523,-3180852.0312850703],[17081975.86222783,-3198635.9028256694]]]},\"properties\":{}}],\"crs\":{\"type\":\"name\",\"properties\":{\"name\":\"urn:ogc:def:crs:EPSG::3857\"}},\"properties\":{\"constraint_method\":{\"title\":\"Use Convex Hull\",\"id\":\"use_convex_hull\"},\"region_offset\":\"\"}}"
  }
}