{
  "jobtype": "CC",
  "functions": [
    {
      "function": "https://gitlab.com/ecocommons-australia/ecocommons-platform/sdm-function/cc.nf",
      "parameters": {}
    }
  ],
  "parameters": {
    "user": {
      "uuid": "16ba2d53-8017-4be3-88a6-ad1934638bfa"
    },
    "future_climate_datasets": [
      "c151cd06-fa77-11eb-bc01-0242ac150005"
    ],
    "species_distribution_models": [
      {
        "uuid": "7dc17fdc-0954-11ec-b4f1-0242ac130003",
        "threshold": 0.5
      },
      {
        "uuid": "7dd73278-0954-11ec-b4f1-0242ac130003",
        "threshold": 0.5
      }
    ],
    "scale_down": "finest-resolution",
    "projection_region": {
      "method": "convex hull",
      "radius": 1.0,
      "geojson": "{\"type\":\"FeatureCollection\",\"features\":[{\"type\":\"Feature\",\"id\":\"geo_constraints\",\"geometry\":{\"type\":\"Polygon\",\"coordinates\":[[[12902111.75236804,-1194710.7520973047],[17056999.298865367,-1188977.9749759168],[17199860.10473036,-5507746.51011666],[12554934.769896772,-5585177.219769543],[12902111.75236804,-1194710.7520973047]]]},\"properties\":{}}],\"crs\":{\"type\":\"name\",\"properties\":{\"name\":\"urn:ogc:def:crs:EPSG::3857\"}},\"properties\":{\"constraint_method\":{\"title\":\"Use Convex Hull\",\"id\":\"use_convex_hull\"},\"region_offset\":\"\"}}"
    }
  }
}