{
  "user": {
    "uuid": "d6b4a45f-5826-4c6b-9dcd-ed52a262b381"
  },
  "traits_dataset": "ddcb7fb2-0fae-11ec-8295-0242ac180005",
  "traits_dataset_params": {
    "trait1": "trait_con",
    "trait2": "trait_con",
    "env1": "env_var_con",
    "env2": "env_var_con",
    "env3": "env_var_con"
  },
  "species": null,
  "predictors": [
    {
      "uuid": "c560b872-31bd-5867-bb12-dea5d9e90442",
      "layers": [
        "mevap",
        "mprec"
      ]
    }
  ],
  "control_minbucket": 7,
  "control_minsplit": 20,
  "control_cp": 0.01,
  "control_maxcompete": 4,
  "control_maxsurrogate": 5,
  "control_usesurrogate": 2,
  "control_xval": 10,
  "control_surstyle": 0,
  "control_maxdepth": 30,
  "random_seed": 1234,
  "modelling_region": {
      "method": "convex hull",
      "radius": 1.0,
      "geojson": "{\"type\":\"FeatureCollection\",\"features\":[{\"type\":\"Feature\",\"id\":\"geo_constraints\",\"geometry\":{\"type\":\"Polygon\",\"coordinates\":[[[17081975.86222783,-3198635.9028256694],[17078265.249641217,-3244771.9105849112],[17068988.55119545,-3246872.6247306815],[17035681.202952653,-3244587.770087115],[17007762.83125915,-3207012.7548658494],[17005907.580625594,-3165179.3854764462],[17004927.18987017,-3133656.5419858764],[17026316.11683119,-3133886.9695945433],[17079718.525593523,-3180852.0312850703],[17081975.86222783,-3198635.9028256694]]]},\"properties\":{}}],\"crs\":{\"type\":\"name\",\"properties\":{\"name\":\"urn:ogc:def:crs:EPSG::3857\"}},\"properties\":{\"constraint_method\":{\"title\":\"Use Convex Hull\",\"id\":\"use_convex_hull\"},\"region_offset\":\"\"}}"
  }
}