"lon","lat","name","occupancy"
144.9,-37.8,"Melbourne",1
144.3,-38.2,"Geelong",1
143.9,-37.6,"Ballarat",1
144.3,-36.8,"Bendigo",1
142.5,-38.4,"Warrnambool",1
147.1,-38.1,"Sale",1
145.5,-36.4,"Shepparton",1
141.5,-38.3,"Portland",1
148.4,-37.7,"Orbost",0.9
146,-36.6,"Benalla",1
146.9,-36.1,"Albury",1
142.2,-36.7,"Horsham",0.9
142.2,-34.2,"Mildura",0.2
142,-37.8,"Hamilton",1
