"","t0","t1","t2","t3","t4","t5","t6"
"mean",11.7622640505433,23.6023153185844,46.1165313065052,96.4595507629216,217.453368716314,501.443309221417,1246.50729395896
"sd",0,2.16765927718693,7.39753157686629,26.4984058985061,73.1367404287161,179.785607022064,329.708652737655
