"","lat","lon","population"
"1",-37.8,144.9,1000
"2",-38.2,144.3,100
"3",-37.6,143.9,0
"4",-36.8,144.3,0
"5",-38.4,142.5,0
"6",-38.1,147.1,0
"7",-36.4,145.5,0
"8",-38.3,141.5,40
"9",-37.7,148.4,0
"10",-36.6,146,0
"11",-36.1,146.9,0
"12",-36.7,142.2,0
"13",-34.2,142.2,0
"14",-37.8,142,0
