"i","j","weight"
1,2,0.9
1,3,0.8
1,4,0.8
1,6,0.7
1,7,0.7
1,10,0.9
2,3,0.6
2,5,0.7
3,4,0.6
3,5,0.6
3,12,0.7
3,14,0.7
4,7,0.7
4,12,0.5
4,13,0.6
4,14,0.5
5,8,0.7
5,14,0.6
6,9,0.7
7,10,0.6
8,14,0.6
10,11,0.9
12,13,0.5
12,14,0.5
