"lon","lat","NRM_REGION","NRM_ID","SHAPE_AREA","presence"
143.70512168674,-38.2057768524585,"Corangamite",2010,1.49906380878,1
148.246674433554,-37.4489426016067,"East Gippsland",2020,2.26451858146,0
142.168389993052,-37.7643551006193,"Glenelg Hopkins",2030,2.87636934616,0
145.111834779173,-37.9181139747776,"Port Phillip and Western Port",2080,1.62616112314,1
146.54065530296,-38.2316656682104,"West Gippsland",2090,2.09529259497,1
145.568199046518,-36.7677506032384,"Goulburn Broken",2040,2.42993007515,1
142.081947504791,-35.1497000383394,"Mallee",2050,3.88543462154,0
143.837814125426,-36.4974109727618,"North Central",2060,2.98246997563,0
147.148207758047,-36.5471388788504,"North East",2070,1.99324002168,0
141.967209299108,-36.5964099027363,"Wimmera",2100,2.36223097932,0
