"lat","lon","suitability"
-37.8,144.9,0.95
-38.2,144.3,0.85
-37.6,143.9,0.75
-36.8,144.3,0.7
-38.4,142.5,0.8
-38.1,147.1,0.9
-36.4,145.5,0.55
-38.3,141.5,0.72
-37.7,148.4,0.76
-36.6,146,0.5
-36.1,146.9,0.6
-36.7,142.2,0.4
-34.2,142.2,0.3
-37.8,142,0.7
