"lat","lon","name","source","destination"
-37.8,144.9,"Melbourne",1,0.5
-38.2,144.3,"Geelong",0.8,0.8
-37.6,143.9,"Ballarat",0.7,0.7
-36.8,144.3,"Bendigo",0.7,0.7
-38.4,142.5,"Warrnambool",0.6,0.6
-38.1,147.1,"Sale",0.5,0.5
-36.4,145.5,"Shepparton",0.4,0.4
-38.3,141.5,"Portland",0.5,0.4
-37.7,148.4,"Orbost",0.3,0.3
-36.6,146,"Benalla",0.3,0.3
-36.1,146.9,"Albury",0.6,0.5
-36.7,142.2,"Horsham",0.3,0.4
-34.2,142.2,"Mildura",0.5,0.3
-37.8,142,"Hamilton",0.4,0.4
