<PAMDataset>
  <PAMRasterBand band="1">
    <Description>category</Description>
    <CategoryNames>
      <Category></Category>
      <Category>-</Category>
      <Category>MC</Category>
      <Category>MN</Category>
      <Category>MO</Category>
      <Category>MR</Category>
      <Category>MV</Category>
      <Category></Category>
      <Category></Category>
      <Category></Category>
      <Category></Category>
      <Category></Category>
      <Category></Category>
      <Category></Category>
      <Category></Category>
      <Category></Category>
      <Category></Category>
      <Category></Category>
      <Category></Category>
      <Category></Category>
      <Category></Category>
      <Category></Category>
      <Category></Category>
      <Category></Category>
      <Category></Category>
      <Category></Category>
      <Category></Category>
      <Category></Category>
      <Category></Category>
      <Category></Category>
      <Category></Category>
      <Category></Category>
      <Category></Category>
      <Category></Category>
      <Category></Category>
      <Category></Category>
      <Category></Category>
      <Category></Category>
      <Category></Category>
      <Category></Category>
      <Category></Category>
      <Category></Category>
      <Category></Category>
      <Category></Category>
      <Category></Category>
      <Category></Category>
      <Category></Category>
      <Category></Category>
      <Category></Category>
      <Category></Category>
      <Category></Category>
      <Category></Category>
      <Category></Category>
      <Category></Category>
      <Category></Category>
      <Category></Category>
      <Category></Category>
      <Category></Category>
      <Category></Category>
      <Category></Category>
      <Category></Category>
      <Category></Category>
      <Category></Category>
      <Category></Category>
      <Category></Category>
      <Category></Category>
      <Category></Category>
      <Category></Category>
      <Category></Category>
      <Category></Category>
      <Category></Category>
      <Category></Category>
      <Category></Category>
      <Category></Category>
      <Category></Category>
      <Category></Category>
      <Category></Category>
      <Category></Category>
      <Category></Category>
      <Category></Category>
      <Category></Category>
      <Category></Category>
      <Category></Category>
      <Category></Category>
      <Category></Category>
      <Category></Category>
      <Category></Category>
      <Category></Category>
      <Category></Category>
      <Category></Category>
      <Category></Category>
      <Category></Category>
      <Category></Category>
      <Category></Category>
      <Category></Category>
      <Category></Category>
      <Category></Category>
      <Category></Category>
      <Category></Category>
      <Category></Category>
      <Category></Category>
      <Category></Category>
      <Category></Category>
      <Category></Category>
      <Category></Category>
      <Category></Category>
      <Category></Category>
      <Category></Category>
      <Category></Category>
      <Category></Category>
      <Category></Category>
      <Category></Category>
      <Category></Category>
      <Category></Category>
      <Category></Category>
      <Category></Category>
      <Category></Category>
      <Category></Category>
      <Category></Category>
      <Category></Category>
      <Category></Category>
      <Category></Category>
      <Category></Category>
      <Category></Category>
      <Category></Category>
      <Category></Category>
      <Category></Category>
      <Category></Category>
      <Category></Category>
      <Category></Category>
      <Category></Category>
      <Category></Category>
      <Category></Category>
      <Category></Category>
      <Category></Category>
      <Category></Category>
      <Category></Category>
      <Category></Category>
      <Category></Category>
      <Category></Category>
      <Category></Category>
      <Category></Category>
      <Category></Category>
      <Category></Category>
      <Category></Category>
      <Category></Category>
      <Category></Category>
      <Category></Category>
      <Category></Category>
      <Category></Category>
      <Category></Category>
      <Category></Category>
      <Category></Category>
      <Category></Category>
      <Category></Category>
      <Category></Category>
      <Category></Category>
      <Category></Category>
      <Category></Category>
      <Category></Category>
      <Category></Category>
      <Category></Category>
      <Category></Category>
      <Category></Category>
      <Category></Category>
      <Category></Category>
      <Category></Category>
      <Category></Category>
      <Category></Category>
      <Category></Category>
      <Category></Category>
      <Category></Category>
      <Category></Category>
      <Category></Category>
      <Category></Category>
      <Category></Category>
      <Category></Category>
      <Category></Category>
      <Category></Category>
      <Category></Category>
      <Category></Category>
      <Category></Category>
      <Category></Category>
      <Category></Category>
      <Category></Category>
      <Category></Category>
      <Category></Category>
      <Category></Category>
      <Category></Category>
      <Category></Category>
      <Category></Category>
      <Category></Category>
      <Category></Category>
      <Category></Category>
      <Category></Category>
      <Category></Category>
      <Category></Category>
      <Category></Category>
      <Category></Category>
      <Category></Category>
      <Category></Category>
      <Category></Category>
      <Category></Category>
      <Category></Category>
      <Category></Category>
      <Category></Category>
      <Category></Category>
      <Category></Category>
      <Category></Category>
      <Category></Category>
      <Category></Category>
      <Category></Category>
      <Category></Category>
      <Category></Category>
      <Category></Category>
      <Category></Category>
      <Category></Category>
      <Category></Category>
      <Category></Category>
      <Category></Category>
      <Category></Category>
      <Category></Category>
      <Category></Category>
      <Category></Category>
      <Category></Category>
      <Category></Category>
      <Category></Category>
      <Category></Category>
      <Category></Category>
      <Category></Category>
      <Category></Category>
      <Category></Category>
      <Category></Category>
      <Category></Category>
      <Category></Category>
      <Category></Category>
      <Category></Category>
      <Category></Category>
      <Category></Category>
      <Category></Category>
      <Category></Category>
      <Category></Category>
      <Category></Category>
      <Category></Category>
      <Category></Category>
      <Category></Category>
      <Category></Category>
      <Category></Category>
      <Category></Category>
      <Category></Category>
      <Category></Category>
      <Category></Category>
      <Category></Category>
      <Category></Category>
      <Category></Category>
      <Category></Category>
    </CategoryNames>
  </PAMRasterBand>
</PAMDataset>
