"lat","lon","capacity"
-37.8,144.9,2000
-38.2,144.3,1800
-37.6,143.9,1600
-36.8,144.3,1400
-38.4,142.5,1700
-38.1,147.1,1900
-36.4,145.5,1100
-38.3,141.5,1500
-37.7,148.4,1600
-36.6,146,1000
-36.1,146.9,1200
-36.7,142.2,800
-34.2,142.2,600
-37.8,142,1500
