Chronologic VCS simulator copyright 1991-2016
Contains Synopsys proprietary information.
Compiler version L-2016.06_Full64; Runtime version L-2016.06_Full64;  Jul  8 20:11 2018

############ FIM DA SIMULACAO ############
$finish called from file "../testbenches/tb.v", line 306.
$finish at simulation time               124000
           V C S   S i m u l a t i o n   R e p o r t 
Time: 124000 ps
CPU Time:      0.600 seconds;       Data structure size:   0.1Mb
Sun Jul  8 20:22:27 2018
