{
    "ocid": "ocds-b5fd17-fa07f4eb-93a3-4651-b229-a1b1904aab89",
    "id": "ocds-b5fd17-fa07f4eb-93a3-4651-b229-a1b1904aab89-450655-calder001-dn555885-70709767",
    "language": "en-GB",
    "date": "2021-07-12T12:28:48Z",
    "tag": [
        "tender"
    ],
    "initiationType": "tender",
    "tender": {
        "id": "CALDER001-DN555885-70709767",
        "title": "All Age Domiciliary Care Services - Approved Provider List",
        "description": "The Borough Council of Calderdale (&quot;the Council&quot;) and NHS Calderdale Clinical\r\nCommissioning Group (&quot;the CCG&quot;) invites tenders from tenderers who wish to be\r\nconsidered for appointment to the\r\nAll Age Domiciliary Care Services - Approved Provider List.\r\nThe commissioned service will be to provide personal care for all ages and all client groups, including those fully funded through Continuing Health Care. This will include children and young people who have been assessed as having a significant physical disability (which could include sensory or mental impairments), and adults who have been assessed and who have eligible needs associated with older age, sensory impairment, learning disability, physical disability, physical ill health, and mental health conditions including dementia.\r\nThe service will be operated in two lots. Lot 1 is for a contract with the Council and Lot 2 is for a contract with the CCG. All tenderers must bid for Lot 1 (it is mandatory). Lot 2 is discretionary and tenderers may, at their discretion, choose whether or not to bid for Lot 2",
        "datePublished": "2021-07-12T12:28:48Z",
        "status": "unsuccessful",
        "items": [
            {
                "id": 1,
                "description": "See description of related tender.",
                "classification": {
                    "scheme": "CPV",
                    "id": "85000000",
                    "description": "Health and social work services",
                    "uri": "http://cpv.data.ac.uk/code-85000000.html"
                }
            }
        ],
        "minValue": {
            "amount": 9600000,
            "currency": "GBP"
        },
        "value": {
            "amount": 9600000,
            "currency": "GBP"
        },
        "procurementMethod": null,
        "procurementMethodDetails": "Open procedure",
        "procurementMethodRationale": "",
        "awardCriteria": null,
        "awardCriteriaDetails": null,
        "submissionMethod": null,
        "submissionMethodDetails": "Please apply directly to the buyer using the contact details provided, or follow the instructions given in the notice description or information section.",
        "tenderPeriod": {
            "endDate": "2021-08-11T12:00:00Z"
        },
        "hasEnquiries": null,
        "eligibilityCriteria": null,
        "milestones": [
            {
                "id": 1,
                "title": "Contract start",
                "description": "Anticipated contract start date",
                "dueDate": "2021-11-01T00:00:00Z",
                "status": null
            },
            {
                "id": 2,
                "title": "Contract end",
                "description": "Anticipated contract end date",
                "dueDate": "2025-10-31T00:00:00Z",
                "status": null
            }
        ],
        "xClassifications": {
            "isSuitableForSme": true,
            "isSuitableForVco": true,
            "ojeuContractType": "Services"
        },
        "supplyChain": false,
        "documents": []
    },
    "buyer": {
        "name": "Calderdale Council",
        "address": {
            "streetAddress": "Princess Buildings Princess Street",
            "locality": "Halifax",
            "region": null,
            "postalCode": "HX1 1TP",
            "countryName": "England"
        },
        "contactPoint": {
            "name": "Bob Farr",
            "email": "bob.farr@calderdale.gov.uk",
            "telephone": "+44 1422",
            "faxNumber": null,
            "uri": "http://www.calderdale.gov.uk/"
        }
    }
}