<?xml version="1.0" encoding="utf-8"  standalone="no"?>
<svg 
 width="640" height="480"
 viewBox="0 0 640 480"
 xmlns="http://www.w3.org/2000/svg"
 xmlns:xlink="http://www.w3.org/1999/xlink"
>

<title>Gnuplot</title>
<desc>Produced by GNUPLOT 5.2 patchlevel 8 </desc>

<g id="gnuplot_canvas">

<rect x="0" y="0" width="640" height="480" fill="none"/>
<defs>

	<circle id='gpDot' r='0.5' stroke-width='0.5' stroke='currentColor'/>
	<path id='gpPt0' stroke-width='0.222' stroke='currentColor' d='M-1,0 h2 M0,-1 v2'/>
	<path id='gpPt1' stroke-width='0.222' stroke='currentColor' d='M-1,-1 L1,1 M1,-1 L-1,1'/>
	<path id='gpPt2' stroke-width='0.222' stroke='currentColor' d='M-1,0 L1,0 M0,-1 L0,1 M-1,-1 L1,1 M-1,1 L1,-1'/>
	<rect id='gpPt3' stroke-width='0.222' stroke='currentColor' x='-1' y='-1' width='2' height='2'/>
	<rect id='gpPt4' stroke-width='0.222' stroke='currentColor' fill='currentColor' x='-1' y='-1' width='2' height='2'/>
	<circle id='gpPt5' stroke-width='0.222' stroke='currentColor' cx='0' cy='0' r='1'/>
	<use xlink:href='#gpPt5' id='gpPt6' fill='currentColor' stroke='none'/>
	<path id='gpPt7' stroke-width='0.222' stroke='currentColor' d='M0,-1.33 L-1.33,0.67 L1.33,0.67 z'/>
	<use xlink:href='#gpPt7' id='gpPt8' fill='currentColor' stroke='none'/>
	<use xlink:href='#gpPt7' id='gpPt9' stroke='currentColor' transform='rotate(180)'/>
	<use xlink:href='#gpPt9' id='gpPt10' fill='currentColor' stroke='none'/>
	<use xlink:href='#gpPt3' id='gpPt11' stroke='currentColor' transform='rotate(45)'/>
	<use xlink:href='#gpPt11' id='gpPt12' fill='currentColor' stroke='none'/>
	<path id='gpPt13' stroke-width='0.222' stroke='currentColor' d='M0,1.330 L1.265,0.411 L0.782,-1.067 L-0.782,-1.076 L-1.265,0.411 z'/>
	<use xlink:href='#gpPt13' id='gpPt14' fill='currentColor' stroke='none'/>
	<filter id='textbox' filterUnits='objectBoundingBox' x='0' y='0' height='1' width='1'>
	  <feFlood flood-color='white' flood-opacity='1' result='bgnd'/>
	  <feComposite in='SourceGraphic' in2='bgnd' operator='atop'/>
	</filter>
	<filter id='greybox' filterUnits='objectBoundingBox' x='0' y='0' height='1' width='1'>
	  <feFlood flood-color='lightgrey' flood-opacity='1' result='grey'/>
	  <feComposite in='SourceGraphic' in2='grey' operator='atop'/>
	</filter>
</defs>
<g fill="none" color="white" stroke="currentColor" stroke-width="1.00" stroke-linecap="butt" stroke-linejoin="miter">
</g>
<g fill="none" color="black" stroke="currentColor" stroke-width="1.00" stroke-linecap="butt" stroke-linejoin="miter">
	<path stroke='black'  d='M71.9,422.4 L80.9,422.4 M615.0,422.4 L606.0,422.4  '/>	<g transform="translate(63.6,426.3)" stroke="none" fill="black" font-family="Arial" font-size="12.00"  text-anchor="end">
		<text><tspan font-family="Arial" > 0</tspan></text>
	</g>
</g>
<g fill="none" color="black" stroke="currentColor" stroke-width="1.00" stroke-linecap="butt" stroke-linejoin="miter">
	<path stroke='black'  d='M71.9,341.5 L80.9,341.5 M615.0,341.5 L606.0,341.5  '/>	<g transform="translate(63.6,345.4)" stroke="none" fill="black" font-family="Arial" font-size="12.00"  text-anchor="end">
		<text><tspan font-family="Arial" > 0.2</tspan></text>
	</g>
</g>
<g fill="none" color="black" stroke="currentColor" stroke-width="1.00" stroke-linecap="butt" stroke-linejoin="miter">
	<path stroke='black'  d='M71.9,260.7 L80.9,260.7 M615.0,260.7 L606.0,260.7  '/>	<g transform="translate(63.6,264.6)" stroke="none" fill="black" font-family="Arial" font-size="12.00"  text-anchor="end">
		<text><tspan font-family="Arial" > 0.4</tspan></text>
	</g>
</g>
<g fill="none" color="black" stroke="currentColor" stroke-width="1.00" stroke-linecap="butt" stroke-linejoin="miter">
	<path stroke='black'  d='M71.9,179.8 L80.9,179.8 M615.0,179.8 L606.0,179.8  '/>	<g transform="translate(63.6,183.7)" stroke="none" fill="black" font-family="Arial" font-size="12.00"  text-anchor="end">
		<text><tspan font-family="Arial" > 0.6</tspan></text>
	</g>
</g>
<g fill="none" color="black" stroke="currentColor" stroke-width="1.00" stroke-linecap="butt" stroke-linejoin="miter">
	<path stroke='black'  d='M71.9,99.0 L80.9,99.0 M615.0,99.0 L606.0,99.0  '/>	<g transform="translate(63.6,102.9)" stroke="none" fill="black" font-family="Arial" font-size="12.00"  text-anchor="end">
		<text><tspan font-family="Arial" > 0.8</tspan></text>
	</g>
</g>
<g fill="none" color="black" stroke="currentColor" stroke-width="1.00" stroke-linecap="butt" stroke-linejoin="miter">
	<path stroke='black'  d='M71.9,18.1 L80.9,18.1 M615.0,18.1 L606.0,18.1  '/>	<g transform="translate(63.6,22.0)" stroke="none" fill="black" font-family="Arial" font-size="12.00"  text-anchor="end">
		<text><tspan font-family="Arial" > 1</tspan></text>
	</g>
</g>
<g fill="none" color="black" stroke="currentColor" stroke-width="1.00" stroke-linecap="butt" stroke-linejoin="miter">
	<path stroke='black'  d='M71.9,422.4 L71.9,413.4 M71.9,18.1 L71.9,27.1  '/>	<g transform="translate(71.9,444.3)" stroke="none" fill="black" font-family="Arial" font-size="12.00"  text-anchor="middle">
		<text><tspan font-family="Arial" > 0</tspan></text>
	</g>
</g>
<g fill="none" color="black" stroke="currentColor" stroke-width="1.00" stroke-linecap="butt" stroke-linejoin="miter">
	<path stroke='black'  d='M162.4,422.4 L162.4,413.4 M162.4,18.1 L162.4,27.1  '/>	<g transform="translate(162.4,444.3)" stroke="none" fill="black" font-family="Arial" font-size="12.00"  text-anchor="middle">
		<text><tspan font-family="Arial" > 0.05</tspan></text>
	</g>
</g>
<g fill="none" color="black" stroke="currentColor" stroke-width="1.00" stroke-linecap="butt" stroke-linejoin="miter">
	<path stroke='black'  d='M252.9,422.4 L252.9,413.4 M252.9,18.1 L252.9,27.1  '/>	<g transform="translate(252.9,444.3)" stroke="none" fill="black" font-family="Arial" font-size="12.00"  text-anchor="middle">
		<text><tspan font-family="Arial" > 0.1</tspan></text>
	</g>
</g>
<g fill="none" color="black" stroke="currentColor" stroke-width="1.00" stroke-linecap="butt" stroke-linejoin="miter">
	<path stroke='black'  d='M343.5,422.4 L343.5,413.4 M343.5,18.1 L343.5,27.1  '/>	<g transform="translate(343.5,444.3)" stroke="none" fill="black" font-family="Arial" font-size="12.00"  text-anchor="middle">
		<text><tspan font-family="Arial" > 0.15</tspan></text>
	</g>
</g>
<g fill="none" color="black" stroke="currentColor" stroke-width="1.00" stroke-linecap="butt" stroke-linejoin="miter">
	<path stroke='black'  d='M434.0,422.4 L434.0,413.4 M434.0,18.1 L434.0,27.1  '/>	<g transform="translate(434.0,444.3)" stroke="none" fill="black" font-family="Arial" font-size="12.00"  text-anchor="middle">
		<text><tspan font-family="Arial" > 0.2</tspan></text>
	</g>
</g>
<g fill="none" color="black" stroke="currentColor" stroke-width="1.00" stroke-linecap="butt" stroke-linejoin="miter">
	<path stroke='black'  d='M524.5,422.4 L524.5,413.4 M524.5,18.1 L524.5,27.1  '/>	<g transform="translate(524.5,444.3)" stroke="none" fill="black" font-family="Arial" font-size="12.00"  text-anchor="middle">
		<text><tspan font-family="Arial" > 0.25</tspan></text>
	</g>
</g>
<g fill="none" color="black" stroke="currentColor" stroke-width="1.00" stroke-linecap="butt" stroke-linejoin="miter">
	<path stroke='black'  d='M615.0,422.4 L615.0,413.4 M615.0,18.1 L615.0,27.1  '/>	<g transform="translate(615.0,444.3)" stroke="none" fill="black" font-family="Arial" font-size="12.00"  text-anchor="middle">
		<text><tspan font-family="Arial" > 0.3</tspan></text>
	</g>
</g>
<g fill="none" color="black" stroke="currentColor" stroke-width="1.00" stroke-linecap="butt" stroke-linejoin="miter">
</g>
<g fill="none" color="black" stroke="currentColor" stroke-width="1.00" stroke-linecap="butt" stroke-linejoin="miter">
	<path stroke='black'  d='M71.9,18.1 L71.9,422.4 L615.0,422.4 L615.0,18.1 L71.9,18.1 Z  '/></g>
<g fill="none" color="black" stroke="currentColor" stroke-width="1.00" stroke-linecap="butt" stroke-linejoin="miter">
	<g transform="translate(19.0,220.3) rotate(270)" stroke="none" fill="black" font-family="Arial" font-size="12.00"  text-anchor="middle">
		<text><tspan font-family="Arial" >Scaled occurence (1/max)</tspan></text>
	</g>
</g>
<g fill="none" color="black" stroke="currentColor" stroke-width="1.00" stroke-linecap="butt" stroke-linejoin="miter">
	<g transform="translate(343.4,471.3)" stroke="none" fill="black" font-family="Arial" font-size="12.00"  text-anchor="middle">
		<text><tspan font-family="Arial" >Normalised Error (0 to 1)</tspan></text>
	</g>
</g>
<g fill="none" color="black" stroke="currentColor" stroke-width="1.00" stroke-linecap="butt" stroke-linejoin="miter">
</g>
	<g id="gnuplot_plot_1" ><title>W = 4</title>
<g fill="none" color="black" stroke="currentColor" stroke-width="1.00" stroke-linecap="butt" stroke-linejoin="miter">
	<g transform="translate(547.9,40.0)" stroke="none" fill="black" font-family="Arial" font-size="12.00"  text-anchor="end">
		<text><tspan font-family="Arial" >W = 4</tspan></text>
	</g>
</g>
<g fill="none" color="black" stroke="currentColor" stroke-width="1.00" stroke-linecap="butt" stroke-linejoin="miter">
	<path stroke='rgb(148,   0, 211)'  d='M556.2,36.1 L598.4,36.1 M71.9,422.4 L73.0,420.1 L74.1,420.8 L75.2,420.8 L76.2,422.4 L77.3,420.1
		L78.4,419.3 L79.5,418.5 L80.6,414.6 L81.7,420.1 L82.8,420.1 L83.8,417.7 L84.9,416.1 L86.0,413.0
		L87.1,413.0 L88.2,412.2 L89.3,411.5 L90.4,404.4 L91.5,413.8 L92.5,400.5 L93.6,406.0 L94.7,397.4
		L95.8,398.9 L96.9,404.4 L98.0,381.7 L99.1,393.5 L100.1,375.5 L101.2,393.5 L102.3,370.0 L103.4,388.8
		L104.5,370.8 L105.6,383.3 L106.7,363.7 L107.7,380.2 L108.8,358.3 L109.9,366.1 L111.0,384.1 L112.1,333.3
		L113.2,378.6 L114.3,334.0 L115.3,350.5 L116.4,317.6 L117.5,356.7 L118.6,327.0 L119.7,339.5 L120.8,304.3
		L121.9,337.9 L123.0,340.3 L124.0,312.9 L125.1,336.4 L126.2,294.1 L127.3,344.2 L128.4,295.7 L129.5,337.2
		L130.6,284.0 L131.6,317.6 L132.7,271.5 L133.8,316.8 L134.9,320.0 L136.0,264.4 L137.1,328.6 L138.2,245.7
		L139.2,314.5 L140.3,210.5 L141.4,316.0 L142.5,262.1 L143.6,298.8 L144.7,258.2 L145.8,296.5 L146.8,253.5
		L147.9,298.8 L149.0,294.9 L150.1,257.4 L151.2,294.1 L152.3,244.9 L153.4,298.1 L154.5,244.1 L155.5,294.9
		L156.6,235.5 L157.7,297.3 L158.8,222.2 L159.9,300.4 L161.0,298.1 L162.1,230.0 L163.1,285.5 L164.2,226.9
		L165.3,284.0 L166.4,238.6 L167.5,281.6 L168.6,205.0 L169.7,296.5 L170.7,226.1 L171.8,293.4 L172.9,233.2
		L174.0,273.0 L175.1,294.1 L176.2,220.6 L177.3,267.6 L178.3,244.1 L179.4,294.1 L180.5,205.0 L181.6,288.7
		L182.7,208.1 L183.8,291.0 L184.9,190.9 L186.0,282.4 L187.0,285.5 L188.1,215.9 L189.2,270.7 L190.3,207.3
		L191.4,308.2 L192.5,207.3 L193.6,280.9 L194.6,206.6 L195.7,269.1 L196.8,213.6 L197.9,276.2 L199.0,277.7
		L200.1,211.3 L201.2,291.0 L202.2,215.9 L203.3,289.5 L204.4,173.7 L205.5,286.3 L206.6,215.9 L207.7,274.6
		L208.8,188.6 L209.8,261.3 L210.9,207.3 L212.0,273.8 L213.1,264.4 L214.2,207.3 L215.3,260.5 L216.4,187.8
		L217.5,248.8 L218.5,162.8 L219.6,262.1 L220.7,190.1 L221.8,266.8 L222.9,197.2 L224.0,273.8 L225.1,254.3
		L226.1,178.4 L227.2,236.3 L228.3,199.5 L229.4,266.8 L230.5,199.5 L231.6,279.3 L232.7,157.3 L233.7,259.0
		L234.8,155.0 L235.9,252.7 L237.0,188.6 L238.1,262.1 L239.2,273.8 L240.3,180.0 L241.3,244.9 L242.4,172.9
		L243.5,241.0 L244.6,158.1 L245.7,258.2 L246.8,133.8 L247.9,265.2 L249.0,170.6 L250.0,262.1 L251.1,251.1
		L252.2,172.2 L253.3,241.0 L254.4,165.9 L255.5,259.0 L256.6,161.2 L257.6,272.3 L258.7,154.2 L259.8,264.4
		L260.9,170.6 L262.0,259.7 L263.1,254.3 L264.2,169.8 L265.2,248.0 L266.3,188.6 L267.4,262.9 L268.5,155.7
		L269.6,259.0 L270.7,177.6 L271.8,233.2 L272.8,171.4 L273.9,266.8 L275.0,183.1 L276.1,252.7 L277.2,252.7
		L278.3,153.4 L279.4,242.5 L280.5,181.5 L281.5,264.4 L282.6,178.4 L283.7,230.8 L284.8,189.4 L285.9,268.3
		L287.0,163.6 L288.1,254.3 L289.1,237.8 L290.2,146.4 L291.3,224.6 L292.4,159.6 L293.5,235.5 L294.6,132.3
		L295.7,222.2 L296.7,155.7 L297.8,223.8 L298.9,120.5 L300.0,193.3 L301.1,127.6 L302.2,215.2 L303.3,204.2
		L304.3,94.0 L305.4,205.0 L306.5,78.3 L307.6,205.8 L308.7,102.6 L309.8,221.4 L310.9,76.0 L312.0,204.2
		L313.0,107.2 L314.1,177.6 L315.2,190.1 L316.3,83.0 L317.4,218.3 L318.5,54.1 L319.6,190.9 L320.6,69.7
		L321.7,193.3 L322.8,61.9 L323.9,208.9 L325.0,42.3 L326.1,176.8 L327.2,168.2 L328.2,65.8 L329.3,169.0
		L330.4,75.2 L331.5,194.8 L332.6,18.1 L333.7,155.7 L334.8,89.3 L335.8,204.2 L336.9,108.8 L338.0,213.6
		L339.1,86.1 L340.2,199.5 L341.3,219.9 L342.4,104.1 L343.4,212.8 L344.5,129.9 L345.6,217.5 L346.7,115.9
		L347.8,227.7 L348.9,143.2 L350.0,218.3 L351.1,136.2 L352.1,222.2 L353.2,241.8 L354.3,141.7 L355.4,210.5
		L356.5,143.2 L357.6,246.4 L358.7,156.5 L359.7,251.9 L360.8,151.0 L361.9,241.8 L363.0,151.0 L364.1,241.8
		L365.2,187.0 L366.3,238.6 L367.3,273.0 L368.4,177.6 L369.5,256.6 L370.6,176.1 L371.7,248.0 L372.8,159.6
		L373.9,255.8 L374.9,178.4 L376.0,248.8 L377.1,159.6 L378.2,259.7 L379.3,260.5 L380.4,166.7 L381.5,252.7
		L382.6,163.6 L383.6,261.3 L384.7,147.9 L385.8,236.3 L386.9,159.6 L388.0,260.5 L389.1,166.7 L390.2,258.2
		L391.2,241.8 L392.3,142.4 L393.4,239.4 L394.5,165.1 L395.6,237.1 L396.7,137.7 L397.8,247.2 L398.8,161.2
		L399.9,248.0 L401.0,149.5 L402.1,246.4 L403.2,146.4 L404.3,226.9 L405.4,225.3 L406.4,147.9 L407.5,248.0
		L408.6,130.7 L409.7,235.5 L410.8,154.2 L411.9,219.9 L413.0,122.9 L414.1,229.2 L415.1,170.6 L416.2,233.9
		L417.3,223.0 L418.4,144.0 L419.5,238.6 L420.6,169.8 L421.7,244.1 L422.7,142.4 L423.8,259.7 L424.9,162.0
		L426.0,227.7 L427.1,165.9 L428.2,260.5 L429.3,187.8 L430.3,268.3 L431.4,263.7 L432.5,173.7 L433.6,256.6
		L434.7,166.7 L435.8,254.3 L436.9,196.4 L437.9,287.9 L439.0,183.1 L440.1,262.9 L441.2,181.5 L442.3,265.2
		L443.4,247.2 L444.5,193.3 L445.6,266.0 L446.6,161.2 L447.7,262.1 L448.8,172.2 L449.9,253.5 L451.0,169.8
		L452.1,247.2 L453.2,127.6 L454.2,254.3 L455.3,262.1 L456.4,158.1 L457.5,241.0 L458.6,160.4 L459.7,237.8
		L460.8,147.1 L461.8,222.2 L462.9,134.6 L464.0,238.6 L465.1,137.0 L466.2,251.9 L467.3,153.4 L468.4,198.7
		L469.4,222.2 L470.5,144.0 L471.6,219.9 L472.7,102.6 L473.8,241.0 L474.9,108.0 L476.0,198.0 L477.1,116.6
		L478.1,210.5 L479.2,101.8 L480.3,212.8 L481.4,203.4 L482.5,113.5 L483.6,210.5 L484.7,118.2 L485.7,229.2
		L486.8,104.9 L487.9,187.0 L489.0,86.1 L490.1,198.0 L491.2,61.9 L492.3,191.7 L493.3,79.1 L494.4,194.8
		L495.5,162.8 L496.6,66.6 L497.7,189.4 L498.8,55.6 L499.9,184.7 L500.9,57.2 L502.0,208.1 L503.1,62.7
		L504.2,223.8 L505.3,103.3 L506.4,197.2 L507.5,230.0 L508.6,92.4 L509.6,205.8 L510.7,107.2 L511.8,195.6
		L512.9,122.9 L514.0,183.1 L515.1,90.0 L516.2,193.3 L517.2,79.1 L518.3,191.7 L519.4,207.3 L520.5,74.4
		L521.6,216.7 L522.7,104.1 L523.8,193.3 L524.8,72.1 L525.9,179.2 L527.0,92.4 L528.1,226.1 L529.2,158.1
		L530.3,234.7 L531.4,106.5 L532.4,237.8 L533.5,257.4 L534.6,150.3 L535.7,259.7 L536.8,167.5 L537.9,275.4
		L539.0,189.4 L540.1,273.8 L541.1,226.1 L542.2,294.9 L543.3,211.3 L544.4,302.0 L545.5,299.6 L546.6,226.9
		L547.7,316.0 L548.7,244.9 L549.8,299.6 L550.9,238.6 L552.0,296.5 L553.1,226.1 L554.2,322.3 L555.3,272.3
		L556.3,307.4 L557.4,259.0 L558.5,312.1 L559.6,324.6 L560.7,275.4 L561.8,333.3 L562.9,277.7 L563.9,329.3
		L565.0,262.9 L566.1,326.2 L567.2,294.1 L568.3,322.3 L569.4,287.9 L570.5,336.4 L571.6,335.6 L572.6,291.0
		L573.7,326.2 L574.8,302.8 L575.9,334.8 L577.0,294.1 L578.1,337.2 L579.2,301.2 L580.2,342.6 L581.3,334.0
		L582.4,350.5 L583.5,328.6 L584.6,296.5 L585.7,352.8 L586.8,305.9 L587.8,352.0 L588.9,291.8 L590.0,342.6
		L591.1,317.6 L592.2,339.5 L593.3,316.0 L594.4,355.9 L595.4,307.4 L596.5,348.9 L597.6,349.7 L598.7,305.9
		L599.8,346.5 L600.9,320.0 L602.0,352.0 L603.1,310.6 L604.1,355.1 L605.2,340.3 L606.3,366.9 L607.4,321.5
		L608.5,358.3 L609.6,342.6 L610.7,326.2 L611.7,362.2 L612.8,334.8 L613.9,352.8  '/></g>
	</g>
	<g id="gnuplot_plot_2" ><title>W = 6</title>
<g fill="none" color="black" stroke="currentColor" stroke-width="1.00" stroke-linecap="butt" stroke-linejoin="miter">
	<g transform="translate(547.9,58.0)" stroke="none" fill="black" font-family="Arial" font-size="12.00"  text-anchor="end">
		<text><tspan font-family="Arial" >W = 6</tspan></text>
	</g>
</g>
<g fill="none" color="black" stroke="currentColor" stroke-width="1.00" stroke-linecap="butt" stroke-linejoin="miter">
	<path stroke='rgb(  0, 158, 115)'  d='M556.2,54.1 L598.4,54.1 M71.9,422.4 L73.0,422.4 L74.1,422.4 L75.2,422.4 L76.2,422.4 L77.3,422.4
		L78.4,422.4 L79.5,422.4 L80.6,422.4 L81.7,422.4 L82.8,422.4 L83.8,422.4 L84.9,421.9 L86.0,422.2
		L87.1,421.7 L88.2,422.4 L89.3,422.4 L90.4,421.2 L91.5,421.7 L92.5,420.7 L93.6,420.9 L94.7,420.7
		L95.8,421.2 L96.9,420.7 L98.0,418.7 L99.1,419.0 L100.1,417.7 L101.2,419.2 L102.3,416.0 L103.4,417.5
		L104.5,414.3 L105.6,416.2 L106.7,411.3 L107.7,414.0 L108.8,406.1 L109.9,409.1 L111.0,410.6 L112.1,398.8
		L113.2,410.1 L114.3,396.8 L115.3,401.0 L116.4,392.6 L117.5,402.9 L118.6,388.9 L119.7,394.6 L120.8,376.8
		L121.9,393.8 L123.0,390.4 L124.0,376.1 L125.1,389.2 L126.2,370.4 L127.3,387.2 L128.4,363.3 L129.5,382.3
		L130.6,356.2 L131.6,370.4 L132.7,351.7 L133.8,373.4 L134.9,369.0 L136.0,339.9 L137.1,371.4 L138.2,333.5
		L139.2,366.0 L140.3,318.2 L141.4,365.8 L142.5,335.2 L143.6,360.6 L144.7,334.5 L145.8,359.4 L146.8,320.7
		L147.9,350.3 L149.0,354.4 L150.1,320.2 L151.2,343.6 L152.3,325.6 L153.4,350.5 L154.5,315.8 L155.5,345.3
		L156.6,313.6 L157.7,353.5 L158.8,306.4 L159.9,342.4 L161.0,347.5 L162.1,308.6 L163.1,342.9 L164.2,305.4
		L165.3,340.7 L166.4,313.3 L167.5,341.4 L168.6,297.6 L169.7,350.0 L170.7,301.3 L171.8,340.4 L172.9,306.4
		L174.0,341.6 L175.1,352.2 L176.2,301.3 L177.3,338.9 L178.3,311.1 L179.4,338.4 L180.5,299.0 L181.6,341.1
		L182.7,301.0 L183.8,337.7 L184.9,291.4 L186.0,334.5 L187.0,326.9 L188.1,282.1 L189.2,330.3 L190.3,269.5
		L191.4,328.3 L192.5,272.7 L193.6,315.8 L194.6,264.3 L195.7,313.8 L196.8,254.7 L197.9,311.4 L199.0,313.1
		L200.1,252.0 L201.2,310.4 L202.2,243.4 L203.3,312.3 L204.4,230.1 L205.5,305.7 L206.6,249.6 L207.7,306.2
		L208.8,239.0 L209.8,290.2 L210.9,238.0 L212.0,298.1 L213.1,281.8 L214.2,227.4 L215.3,289.2 L216.4,220.7
		L217.5,284.3 L218.5,208.7 L219.6,284.3 L220.7,222.2 L221.8,280.3 L222.9,206.2 L224.0,279.3 L225.1,281.1
		L226.1,203.3 L227.2,257.7 L228.3,200.6 L229.4,271.5 L230.5,196.4 L231.6,279.8 L232.7,175.7 L233.7,253.7
		L234.8,175.9 L235.9,259.6 L237.0,170.0 L238.1,244.9 L239.2,244.9 L240.3,148.1 L241.3,231.6 L242.4,137.3
		L243.5,210.9 L244.6,117.8 L245.7,210.9 L246.8,97.1 L247.9,216.6 L249.0,93.0 L250.0,199.6 L251.1,205.2
		L252.2,104.0 L253.3,208.4 L254.4,99.1 L255.5,204.7 L256.6,97.1 L257.6,214.3 L258.7,86.6 L259.8,200.1
		L260.9,92.7 L262.0,209.7 L263.1,202.3 L264.2,86.6 L265.2,195.4 L266.3,95.2 L267.4,214.1 L268.5,80.6
		L269.6,190.7 L270.7,77.9 L271.8,202.0 L272.8,82.9 L273.9,207.2 L275.0,89.3 L276.1,187.7 L277.2,186.3
		L278.3,86.6 L279.4,192.2 L280.5,106.0 L281.5,207.9 L282.6,81.6 L283.7,182.8 L284.8,87.0 L285.9,201.5
		L287.0,78.7 L288.1,196.1 L289.1,197.8 L290.2,58.5 L291.3,194.2 L292.4,84.6 L293.5,166.8 L294.6,71.5
		L295.7,169.8 L296.7,57.2 L297.8,180.6 L298.9,63.2 L300.0,174.9 L301.1,74.0 L302.2,187.0 L303.3,198.8
		L304.3,81.6 L305.4,198.6 L306.5,89.5 L307.6,205.0 L308.7,102.3 L309.8,199.8 L310.9,107.2 L312.0,206.0
		L313.0,106.2 L314.1,222.0 L315.2,210.6 L316.3,116.6 L317.4,226.4 L318.5,121.3 L319.6,223.2 L320.6,109.0
		L321.7,232.3 L322.8,123.5 L323.9,218.8 L325.0,124.5 L326.1,206.2 L327.2,209.9 L328.2,87.8 L329.3,204.2
		L330.4,88.5 L331.5,200.3 L332.6,103.8 L333.7,203.3 L334.8,91.7 L335.8,205.7 L336.9,77.4 L338.0,180.9
		L339.1,67.8 L340.2,186.0 L341.3,183.6 L342.4,42.7 L343.4,191.4 L344.5,47.2 L345.6,181.6 L346.7,45.9
		L347.8,148.4 L348.9,18.1 L350.0,174.7 L351.1,26.5 L352.1,161.4 L353.2,156.5 L354.3,29.9 L355.4,161.9
		L356.5,33.6 L357.6,152.5 L358.7,34.1 L359.7,161.9 L360.8,21.8 L361.9,168.1 L363.0,44.9 L364.1,159.4
		L365.2,33.1 L366.3,157.5 L367.3,179.4 L368.4,58.5 L369.5,175.2 L370.6,32.9 L371.7,165.8 L372.8,50.1
		L373.9,185.0 L374.9,60.2 L376.0,192.2 L377.1,66.4 L378.2,198.8 L379.3,181.8 L380.4,82.1 L381.5,201.8
		L382.6,58.0 L383.6,189.2 L384.7,71.5 L385.8,185.3 L386.9,69.1 L388.0,192.2 L389.1,89.3 L390.2,188.0
		L391.2,179.1 L392.3,89.5 L393.4,181.8 L394.5,84.1 L395.6,198.3 L396.7,98.6 L397.8,210.6 L398.8,111.4
		L399.9,213.8 L401.0,116.8 L402.1,217.3 L403.2,134.1 L404.3,233.8 L405.4,234.5 L406.4,148.4 L407.5,249.6
		L408.6,172.2 L409.7,257.4 L410.8,178.4 L411.9,258.7 L413.0,192.4 L414.1,263.6 L415.1,197.4 L416.2,279.6
		L417.3,276.9 L418.4,206.2 L419.5,265.6 L420.6,223.7 L421.7,287.0 L422.7,222.5 L423.8,286.7 L424.9,224.2
		L426.0,305.0 L427.1,241.9 L428.2,304.0 L429.3,249.6 L430.3,311.4 L431.4,308.6 L432.5,246.6 L433.6,308.4
		L434.7,249.8 L435.8,316.0 L436.9,261.1 L437.9,317.3 L439.0,255.2 L440.1,324.9 L441.2,285.5 L442.3,331.8
		L443.4,339.2 L444.5,299.8 L445.6,343.1 L446.6,293.9 L447.7,355.2 L448.8,321.4 L449.9,356.7 L451.0,324.4
		L452.1,364.0 L453.2,340.9 L454.2,371.2 L455.3,380.5 L456.4,362.6 L457.5,379.3 L458.6,361.6 L459.7,386.2
		L460.8,366.0 L461.8,386.9 L462.9,364.8 L464.0,386.0 L465.1,368.5 L466.2,389.7 L467.3,369.2 L468.4,384.5
		L469.4,386.5 L470.5,376.6 L471.6,389.9 L472.7,367.0 L473.8,389.2 L474.9,366.3 L476.0,385.5 L477.1,373.4
		L478.1,391.9 L479.2,372.9 L480.3,390.9 L481.4,387.4 L482.5,379.6 L483.6,389.7 L484.7,373.2 L485.7,388.7
		L486.8,380.0 L487.9,393.3 L489.0,383.3 L490.1,397.8 L491.2,382.0 L492.3,393.8 L493.3,386.5 L494.4,398.8
		L495.5,399.7 L496.6,386.2 L497.7,403.9 L498.8,388.9 L499.9,399.0 L500.9,386.5 L502.0,400.7 L503.1,389.4
		L504.2,402.0 L505.3,393.6 L506.4,406.9 L507.5,407.6 L508.6,400.2 L509.6,409.6 L510.7,400.2 L511.8,407.1
		L512.9,401.2 L514.0,405.9 L515.1,407.9 L516.2,410.1 L517.2,405.2 L518.3,409.1 L519.4,409.4 L520.5,403.7
		L521.6,412.3 L522.7,398.8 L523.8,412.1 L524.8,407.9 L525.9,414.3 L527.0,409.1 L528.1,412.8 L529.2,412.8
		L530.3,415.0 L531.4,411.8 L532.4,417.2 L533.5,414.0 L534.6,415.0 L535.7,417.7 L536.8,414.8 L537.9,418.0
		L539.0,416.5 L540.1,418.5 L541.1,419.2 L542.2,419.4 L543.3,419.0 L544.4,420.7 L545.5,420.4 L546.6,420.9
		L547.7,421.4 L548.7,420.9 L549.8,421.9 L550.9,421.2 L552.0,421.4 L553.1,421.7 L554.2,421.7 L555.3,421.9
		L556.3,422.4 L557.4,422.4 L558.5,422.4 L559.6,422.4 L560.7,422.2 L561.8,422.4 L562.9,422.4 L563.9,422.4
		L565.0,422.4 L566.1,422.4 L567.2,422.4 L568.3,422.4 L569.4,422.4 L570.5,422.4 L571.6,422.4 L572.6,422.4
		L573.7,422.4 L574.8,422.4 L575.9,422.4 L577.0,422.4 L578.1,422.4 L579.2,422.4 L580.2,422.4 L581.3,422.4
		L582.4,422.4 L583.5,422.4 L584.6,422.4 L585.7,422.4 L586.8,422.4 L587.8,422.4 L588.9,422.4 L590.0,422.4
		L591.1,422.4 L592.2,422.4 L593.3,422.4 L594.4,422.4 L595.4,422.4 L596.5,422.4 L597.6,422.4 L598.7,422.4
		L599.8,422.4 L600.9,422.4 L602.0,422.4 L603.1,422.4 L604.1,422.4 L605.2,422.4 L606.3,422.4 L607.4,422.4
		L608.5,422.4 L609.6,422.4 L610.7,422.4 L611.7,422.4 L612.8,422.4 L613.9,422.4  '/></g>
	</g>
	<g id="gnuplot_plot_3" ><title>W = 8</title>
<g fill="none" color="black" stroke="currentColor" stroke-width="1.00" stroke-linecap="butt" stroke-linejoin="miter">
	<g transform="translate(547.9,76.0)" stroke="none" fill="black" font-family="Arial" font-size="12.00"  text-anchor="end">
		<text><tspan font-family="Arial" >W = 8</tspan></text>
	</g>
</g>
<g fill="none" color="black" stroke="currentColor" stroke-width="1.00" stroke-linecap="butt" stroke-linejoin="miter">
	<path stroke='rgb( 86, 180, 233)'  d='M556.2,72.1 L598.4,72.1 M71.9,422.4 L73.0,422.4 L74.1,422.4 L75.2,422.4 L76.2,422.3 L77.3,422.1
		L78.4,421.8 L79.5,421.9 L80.6,421.1 L81.7,421.0 L82.8,420.5 L83.8,420.7 L84.9,419.3 L86.0,417.3
		L87.1,418.2 L88.2,415.2 L89.3,416.4 L90.4,409.8 L91.5,413.0 L92.5,403.9 L93.6,408.5 L94.7,398.4
		L95.8,404.6 L96.9,401.5 L98.0,385.9 L99.1,394.2 L100.1,373.4 L101.2,385.1 L102.3,357.5 L103.4,372.1
		L104.5,343.2 L105.6,360.0 L106.7,317.3 L107.7,346.4 L108.8,296.7 L109.9,327.2 L111.0,323.2 L112.1,257.1
		L113.2,299.1 L114.3,226.8 L115.3,279.7 L116.4,181.7 L117.5,253.0 L118.6,156.8 L119.7,231.7 L120.8,119.9
		L121.9,208.5 L123.0,198.9 L124.0,79.8 L125.1,178.4 L126.2,44.0 L127.3,172.2 L128.4,20.5 L129.5,156.7
		L130.6,21.4 L131.6,154.6 L132.7,18.1 L133.8,147.7 L134.9,158.5 L136.0,32.2 L137.1,162.9 L138.2,52.8
		L139.2,182.8 L140.3,76.2 L141.4,198.1 L142.5,100.1 L143.6,221.9 L144.7,136.0 L145.8,240.8 L146.8,176.0
		L147.9,264.2 L149.0,279.2 L150.1,218.3 L151.2,295.1 L152.3,248.8 L153.4,318.0 L154.5,276.8 L155.5,334.0
		L156.6,299.1 L157.7,349.9 L158.8,323.7 L159.9,362.6 L161.0,369.1 L162.1,349.6 L163.1,378.7 L164.2,364.1
		L165.3,388.5 L166.4,376.8 L167.5,398.5 L168.6,388.8 L169.7,403.2 L170.7,398.7 L171.8,409.3 L172.9,406.4
		L174.0,412.9 L175.1,414.9 L176.2,414.8 L177.3,417.3 L178.3,416.0 L179.4,419.8 L180.5,419.7 L181.6,421.1
		L182.7,421.0 L183.8,422.0 L184.9,421.9 L186.0,422.3 L187.0,422.4 L188.1,422.4 L189.2,422.4 L190.3,422.4
		L191.4,422.4 L192.5,422.4 L193.6,422.4 L194.6,422.4 L195.7,422.4 L196.8,422.4 L197.9,422.4 L199.0,422.4
		L200.1,422.4 L201.2,422.4 L202.2,422.4 L203.3,422.4 L204.4,422.4 L205.5,422.4 L206.6,422.4 L207.7,422.4
		L208.8,422.4 L209.8,422.4 L210.9,422.4 L212.0,422.4 L213.1,422.4 L214.2,422.4 L215.3,422.4 L216.4,422.4
		L217.5,422.4 L218.5,422.4 L219.6,422.4 L220.7,422.4 L221.8,422.4 L222.9,422.4 L224.0,422.4 L225.1,422.4
		L226.1,422.4 L227.2,422.4 L228.3,422.4 L229.4,422.4 L230.5,422.4 L231.6,422.4 L232.7,422.4 L233.7,422.4
		L234.8,422.4 L235.9,422.4 L237.0,422.4 L238.1,422.4 L239.2,422.4 L240.3,422.4 L241.3,422.4 L242.4,422.4
		L243.5,422.4 L244.6,422.4 L245.7,422.4 L246.8,422.4 L247.9,422.4 L249.0,422.4 L250.0,422.4 L251.1,422.4
		L252.2,422.4 L253.3,422.4 L254.4,422.4 L255.5,422.4 L256.6,422.4 L257.6,422.4 L258.7,422.4 L259.8,422.4
		L260.9,422.4 L262.0,422.4 L263.1,422.4 L264.2,422.4 L265.2,422.4 L266.3,422.4 L267.4,422.4 L268.5,422.4
		L269.6,422.4 L270.7,422.4 L271.8,422.4 L272.8,422.4 L273.9,422.4 L275.0,422.4 L276.1,422.4 L277.2,422.4
		L278.3,422.4 L279.4,422.4 L280.5,422.4 L281.5,422.4 L282.6,422.4 L283.7,422.4 L284.8,422.4 L285.9,422.4
		L287.0,422.4 L288.1,422.4 L289.1,422.4 L290.2,422.4 L291.3,422.4 L292.4,422.4 L293.5,422.4 L294.6,422.4
		L295.7,422.4 L296.7,422.4 L297.8,422.4 L298.9,422.4 L300.0,422.4 L301.1,422.4 L302.2,422.4 L303.3,422.4
		L304.3,422.4 L305.4,422.4 L306.5,422.4 L307.6,422.4 L308.7,422.4 L309.8,422.4 L310.9,422.4 L312.0,422.4
		L313.0,422.4 L314.1,422.4 L315.2,422.4 L316.3,422.4 L317.4,422.4 L318.5,422.4 L319.6,422.4 L320.6,422.4
		L321.7,422.4 L322.8,422.4 L323.9,422.4 L325.0,422.4 L326.1,422.4 L327.2,422.4 L328.2,422.4 L329.3,422.4
		L330.4,422.4 L331.5,422.4 L332.6,422.4 L333.7,422.4 L334.8,422.4 L335.8,422.4 L336.9,422.4 L338.0,422.4
		L339.1,422.4 L340.2,422.4 L341.3,422.4 L342.4,422.4 L343.4,422.4 L344.5,422.4 L345.6,422.4 L346.7,422.4
		L347.8,422.4 L348.9,422.4 L350.0,422.4 L351.1,422.4 L352.1,422.4 L353.2,422.4 L354.3,422.4 L355.4,422.4
		L356.5,422.4 L357.6,422.4 L358.7,422.4 L359.7,422.4 L360.8,422.4 L361.9,422.4 L363.0,422.4 L364.1,422.4
		L365.2,422.4 L366.3,422.4 L367.3,422.4 L368.4,422.4 L369.5,422.4 L370.6,422.4 L371.7,422.4 L372.8,422.4
		L373.9,422.4 L374.9,422.4 L376.0,422.4 L377.1,422.4 L378.2,422.4 L379.3,422.4 L380.4,422.4 L381.5,422.4
		L382.6,422.4 L383.6,422.4 L384.7,422.4 L385.8,422.4 L386.9,422.4 L388.0,422.4 L389.1,422.4 L390.2,422.4
		L391.2,422.4 L392.3,422.4 L393.4,422.4 L394.5,422.4 L395.6,422.4 L396.7,422.4 L397.8,422.4 L398.8,422.4
		L399.9,422.4 L401.0,422.4 L402.1,422.4 L403.2,422.4 L404.3,422.4 L405.4,422.4 L406.4,422.4 L407.5,422.4
		L408.6,422.4 L409.7,422.4 L410.8,422.4 L411.9,422.4 L413.0,422.4 L414.1,422.4 L415.1,422.4 L416.2,422.4
		L417.3,422.4 L418.4,422.4 L419.5,422.4 L420.6,422.4 L421.7,422.4 L422.7,422.4 L423.8,422.4 L424.9,422.4
		L426.0,422.4 L427.1,422.4 L428.2,422.4 L429.3,422.4 L430.3,422.4 L431.4,422.4 L432.5,422.4 L433.6,422.4
		L434.7,422.4 L435.8,422.4 L436.9,422.4 L437.9,422.4 L439.0,422.4 L440.1,422.4 L441.2,422.4 L442.3,422.4
		L443.4,422.4 L444.5,422.4 L445.6,422.4 L446.6,422.4 L447.7,422.4 L448.8,422.4 L449.9,422.4 L451.0,422.4
		L452.1,422.4 L453.2,422.4 L454.2,422.4 L455.3,422.4 L456.4,422.4 L457.5,422.4 L458.6,422.4 L459.7,422.4
		L460.8,422.4 L461.8,422.4 L462.9,422.4 L464.0,422.4 L465.1,422.4 L466.2,422.4 L467.3,422.4 L468.4,422.4
		L469.4,422.4 L470.5,422.4 L471.6,422.4 L472.7,422.4 L473.8,422.4 L474.9,422.4 L476.0,422.4 L477.1,422.4
		L478.1,422.4 L479.2,422.4 L480.3,422.4 L481.4,422.4 L482.5,422.4 L483.6,422.4 L484.7,422.4 L485.7,422.4
		L486.8,422.4 L487.9,422.4 L489.0,422.4 L490.1,422.4 L491.2,422.4 L492.3,422.4 L493.3,422.4 L494.4,422.4
		L495.5,422.4 L496.6,422.4 L497.7,422.4 L498.8,422.4 L499.9,422.4 L500.9,422.4 L502.0,422.4 L503.1,422.4
		L504.2,422.4 L505.3,422.4 L506.4,422.4 L507.5,422.4 L508.6,422.4 L509.6,422.4 L510.7,422.4 L511.8,422.4
		L512.9,422.4 L514.0,422.4 L515.1,422.4 L516.2,422.4 L517.2,422.4 L518.3,422.4 L519.4,422.4 L520.5,422.4
		L521.6,422.4 L522.7,422.4 L523.8,422.4 L524.8,422.4 L525.9,422.4 L527.0,422.4 L528.1,422.4 L529.2,422.4
		L530.3,422.4 L531.4,422.4 L532.4,422.4 L533.5,422.4 L534.6,422.4 L535.7,422.4 L536.8,422.4 L537.9,422.4
		L539.0,422.4 L540.1,422.4 L541.1,422.4 L542.2,422.4 L543.3,422.4 L544.4,422.4 L545.5,422.4 L546.6,422.4
		L547.7,422.4 L548.7,422.4 L549.8,422.4 L550.9,422.4 L552.0,422.4 L553.1,422.4 L554.2,422.4 L555.3,422.4
		L556.3,422.4 L557.4,422.4 L558.5,422.4 L559.6,422.4 L560.7,422.4 L561.8,422.4 L562.9,422.4 L563.9,422.4
		L565.0,422.4 L566.1,422.4 L567.2,422.4 L568.3,422.4 L569.4,422.4 L570.5,422.4 L571.6,422.4 L572.6,422.4
		L573.7,422.4 L574.8,422.4 L575.9,422.4 L577.0,422.4 L578.1,422.4 L579.2,422.4 L580.2,422.4 L581.3,422.4
		L582.4,422.4 L583.5,422.4 L584.6,422.4 L585.7,422.4 L586.8,422.4 L587.8,422.4 L588.9,422.4 L590.0,422.4
		L591.1,422.4 L592.2,422.4 L593.3,422.4 L594.4,422.4 L595.4,422.4 L596.5,422.4 L597.6,422.4 L598.7,422.4
		L599.8,422.4 L600.9,422.4 L602.0,422.4 L603.1,422.4 L604.1,422.4 L605.2,422.4 L606.3,422.4 L607.4,422.4
		L608.5,422.4 L609.6,422.4 L610.7,422.4 L611.7,422.4 L612.8,422.4 L613.9,422.4  '/></g>
	</g>
	<g id="gnuplot_plot_4" ><title>W = 10</title>
<g fill="none" color="black" stroke="currentColor" stroke-width="1.00" stroke-linecap="butt" stroke-linejoin="miter">
	<g transform="translate(547.9,94.0)" stroke="none" fill="black" font-family="Arial" font-size="12.00"  text-anchor="end">
		<text><tspan font-family="Arial" >W = 10</tspan></text>
	</g>
</g>
<g fill="none" color="black" stroke="currentColor" stroke-width="1.00" stroke-linecap="butt" stroke-linejoin="miter">
	<path stroke='rgb(230, 159,   0)'  d='M556.2,90.1 L598.4,90.1 M71.9,422.3 L73.0,422.3 L74.1,421.3 L75.2,419.7 L76.2,411.0 L77.3,404.0
		L78.4,363.5 L79.5,352.4 L80.6,254.2 L81.7,260.8 L82.8,106.0 L83.8,174.4 L84.9,155.9 L86.0,18.1
		L87.1,174.0 L88.2,108.6 L89.3,263.4 L90.4,258.6 L91.5,355.4 L92.5,367.1 L93.6,405.8 L94.7,412.5
		L95.8,420.6 L96.9,421.5 L98.0,422.2 L99.1,422.4 L100.1,422.4 L101.2,422.4 L102.3,422.4 L103.4,422.4
		L104.5,422.4 L105.6,422.4 L106.7,422.4 L107.7,422.4 L108.8,422.4 L109.9,422.4 L111.0,422.4 L112.1,422.4
		L113.2,422.4 L114.3,422.4 L115.3,422.4 L116.4,422.4 L117.5,422.4 L118.6,422.4 L119.7,422.4 L120.8,422.4
		L121.9,422.4 L123.0,422.4 L124.0,422.4 L125.1,422.4 L126.2,422.4 L127.3,422.4 L128.4,422.4 L129.5,422.4
		L130.6,422.4 L131.6,422.4 L132.7,422.4 L133.8,422.4 L134.9,422.4 L136.0,422.4 L137.1,422.4 L138.2,422.4
		L139.2,422.4 L140.3,422.4 L141.4,422.4 L142.5,422.4 L143.6,422.4 L144.7,422.4 L145.8,422.4 L146.8,422.4
		L147.9,422.4 L149.0,422.4 L150.1,422.4 L151.2,422.4 L152.3,422.4 L153.4,422.4 L154.5,422.4 L155.5,422.4
		L156.6,422.4 L157.7,422.4 L158.8,422.4 L159.9,422.4 L161.0,422.4 L162.1,422.4 L163.1,422.4 L164.2,422.4
		L165.3,422.4 L166.4,422.4 L167.5,422.4 L168.6,422.4 L169.7,422.4 L170.7,422.4 L171.8,422.4 L172.9,422.4
		L174.0,422.4 L175.1,422.4 L176.2,422.4 L177.3,422.4 L178.3,422.4 L179.4,422.4 L180.5,422.4 L181.6,422.4
		L182.7,422.4 L183.8,422.4 L184.9,422.4 L186.0,422.4 L187.0,422.4 L188.1,422.4 L189.2,422.4 L190.3,422.4
		L191.4,422.4 L192.5,422.4 L193.6,422.4 L194.6,422.4 L195.7,422.4 L196.8,422.4 L197.9,422.4 L199.0,422.4
		L200.1,422.4 L201.2,422.4 L202.2,422.4 L203.3,422.4 L204.4,422.4 L205.5,422.4 L206.6,422.4 L207.7,422.4
		L208.8,422.4 L209.8,422.4 L210.9,422.4 L212.0,422.4 L213.1,422.4 L214.2,422.4 L215.3,422.4 L216.4,422.4
		L217.5,422.4 L218.5,422.4 L219.6,422.4 L220.7,422.4 L221.8,422.4 L222.9,422.4 L224.0,422.4 L225.1,422.4
		L226.1,422.4 L227.2,422.4 L228.3,422.4 L229.4,422.4 L230.5,422.4 L231.6,422.4 L232.7,422.4 L233.7,422.4
		L234.8,422.4 L235.9,422.4 L237.0,422.4 L238.1,422.4 L239.2,422.4 L240.3,422.4 L241.3,422.4 L242.4,422.4
		L243.5,422.4 L244.6,422.4 L245.7,422.4 L246.8,422.4 L247.9,422.4 L249.0,422.4 L250.0,422.4 L251.1,422.4
		L252.2,422.4 L253.3,422.4 L254.4,422.4 L255.5,422.4 L256.6,422.4 L257.6,422.4 L258.7,422.4 L259.8,422.4
		L260.9,422.4 L262.0,422.4 L263.1,422.4 L264.2,422.4 L265.2,422.4 L266.3,422.4 L267.4,422.4 L268.5,422.4
		L269.6,422.4 L270.7,422.4 L271.8,422.4 L272.8,422.4 L273.9,422.4 L275.0,422.4 L276.1,422.4 L277.2,422.4
		L278.3,422.4 L279.4,422.4 L280.5,422.4 L281.5,422.4 L282.6,422.4 L283.7,422.4 L284.8,422.4 L285.9,422.4
		L287.0,422.4 L288.1,422.4 L289.1,422.4 L290.2,422.4 L291.3,422.4 L292.4,422.4 L293.5,422.4 L294.6,422.4
		L295.7,422.4 L296.7,422.4 L297.8,422.4 L298.9,422.4 L300.0,422.4 L301.1,422.4 L302.2,422.4 L303.3,422.4
		L304.3,422.4 L305.4,422.4 L306.5,422.4 L307.6,422.4 L308.7,422.4 L309.8,422.4 L310.9,422.4 L312.0,422.4
		L313.0,422.4 L314.1,422.4 L315.2,422.4 L316.3,422.4 L317.4,422.4 L318.5,422.4 L319.6,422.4 L320.6,422.4
		L321.7,422.4 L322.8,422.4 L323.9,422.4 L325.0,422.4 L326.1,422.4 L327.2,422.4 L328.2,422.4 L329.3,422.4
		L330.4,422.4 L331.5,422.4 L332.6,422.4 L333.7,422.4 L334.8,422.4 L335.8,422.4 L336.9,422.4 L338.0,422.4
		L339.1,422.4 L340.2,422.4 L341.3,422.4 L342.4,422.4 L343.4,422.4 L344.5,422.4 L345.6,422.4 L346.7,422.4
		L347.8,422.4 L348.9,422.4 L350.0,422.4 L351.1,422.4 L352.1,422.4 L353.2,422.4 L354.3,422.4 L355.4,422.4
		L356.5,422.4 L357.6,422.4 L358.7,422.4 L359.7,422.4 L360.8,422.4 L361.9,422.4 L363.0,422.4 L364.1,422.4
		L365.2,422.4 L366.3,422.4 L367.3,422.4 L368.4,422.4 L369.5,422.4 L370.6,422.4 L371.7,422.4 L372.8,422.4
		L373.9,422.4 L374.9,422.4 L376.0,422.4 L377.1,422.4 L378.2,422.4 L379.3,422.4 L380.4,422.4 L381.5,422.4
		L382.6,422.4 L383.6,422.4 L384.7,422.4 L385.8,422.4 L386.9,422.4 L388.0,422.4 L389.1,422.4 L390.2,422.4
		L391.2,422.4 L392.3,422.4 L393.4,422.4 L394.5,422.4 L395.6,422.4 L396.7,422.4 L397.8,422.4 L398.8,422.4
		L399.9,422.4 L401.0,422.4 L402.1,422.4 L403.2,422.4 L404.3,422.4 L405.4,422.4 L406.4,422.4 L407.5,422.4
		L408.6,422.4 L409.7,422.4 L410.8,422.4 L411.9,422.4 L413.0,422.4 L414.1,422.4 L415.1,422.4 L416.2,422.4
		L417.3,422.4 L418.4,422.4 L419.5,422.4 L420.6,422.4 L421.7,422.4 L422.7,422.4 L423.8,422.4 L424.9,422.4
		L426.0,422.4 L427.1,422.4 L428.2,422.4 L429.3,422.4 L430.3,422.4 L431.4,422.4 L432.5,422.4 L433.6,422.4
		L434.7,422.4 L435.8,422.4 L436.9,422.4 L437.9,422.4 L439.0,422.4 L440.1,422.4 L441.2,422.4 L442.3,422.4
		L443.4,422.4 L444.5,422.4 L445.6,422.4 L446.6,422.4 L447.7,422.4 L448.8,422.4 L449.9,422.4 L451.0,422.4
		L452.1,422.4 L453.2,422.4 L454.2,422.4 L455.3,422.4 L456.4,422.4 L457.5,422.4 L458.6,422.4 L459.7,422.4
		L460.8,422.4 L461.8,422.4 L462.9,422.4 L464.0,422.4 L465.1,422.4 L466.2,422.4 L467.3,422.4 L468.4,422.4
		L469.4,422.4 L470.5,422.4 L471.6,422.4 L472.7,422.4 L473.8,422.4 L474.9,422.4 L476.0,422.4 L477.1,422.4
		L478.1,422.4 L479.2,422.4 L480.3,422.4 L481.4,422.4 L482.5,422.4 L483.6,422.4 L484.7,422.4 L485.7,422.4
		L486.8,422.4 L487.9,422.4 L489.0,422.4 L490.1,422.4 L491.2,422.4 L492.3,422.4 L493.3,422.4 L494.4,422.4
		L495.5,422.4 L496.6,422.4 L497.7,422.4 L498.8,422.4 L499.9,422.4 L500.9,422.4 L502.0,422.4 L503.1,422.4
		L504.2,422.4 L505.3,422.4 L506.4,422.4 L507.5,422.4 L508.6,422.4 L509.6,422.4 L510.7,422.4 L511.8,422.4
		L512.9,422.4 L514.0,422.4 L515.1,422.4 L516.2,422.4 L517.2,422.4 L518.3,422.4 L519.4,422.4 L520.5,422.4
		L521.6,422.4 L522.7,422.4 L523.8,422.4 L524.8,422.4 L525.9,422.4 L527.0,422.4 L528.1,422.4 L529.2,422.4
		L530.3,422.4 L531.4,422.4 L532.4,422.4 L533.5,422.4 L534.6,422.4 L535.7,422.4 L536.8,422.4 L537.9,422.4
		L539.0,422.4 L540.1,422.4 L541.1,422.4 L542.2,422.4 L543.3,422.4 L544.4,422.4 L545.5,422.4 L546.6,422.4
		L547.7,422.4 L548.7,422.4 L549.8,422.4 L550.9,422.4 L552.0,422.4 L553.1,422.4 L554.2,422.4 L555.3,422.4
		L556.3,422.4 L557.4,422.4 L558.5,422.4 L559.6,422.4 L560.7,422.4 L561.8,422.4 L562.9,422.4 L563.9,422.4
		L565.0,422.4 L566.1,422.4 L567.2,422.4 L568.3,422.4 L569.4,422.4 L570.5,422.4 L571.6,422.4 L572.6,422.4
		L573.7,422.4 L574.8,422.4 L575.9,422.4 L577.0,422.4 L578.1,422.4 L579.2,422.4 L580.2,422.4 L581.3,422.4
		L582.4,422.4 L583.5,422.4 L584.6,422.4 L585.7,422.4 L586.8,422.4 L587.8,422.4 L588.9,422.4 L590.0,422.4
		L591.1,422.4 L592.2,422.4 L593.3,422.4 L594.4,422.4 L595.4,422.4 L596.5,422.4 L597.6,422.4 L598.7,422.4
		L599.8,422.4 L600.9,422.4 L602.0,422.4 L603.1,422.4 L604.1,422.4 L605.2,422.4 L606.3,422.4 L607.4,422.4
		L608.5,422.4 L609.6,422.4 L610.7,422.4 L611.7,422.4 L612.8,422.4 L613.9,422.4  '/></g>
	</g>
	<g id="gnuplot_plot_5" ><title>W = 12</title>
<g fill="none" color="black" stroke="currentColor" stroke-width="1.00" stroke-linecap="butt" stroke-linejoin="miter">
	<g transform="translate(547.9,112.0)" stroke="none" fill="black" font-family="Arial" font-size="12.00"  text-anchor="end">
		<text><tspan font-family="Arial" >W = 12</tspan></text>
	</g>
</g>
<g fill="none" color="black" stroke="currentColor" stroke-width="1.00" stroke-linecap="butt" stroke-linejoin="miter">
	<path stroke='rgb(240, 228,  66)'  d='M556.2,108.1 L598.4,108.1 M71.9,218.7 L73.0,152.1 L74.1,18.1 L75.2,152.6 L76.2,19.5 L77.3,152.2
		L78.4,101.3 L79.5,405.7 L80.6,422.4 L81.7,422.4 L82.8,422.4 L83.8,422.4 L84.9,422.4 L86.0,422.4
		L87.1,422.4 L88.2,422.4 L89.3,422.4 L90.4,422.4 L91.5,422.4 L92.5,422.4 L93.6,422.4 L94.7,422.4
		L95.8,422.4 L96.9,422.4 L98.0,422.4 L99.1,422.4 L100.1,422.4 L101.2,422.4 L102.3,422.4 L103.4,422.4
		L104.5,422.4 L105.6,422.4 L106.7,422.4 L107.7,422.4 L108.8,422.4 L109.9,422.4 L111.0,422.4 L112.1,422.4
		L113.2,422.4 L114.3,422.4 L115.3,422.4 L116.4,422.4 L117.5,422.4 L118.6,422.4 L119.7,422.4 L120.8,422.4
		L121.9,422.4 L123.0,422.4 L124.0,422.4 L125.1,422.4 L126.2,422.4 L127.3,422.4 L128.4,422.4 L129.5,422.4
		L130.6,422.4 L131.6,422.4 L132.7,422.4 L133.8,422.4 L134.9,422.4 L136.0,422.4 L137.1,422.4 L138.2,422.4
		L139.2,422.4 L140.3,422.4 L141.4,422.4 L142.5,422.4 L143.6,422.4 L144.7,422.4 L145.8,422.4 L146.8,422.4
		L147.9,422.4 L149.0,422.4 L150.1,422.4 L151.2,422.4 L152.3,422.4 L153.4,422.4 L154.5,422.4 L155.5,422.4
		L156.6,422.4 L157.7,422.4 L158.8,422.4 L159.9,422.4 L161.0,422.4 L162.1,422.4 L163.1,422.4 L164.2,422.4
		L165.3,422.4 L166.4,422.4 L167.5,422.4 L168.6,422.4 L169.7,422.4 L170.7,422.4 L171.8,422.4 L172.9,422.4
		L174.0,422.4 L175.1,422.4 L176.2,422.4 L177.3,422.4 L178.3,422.4 L179.4,422.4 L180.5,422.4 L181.6,422.4
		L182.7,422.4 L183.8,422.4 L184.9,422.4 L186.0,422.4 L187.0,422.4 L188.1,422.4 L189.2,422.4 L190.3,422.4
		L191.4,422.4 L192.5,422.4 L193.6,422.4 L194.6,422.4 L195.7,422.4 L196.8,422.4 L197.9,422.4 L199.0,422.4
		L200.1,422.4 L201.2,422.4 L202.2,422.4 L203.3,422.4 L204.4,422.4 L205.5,422.4 L206.6,422.4 L207.7,422.4
		L208.8,422.4 L209.8,422.4 L210.9,422.4 L212.0,422.4 L213.1,422.4 L214.2,422.4 L215.3,422.4 L216.4,422.4
		L217.5,422.4 L218.5,422.4 L219.6,422.4 L220.7,422.4 L221.8,422.4 L222.9,422.4 L224.0,422.4 L225.1,422.4
		L226.1,422.4 L227.2,422.4 L228.3,422.4 L229.4,422.4 L230.5,422.4 L231.6,422.4 L232.7,422.4 L233.7,422.4
		L234.8,422.4 L235.9,422.4 L237.0,422.4 L238.1,422.4 L239.2,422.4 L240.3,422.4 L241.3,422.4 L242.4,422.4
		L243.5,422.4 L244.6,422.4 L245.7,422.4 L246.8,422.4 L247.9,422.4 L249.0,422.4 L250.0,422.4 L251.1,422.4
		L252.2,422.4 L253.3,422.4 L254.4,422.4 L255.5,422.4 L256.6,422.4 L257.6,422.4 L258.7,422.4 L259.8,422.4
		L260.9,422.4 L262.0,422.4 L263.1,422.4 L264.2,422.4 L265.2,422.4 L266.3,422.4 L267.4,422.4 L268.5,422.4
		L269.6,422.4 L270.7,422.4 L271.8,422.4 L272.8,422.4 L273.9,422.4 L275.0,422.4 L276.1,422.4 L277.2,422.4
		L278.3,422.4 L279.4,422.4 L280.5,422.4 L281.5,422.4 L282.6,422.4 L283.7,422.4 L284.8,422.4 L285.9,422.4
		L287.0,422.4 L288.1,422.4 L289.1,422.4 L290.2,422.4 L291.3,422.4 L292.4,422.4 L293.5,422.4 L294.6,422.4
		L295.7,422.4 L296.7,422.4 L297.8,422.4 L298.9,422.4 L300.0,422.4 L301.1,422.4 L302.2,422.4 L303.3,422.4
		L304.3,422.4 L305.4,422.4 L306.5,422.4 L307.6,422.4 L308.7,422.4 L309.8,422.4 L310.9,422.4 L312.0,422.4
		L313.0,422.4 L314.1,422.4 L315.2,422.4 L316.3,422.4 L317.4,422.4 L318.5,422.4 L319.6,422.4 L320.6,422.4
		L321.7,422.4 L322.8,422.4 L323.9,422.4 L325.0,422.4 L326.1,422.4 L327.2,422.4 L328.2,422.4 L329.3,422.4
		L330.4,422.4 L331.5,422.4 L332.6,422.4 L333.7,422.4 L334.8,422.4 L335.8,422.4 L336.9,422.4 L338.0,422.4
		L339.1,422.4 L340.2,422.4 L341.3,422.4 L342.4,422.4 L343.4,422.4 L344.5,422.4 L345.6,422.4 L346.7,422.4
		L347.8,422.4 L348.9,422.4 L350.0,422.4 L351.1,422.4 L352.1,422.4 L353.2,422.4 L354.3,422.4 L355.4,422.4
		L356.5,422.4 L357.6,422.4 L358.7,422.4 L359.7,422.4 L360.8,422.4 L361.9,422.4 L363.0,422.4 L364.1,422.4
		L365.2,422.4 L366.3,422.4 L367.3,422.4 L368.4,422.4 L369.5,422.4 L370.6,422.4 L371.7,422.4 L372.8,422.4
		L373.9,422.4 L374.9,422.4 L376.0,422.4 L377.1,422.4 L378.2,422.4 L379.3,422.4 L380.4,422.4 L381.5,422.4
		L382.6,422.4 L383.6,422.4 L384.7,422.4 L385.8,422.4 L386.9,422.4 L388.0,422.4 L389.1,422.4 L390.2,422.4
		L391.2,422.4 L392.3,422.4 L393.4,422.4 L394.5,422.4 L395.6,422.4 L396.7,422.4 L397.8,422.4 L398.8,422.4
		L399.9,422.4 L401.0,422.4 L402.1,422.4 L403.2,422.4 L404.3,422.4 L405.4,422.4 L406.4,422.4 L407.5,422.4
		L408.6,422.4 L409.7,422.4 L410.8,422.4 L411.9,422.4 L413.0,422.4 L414.1,422.4 L415.1,422.4 L416.2,422.4
		L417.3,422.4 L418.4,422.4 L419.5,422.4 L420.6,422.4 L421.7,422.4 L422.7,422.4 L423.8,422.4 L424.9,422.4
		L426.0,422.4 L427.1,422.4 L428.2,422.4 L429.3,422.4 L430.3,422.4 L431.4,422.4 L432.5,422.4 L433.6,422.4
		L434.7,422.4 L435.8,422.4 L436.9,422.4 L437.9,422.4 L439.0,422.4 L440.1,422.4 L441.2,422.4 L442.3,422.4
		L443.4,422.4 L444.5,422.4 L445.6,422.4 L446.6,422.4 L447.7,422.4 L448.8,422.4 L449.9,422.4 L451.0,422.4
		L452.1,422.4 L453.2,422.4 L454.2,422.4 L455.3,422.4 L456.4,422.4 L457.5,422.4 L458.6,422.4 L459.7,422.4
		L460.8,422.4 L461.8,422.4 L462.9,422.4 L464.0,422.4 L465.1,422.4 L466.2,422.4 L467.3,422.4 L468.4,422.4
		L469.4,422.4 L470.5,422.4 L471.6,422.4 L472.7,422.4 L473.8,422.4 L474.9,422.4 L476.0,422.4 L477.1,422.4
		L478.1,422.4 L479.2,422.4 L480.3,422.4 L481.4,422.4 L482.5,422.4 L483.6,422.4 L484.7,422.4 L485.7,422.4
		L486.8,422.4 L487.9,422.4 L489.0,422.4 L490.1,422.4 L491.2,422.4 L492.3,422.4 L493.3,422.4 L494.4,422.4
		L495.5,422.4 L496.6,422.4 L497.7,422.4 L498.8,422.4 L499.9,422.4 L500.9,422.4 L502.0,422.4 L503.1,422.4
		L504.2,422.4 L505.3,422.4 L506.4,422.4 L507.5,422.4 L508.6,422.4 L509.6,422.4 L510.7,422.4 L511.8,422.4
		L512.9,422.4 L514.0,422.4 L515.1,422.4 L516.2,422.4 L517.2,422.4 L518.3,422.4 L519.4,422.4 L520.5,422.4
		L521.6,422.4 L522.7,422.4 L523.8,422.4 L524.8,422.4 L525.9,422.4 L527.0,422.4 L528.1,422.4 L529.2,422.4
		L530.3,422.4 L531.4,422.4 L532.4,422.4 L533.5,422.4 L534.6,422.4 L535.7,422.4 L536.8,422.4 L537.9,422.4
		L539.0,422.4 L540.1,422.4 L541.1,422.4 L542.2,422.4 L543.3,422.4 L544.4,422.4 L545.5,422.4 L546.6,422.4
		L547.7,422.4 L548.7,422.4 L549.8,422.4 L550.9,422.4 L552.0,422.4 L553.1,422.4 L554.2,422.4 L555.3,422.4
		L556.3,422.4 L557.4,422.4 L558.5,422.4 L559.6,422.4 L560.7,422.4 L561.8,422.4 L562.9,422.4 L563.9,422.4
		L565.0,422.4 L566.1,422.4 L567.2,422.4 L568.3,422.4 L569.4,422.4 L570.5,422.4 L571.6,422.4 L572.6,422.4
		L573.7,422.4 L574.8,422.4 L575.9,422.4 L577.0,422.4 L578.1,422.4 L579.2,422.4 L580.2,422.4 L581.3,422.4
		L582.4,422.4 L583.5,422.4 L584.6,422.4 L585.7,422.4 L586.8,422.4 L587.8,422.4 L588.9,422.4 L590.0,422.4
		L591.1,422.4 L592.2,422.4 L593.3,422.4 L594.4,422.4 L595.4,422.4 L596.5,422.4 L597.6,422.4 L598.7,422.4
		L599.8,422.4 L600.9,422.4 L602.0,422.4 L603.1,422.4 L604.1,422.4 L605.2,422.4 L606.3,422.4 L607.4,422.4
		L608.5,422.4 L609.6,422.4 L610.7,422.4 L611.7,422.4 L612.8,422.4 L613.9,422.4  '/></g>
	</g>
	<g id="gnuplot_plot_6" ><title>W = 14</title>
<g fill="none" color="black" stroke="currentColor" stroke-width="1.00" stroke-linecap="butt" stroke-linejoin="miter">
	<g transform="translate(547.9,130.0)" stroke="none" fill="black" font-family="Arial" font-size="12.00"  text-anchor="end">
		<text><tspan font-family="Arial" >W = 14</tspan></text>
	</g>
</g>
<g fill="none" color="black" stroke="currentColor" stroke-width="1.00" stroke-linecap="butt" stroke-linejoin="miter">
	<path stroke='rgb(  0, 114, 178)'  d='M556.2,126.1 L598.4,126.1 M71.9,18.1 L73.0,154.2 L74.1,21.4 L75.2,154.8 L76.2,22.8 L77.3,154.4
		L78.4,289.6 L79.5,422.4 L80.6,422.4 L81.7,422.4 L82.8,422.4 L83.8,422.4 L84.9,422.4 L86.0,422.4
		L87.1,422.4 L88.2,422.4 L89.3,422.4 L90.4,422.4 L91.5,422.4 L92.5,422.4 L93.6,422.4 L94.7,422.4
		L95.8,422.4 L96.9,422.4 L98.0,422.4 L99.1,422.4 L100.1,422.4 L101.2,422.4 L102.3,422.4 L103.4,422.4
		L104.5,422.4 L105.6,422.4 L106.7,422.4 L107.7,422.4 L108.8,422.4 L109.9,422.4 L111.0,422.4 L112.1,422.4
		L113.2,422.4 L114.3,422.4 L115.3,422.4 L116.4,422.4 L117.5,422.4 L118.6,422.4 L119.7,422.4 L120.8,422.4
		L121.9,422.4 L123.0,422.4 L124.0,422.4 L125.1,422.4 L126.2,422.4 L127.3,422.4 L128.4,422.4 L129.5,422.4
		L130.6,422.4 L131.6,422.4 L132.7,422.4 L133.8,422.4 L134.9,422.4 L136.0,422.4 L137.1,422.4 L138.2,422.4
		L139.2,422.4 L140.3,422.4 L141.4,422.4 L142.5,422.4 L143.6,422.4 L144.7,422.4 L145.8,422.4 L146.8,422.4
		L147.9,422.4 L149.0,422.4 L150.1,422.4 L151.2,422.4 L152.3,422.4 L153.4,422.4 L154.5,422.4 L155.5,422.4
		L156.6,422.4 L157.7,422.4 L158.8,422.4 L159.9,422.4 L161.0,422.4 L162.1,422.4 L163.1,422.4 L164.2,422.4
		L165.3,422.4 L166.4,422.4 L167.5,422.4 L168.6,422.4 L169.7,422.4 L170.7,422.4 L171.8,422.4 L172.9,422.4
		L174.0,422.4 L175.1,422.4 L176.2,422.4 L177.3,422.4 L178.3,422.4 L179.4,422.4 L180.5,422.4 L181.6,422.4
		L182.7,422.4 L183.8,422.4 L184.9,422.4 L186.0,422.4 L187.0,422.4 L188.1,422.4 L189.2,422.4 L190.3,422.4
		L191.4,422.4 L192.5,422.4 L193.6,422.4 L194.6,422.4 L195.7,422.4 L196.8,422.4 L197.9,422.4 L199.0,422.4
		L200.1,422.4 L201.2,422.4 L202.2,422.4 L203.3,422.4 L204.4,422.4 L205.5,422.4 L206.6,422.4 L207.7,422.4
		L208.8,422.4 L209.8,422.4 L210.9,422.4 L212.0,422.4 L213.1,422.4 L214.2,422.4 L215.3,422.4 L216.4,422.4
		L217.5,422.4 L218.5,422.4 L219.6,422.4 L220.7,422.4 L221.8,422.4 L222.9,422.4 L224.0,422.4 L225.1,422.4
		L226.1,422.4 L227.2,422.4 L228.3,422.4 L229.4,422.4 L230.5,422.4 L231.6,422.4 L232.7,422.4 L233.7,422.4
		L234.8,422.4 L235.9,422.4 L237.0,422.4 L238.1,422.4 L239.2,422.4 L240.3,422.4 L241.3,422.4 L242.4,422.4
		L243.5,422.4 L244.6,422.4 L245.7,422.4 L246.8,422.4 L247.9,422.4 L249.0,422.4 L250.0,422.4 L251.1,422.4
		L252.2,422.4 L253.3,422.4 L254.4,422.4 L255.5,422.4 L256.6,422.4 L257.6,422.4 L258.7,422.4 L259.8,422.4
		L260.9,422.4 L262.0,422.4 L263.1,422.4 L264.2,422.4 L265.2,422.4 L266.3,422.4 L267.4,422.4 L268.5,422.4
		L269.6,422.4 L270.7,422.4 L271.8,422.4 L272.8,422.4 L273.9,422.4 L275.0,422.4 L276.1,422.4 L277.2,422.4
		L278.3,422.4 L279.4,422.4 L280.5,422.4 L281.5,422.4 L282.6,422.4 L283.7,422.4 L284.8,422.4 L285.9,422.4
		L287.0,422.4 L288.1,422.4 L289.1,422.4 L290.2,422.4 L291.3,422.4 L292.4,422.4 L293.5,422.4 L294.6,422.4
		L295.7,422.4 L296.7,422.4 L297.8,422.4 L298.9,422.4 L300.0,422.4 L301.1,422.4 L302.2,422.4 L303.3,422.4
		L304.3,422.4 L305.4,422.4 L306.5,422.4 L307.6,422.4 L308.7,422.4 L309.8,422.4 L310.9,422.4 L312.0,422.4
		L313.0,422.4 L314.1,422.4 L315.2,422.4 L316.3,422.4 L317.4,422.4 L318.5,422.4 L319.6,422.4 L320.6,422.4
		L321.7,422.4 L322.8,422.4 L323.9,422.4 L325.0,422.4 L326.1,422.4 L327.2,422.4 L328.2,422.4 L329.3,422.4
		L330.4,422.4 L331.5,422.4 L332.6,422.4 L333.7,422.4 L334.8,422.4 L335.8,422.4 L336.9,422.4 L338.0,422.4
		L339.1,422.4 L340.2,422.4 L341.3,422.4 L342.4,422.4 L343.4,422.4 L344.5,422.4 L345.6,422.4 L346.7,422.4
		L347.8,422.4 L348.9,422.4 L350.0,422.4 L351.1,422.4 L352.1,422.4 L353.2,422.4 L354.3,422.4 L355.4,422.4
		L356.5,422.4 L357.6,422.4 L358.7,422.4 L359.7,422.4 L360.8,422.4 L361.9,422.4 L363.0,422.4 L364.1,422.4
		L365.2,422.4 L366.3,422.4 L367.3,422.4 L368.4,422.4 L369.5,422.4 L370.6,422.4 L371.7,422.4 L372.8,422.4
		L373.9,422.4 L374.9,422.4 L376.0,422.4 L377.1,422.4 L378.2,422.4 L379.3,422.4 L380.4,422.4 L381.5,422.4
		L382.6,422.4 L383.6,422.4 L384.7,422.4 L385.8,422.4 L386.9,422.4 L388.0,422.4 L389.1,422.4 L390.2,422.4
		L391.2,422.4 L392.3,422.4 L393.4,422.4 L394.5,422.4 L395.6,422.4 L396.7,422.4 L397.8,422.4 L398.8,422.4
		L399.9,422.4 L401.0,422.4 L402.1,422.4 L403.2,422.4 L404.3,422.4 L405.4,422.4 L406.4,422.4 L407.5,422.4
		L408.6,422.4 L409.7,422.4 L410.8,422.4 L411.9,422.4 L413.0,422.4 L414.1,422.4 L415.1,422.4 L416.2,422.4
		L417.3,422.4 L418.4,422.4 L419.5,422.4 L420.6,422.4 L421.7,422.4 L422.7,422.4 L423.8,422.4 L424.9,422.4
		L426.0,422.4 L427.1,422.4 L428.2,422.4 L429.3,422.4 L430.3,422.4 L431.4,422.4 L432.5,422.4 L433.6,422.4
		L434.7,422.4 L435.8,422.4 L436.9,422.4 L437.9,422.4 L439.0,422.4 L440.1,422.4 L441.2,422.4 L442.3,422.4
		L443.4,422.4 L444.5,422.4 L445.6,422.4 L446.6,422.4 L447.7,422.4 L448.8,422.4 L449.9,422.4 L451.0,422.4
		L452.1,422.4 L453.2,422.4 L454.2,422.4 L455.3,422.4 L456.4,422.4 L457.5,422.4 L458.6,422.4 L459.7,422.4
		L460.8,422.4 L461.8,422.4 L462.9,422.4 L464.0,422.4 L465.1,422.4 L466.2,422.4 L467.3,422.4 L468.4,422.4
		L469.4,422.4 L470.5,422.4 L471.6,422.4 L472.7,422.4 L473.8,422.4 L474.9,422.4 L476.0,422.4 L477.1,422.4
		L478.1,422.4 L479.2,422.4 L480.3,422.4 L481.4,422.4 L482.5,422.4 L483.6,422.4 L484.7,422.4 L485.7,422.4
		L486.8,422.4 L487.9,422.4 L489.0,422.4 L490.1,422.4 L491.2,422.4 L492.3,422.4 L493.3,422.4 L494.4,422.4
		L495.5,422.4 L496.6,422.4 L497.7,422.4 L498.8,422.4 L499.9,422.4 L500.9,422.4 L502.0,422.4 L503.1,422.4
		L504.2,422.4 L505.3,422.4 L506.4,422.4 L507.5,422.4 L508.6,422.4 L509.6,422.4 L510.7,422.4 L511.8,422.4
		L512.9,422.4 L514.0,422.4 L515.1,422.4 L516.2,422.4 L517.2,422.4 L518.3,422.4 L519.4,422.4 L520.5,422.4
		L521.6,422.4 L522.7,422.4 L523.8,422.4 L524.8,422.4 L525.9,422.4 L527.0,422.4 L528.1,422.4 L529.2,422.4
		L530.3,422.4 L531.4,422.4 L532.4,422.4 L533.5,422.4 L534.6,422.4 L535.7,422.4 L536.8,422.4 L537.9,422.4
		L539.0,422.4 L540.1,422.4 L541.1,422.4 L542.2,422.4 L543.3,422.4 L544.4,422.4 L545.5,422.4 L546.6,422.4
		L547.7,422.4 L548.7,422.4 L549.8,422.4 L550.9,422.4 L552.0,422.4 L553.1,422.4 L554.2,422.4 L555.3,422.4
		L556.3,422.4 L557.4,422.4 L558.5,422.4 L559.6,422.4 L560.7,422.4 L561.8,422.4 L562.9,422.4 L563.9,422.4
		L565.0,422.4 L566.1,422.4 L567.2,422.4 L568.3,422.4 L569.4,422.4 L570.5,422.4 L571.6,422.4 L572.6,422.4
		L573.7,422.4 L574.8,422.4 L575.9,422.4 L577.0,422.4 L578.1,422.4 L579.2,422.4 L580.2,422.4 L581.3,422.4
		L582.4,422.4 L583.5,422.4 L584.6,422.4 L585.7,422.4 L586.8,422.4 L587.8,422.4 L588.9,422.4 L590.0,422.4
		L591.1,422.4 L592.2,422.4 L593.3,422.4 L594.4,422.4 L595.4,422.4 L596.5,422.4 L597.6,422.4 L598.7,422.4
		L599.8,422.4 L600.9,422.4 L602.0,422.4 L603.1,422.4 L604.1,422.4 L605.2,422.4 L606.3,422.4 L607.4,422.4
		L608.5,422.4 L609.6,422.4 L610.7,422.4 L611.7,422.4 L612.8,422.4 L613.9,422.4  '/></g>
	</g>
	<g id="gnuplot_plot_7" ><title>W = 16</title>
<g fill="none" color="black" stroke="currentColor" stroke-width="1.00" stroke-linecap="butt" stroke-linejoin="miter">
	<g transform="translate(547.9,148.0)" stroke="none" fill="black" font-family="Arial" font-size="12.00"  text-anchor="end">
		<text><tspan font-family="Arial" >W = 16</tspan></text>
	</g>
</g>
<g fill="none" color="black" stroke="currentColor" stroke-width="1.00" stroke-linecap="butt" stroke-linejoin="miter">
	<path stroke='rgb(229,  30,  16)'  d='M556.2,144.1 L598.4,144.1 M71.9,18.1 L73.0,154.2 L74.1,21.4 L75.2,154.8 L76.2,22.8 L77.3,154.4
		L78.4,289.6 L79.5,422.4 L80.6,422.4 L81.7,422.4 L82.8,422.4 L83.8,422.4 L84.9,422.4 L86.0,422.4
		L87.1,422.4 L88.2,422.4 L89.3,422.4 L90.4,422.4 L91.5,422.4 L92.5,422.4 L93.6,422.4 L94.7,422.4
		L95.8,422.4 L96.9,422.4 L98.0,422.4 L99.1,422.4 L100.1,422.4 L101.2,422.4 L102.3,422.4 L103.4,422.4
		L104.5,422.4 L105.6,422.4 L106.7,422.4 L107.7,422.4 L108.8,422.4 L109.9,422.4 L111.0,422.4 L112.1,422.4
		L113.2,422.4 L114.3,422.4 L115.3,422.4 L116.4,422.4 L117.5,422.4 L118.6,422.4 L119.7,422.4 L120.8,422.4
		L121.9,422.4 L123.0,422.4 L124.0,422.4 L125.1,422.4 L126.2,422.4 L127.3,422.4 L128.4,422.4 L129.5,422.4
		L130.6,422.4 L131.6,422.4 L132.7,422.4 L133.8,422.4 L134.9,422.4 L136.0,422.4 L137.1,422.4 L138.2,422.4
		L139.2,422.4 L140.3,422.4 L141.4,422.4 L142.5,422.4 L143.6,422.4 L144.7,422.4 L145.8,422.4 L146.8,422.4
		L147.9,422.4 L149.0,422.4 L150.1,422.4 L151.2,422.4 L152.3,422.4 L153.4,422.4 L154.5,422.4 L155.5,422.4
		L156.6,422.4 L157.7,422.4 L158.8,422.4 L159.9,422.4 L161.0,422.4 L162.1,422.4 L163.1,422.4 L164.2,422.4
		L165.3,422.4 L166.4,422.4 L167.5,422.4 L168.6,422.4 L169.7,422.4 L170.7,422.4 L171.8,422.4 L172.9,422.4
		L174.0,422.4 L175.1,422.4 L176.2,422.4 L177.3,422.4 L178.3,422.4 L179.4,422.4 L180.5,422.4 L181.6,422.4
		L182.7,422.4 L183.8,422.4 L184.9,422.4 L186.0,422.4 L187.0,422.4 L188.1,422.4 L189.2,422.4 L190.3,422.4
		L191.4,422.4 L192.5,422.4 L193.6,422.4 L194.6,422.4 L195.7,422.4 L196.8,422.4 L197.9,422.4 L199.0,422.4
		L200.1,422.4 L201.2,422.4 L202.2,422.4 L203.3,422.4 L204.4,422.4 L205.5,422.4 L206.6,422.4 L207.7,422.4
		L208.8,422.4 L209.8,422.4 L210.9,422.4 L212.0,422.4 L213.1,422.4 L214.2,422.4 L215.3,422.4 L216.4,422.4
		L217.5,422.4 L218.5,422.4 L219.6,422.4 L220.7,422.4 L221.8,422.4 L222.9,422.4 L224.0,422.4 L225.1,422.4
		L226.1,422.4 L227.2,422.4 L228.3,422.4 L229.4,422.4 L230.5,422.4 L231.6,422.4 L232.7,422.4 L233.7,422.4
		L234.8,422.4 L235.9,422.4 L237.0,422.4 L238.1,422.4 L239.2,422.4 L240.3,422.4 L241.3,422.4 L242.4,422.4
		L243.5,422.4 L244.6,422.4 L245.7,422.4 L246.8,422.4 L247.9,422.4 L249.0,422.4 L250.0,422.4 L251.1,422.4
		L252.2,422.4 L253.3,422.4 L254.4,422.4 L255.5,422.4 L256.6,422.4 L257.6,422.4 L258.7,422.4 L259.8,422.4
		L260.9,422.4 L262.0,422.4 L263.1,422.4 L264.2,422.4 L265.2,422.4 L266.3,422.4 L267.4,422.4 L268.5,422.4
		L269.6,422.4 L270.7,422.4 L271.8,422.4 L272.8,422.4 L273.9,422.4 L275.0,422.4 L276.1,422.4 L277.2,422.4
		L278.3,422.4 L279.4,422.4 L280.5,422.4 L281.5,422.4 L282.6,422.4 L283.7,422.4 L284.8,422.4 L285.9,422.4
		L287.0,422.4 L288.1,422.4 L289.1,422.4 L290.2,422.4 L291.3,422.4 L292.4,422.4 L293.5,422.4 L294.6,422.4
		L295.7,422.4 L296.7,422.4 L297.8,422.4 L298.9,422.4 L300.0,422.4 L301.1,422.4 L302.2,422.4 L303.3,422.4
		L304.3,422.4 L305.4,422.4 L306.5,422.4 L307.6,422.4 L308.7,422.4 L309.8,422.4 L310.9,422.4 L312.0,422.4
		L313.0,422.4 L314.1,422.4 L315.2,422.4 L316.3,422.4 L317.4,422.4 L318.5,422.4 L319.6,422.4 L320.6,422.4
		L321.7,422.4 L322.8,422.4 L323.9,422.4 L325.0,422.4 L326.1,422.4 L327.2,422.4 L328.2,422.4 L329.3,422.4
		L330.4,422.4 L331.5,422.4 L332.6,422.4 L333.7,422.4 L334.8,422.4 L335.8,422.4 L336.9,422.4 L338.0,422.4
		L339.1,422.4 L340.2,422.4 L341.3,422.4 L342.4,422.4 L343.4,422.4 L344.5,422.4 L345.6,422.4 L346.7,422.4
		L347.8,422.4 L348.9,422.4 L350.0,422.4 L351.1,422.4 L352.1,422.4 L353.2,422.4 L354.3,422.4 L355.4,422.4
		L356.5,422.4 L357.6,422.4 L358.7,422.4 L359.7,422.4 L360.8,422.4 L361.9,422.4 L363.0,422.4 L364.1,422.4
		L365.2,422.4 L366.3,422.4 L367.3,422.4 L368.4,422.4 L369.5,422.4 L370.6,422.4 L371.7,422.4 L372.8,422.4
		L373.9,422.4 L374.9,422.4 L376.0,422.4 L377.1,422.4 L378.2,422.4 L379.3,422.4 L380.4,422.4 L381.5,422.4
		L382.6,422.4 L383.6,422.4 L384.7,422.4 L385.8,422.4 L386.9,422.4 L388.0,422.4 L389.1,422.4 L390.2,422.4
		L391.2,422.4 L392.3,422.4 L393.4,422.4 L394.5,422.4 L395.6,422.4 L396.7,422.4 L397.8,422.4 L398.8,422.4
		L399.9,422.4 L401.0,422.4 L402.1,422.4 L403.2,422.4 L404.3,422.4 L405.4,422.4 L406.4,422.4 L407.5,422.4
		L408.6,422.4 L409.7,422.4 L410.8,422.4 L411.9,422.4 L413.0,422.4 L414.1,422.4 L415.1,422.4 L416.2,422.4
		L417.3,422.4 L418.4,422.4 L419.5,422.4 L420.6,422.4 L421.7,422.4 L422.7,422.4 L423.8,422.4 L424.9,422.4
		L426.0,422.4 L427.1,422.4 L428.2,422.4 L429.3,422.4 L430.3,422.4 L431.4,422.4 L432.5,422.4 L433.6,422.4
		L434.7,422.4 L435.8,422.4 L436.9,422.4 L437.9,422.4 L439.0,422.4 L440.1,422.4 L441.2,422.4 L442.3,422.4
		L443.4,422.4 L444.5,422.4 L445.6,422.4 L446.6,422.4 L447.7,422.4 L448.8,422.4 L449.9,422.4 L451.0,422.4
		L452.1,422.4 L453.2,422.4 L454.2,422.4 L455.3,422.4 L456.4,422.4 L457.5,422.4 L458.6,422.4 L459.7,422.4
		L460.8,422.4 L461.8,422.4 L462.9,422.4 L464.0,422.4 L465.1,422.4 L466.2,422.4 L467.3,422.4 L468.4,422.4
		L469.4,422.4 L470.5,422.4 L471.6,422.4 L472.7,422.4 L473.8,422.4 L474.9,422.4 L476.0,422.4 L477.1,422.4
		L478.1,422.4 L479.2,422.4 L480.3,422.4 L481.4,422.4 L482.5,422.4 L483.6,422.4 L484.7,422.4 L485.7,422.4
		L486.8,422.4 L487.9,422.4 L489.0,422.4 L490.1,422.4 L491.2,422.4 L492.3,422.4 L493.3,422.4 L494.4,422.4
		L495.5,422.4 L496.6,422.4 L497.7,422.4 L498.8,422.4 L499.9,422.4 L500.9,422.4 L502.0,422.4 L503.1,422.4
		L504.2,422.4 L505.3,422.4 L506.4,422.4 L507.5,422.4 L508.6,422.4 L509.6,422.4 L510.7,422.4 L511.8,422.4
		L512.9,422.4 L514.0,422.4 L515.1,422.4 L516.2,422.4 L517.2,422.4 L518.3,422.4 L519.4,422.4 L520.5,422.4
		L521.6,422.4 L522.7,422.4 L523.8,422.4 L524.8,422.4 L525.9,422.4 L527.0,422.4 L528.1,422.4 L529.2,422.4
		L530.3,422.4 L531.4,422.4 L532.4,422.4 L533.5,422.4 L534.6,422.4 L535.7,422.4 L536.8,422.4 L537.9,422.4
		L539.0,422.4 L540.1,422.4 L541.1,422.4 L542.2,422.4 L543.3,422.4 L544.4,422.4 L545.5,422.4 L546.6,422.4
		L547.7,422.4 L548.7,422.4 L549.8,422.4 L550.9,422.4 L552.0,422.4 L553.1,422.4 L554.2,422.4 L555.3,422.4
		L556.3,422.4 L557.4,422.4 L558.5,422.4 L559.6,422.4 L560.7,422.4 L561.8,422.4 L562.9,422.4 L563.9,422.4
		L565.0,422.4 L566.1,422.4 L567.2,422.4 L568.3,422.4 L569.4,422.4 L570.5,422.4 L571.6,422.4 L572.6,422.4
		L573.7,422.4 L574.8,422.4 L575.9,422.4 L577.0,422.4 L578.1,422.4 L579.2,422.4 L580.2,422.4 L581.3,422.4
		L582.4,422.4 L583.5,422.4 L584.6,422.4 L585.7,422.4 L586.8,422.4 L587.8,422.4 L588.9,422.4 L590.0,422.4
		L591.1,422.4 L592.2,422.4 L593.3,422.4 L594.4,422.4 L595.4,422.4 L596.5,422.4 L597.6,422.4 L598.7,422.4
		L599.8,422.4 L600.9,422.4 L602.0,422.4 L603.1,422.4 L604.1,422.4 L605.2,422.4 L606.3,422.4 L607.4,422.4
		L608.5,422.4 L609.6,422.4 L610.7,422.4 L611.7,422.4 L612.8,422.4 L613.9,422.4  '/></g>
	</g>
<g fill="none" color="white" stroke="rgb(229,  30,  16)" stroke-width="2.00" stroke-linecap="butt" stroke-linejoin="miter">
</g>
<g fill="none" color="black" stroke="currentColor" stroke-width="2.00" stroke-linecap="butt" stroke-linejoin="miter">
</g>
<g fill="none" color="black" stroke="black" stroke-width="1.00" stroke-linecap="butt" stroke-linejoin="miter">
</g>
<g fill="none" color="black" stroke="currentColor" stroke-width="1.00" stroke-linecap="butt" stroke-linejoin="miter">
	<path stroke='black'  d='M71.9,18.1 L71.9,422.4 L615.0,422.4 L615.0,18.1 L71.9,18.1 Z  '/></g>
<g fill="none" color="black" stroke="currentColor" stroke-width="1.00" stroke-linecap="butt" stroke-linejoin="miter">
</g>
</g>
</svg>

