

================================================================
== Vivado HLS Report for 'winograd_top_accel'
================================================================
* Date:           Sat Dec 18 09:59:52 2021

* Version:        2018.2 (Build 2258646 on Thu Jun 14 20:25:20 MDT 2018)
* Project:        hls_project_winograd_3_8
* Solution:       solution
* Product family: zynq
* Target device:  xc7z020clg484-1


================================================================
== Performance Estimates
================================================================
+ Timing (ns): 
    * Summary: 
    +--------+-------+----------+------------+
    |  Clock | Target| Estimated| Uncertainty|
    +--------+-------+----------+------------+
    |ap_clk  |  10.00|     7.897|        1.25|
    +--------+-------+----------+------------+

+ Latency (clock cycles): 
    * Summary: 
    +-----+-----+-----+-----+---------+
    |  Latency  |  Interval | Pipeline|
    | min | max | min | max |   Type  |
    +-----+-----+-----+-----+---------+
    |    4|    4|    4|    4|   none  |
    +-----+-----+-----+-----+---------+

    + Detail: 
        * Instance: 
        N/A

        * Loop: 
        N/A



================================================================
== Utilization Estimates
================================================================
* Summary: 
+-----------------+---------+-------+--------+-------+
|       Name      | BRAM_18K| DSP48E|   FF   |  LUT  |
+-----------------+---------+-------+--------+-------+
|DSP              |        -|      -|       -|      -|
|Expression       |        -|      0|       0|   1753|
|FIFO             |        -|      -|       -|      -|
|Instance         |        -|      -|       -|      -|
|Memory           |        -|      -|       -|      -|
|Multiplexer      |        -|      -|       -|     33|
|Register         |        -|      -|     372|      -|
+-----------------+---------+-------+--------+-------+
|Total            |        0|      0|     372|   1786|
+-----------------+---------+-------+--------+-------+
|Available        |      280|    220|  106400|  53200|
+-----------------+---------+-------+--------+-------+
|Utilization (%)  |        0|      0|   ~0   |      3|
+-----------------+---------+-------+--------+-------+

+ Detail: 
    * Instance: 
    N/A

    * DSP48: 
    N/A

    * Memory: 
    N/A

    * FIFO: 
    N/A

    * Expression: 
    +---------------------------+----------+-------+---+----+------------+------------+
    |       Variable Name       | Operation| DSP48E| FF| LUT| Bitwidth P0| Bitwidth P1|
    +---------------------------+----------+-------+---+----+------------+------------+
    |p_Val2_249_0_1_fu_979_p2   |     *    |      0|  0|  41|           8|           8|
    |p_Val2_249_0_2_fu_1003_p2  |     *    |      0|  0|  41|           8|           8|
    |p_Val2_249_0_3_fu_1026_p2  |     *    |      0|  0|  41|           8|           8|
    |p_Val2_249_1_1_fu_1074_p2  |     *    |      0|  0|  41|           8|           8|
    |p_Val2_249_1_2_fu_1098_p2  |     *    |      0|  0|  41|           8|           8|
    |p_Val2_249_1_3_fu_1122_p2  |     *    |      0|  0|  41|           8|           8|
    |p_Val2_249_1_fu_1050_p2    |     *    |      0|  0|  41|           8|           8|
    |p_Val2_249_2_1_fu_1170_p2  |     *    |      0|  0|  41|           8|           8|
    |p_Val2_249_2_2_fu_1194_p2  |     *    |      0|  0|  41|           8|           8|
    |p_Val2_249_2_3_fu_1218_p2  |     *    |      0|  0|  41|           8|           8|
    |p_Val2_249_2_fu_1146_p2    |     *    |      0|  0|  41|           8|           8|
    |p_Val2_249_3_1_fu_1265_p2  |     *    |      0|  0|  41|           8|           8|
    |p_Val2_249_3_2_fu_1289_p2  |     *    |      0|  0|  41|           8|           8|
    |p_Val2_249_3_3_fu_1309_p2  |     *    |      0|  0|  41|           8|           8|
    |p_Val2_249_3_fu_1241_p2    |     *    |      0|  0|  41|           8|           8|
    |p_Val2_72_fu_955_p2        |     *    |      0|  0|  41|           8|           8|
    |output_0_0_V               |     +    |      0|  0|   8|           8|           8|
    |output_1_1_V               |     +    |      0|  0|   8|           8|           8|
    |p_Val2_108_fu_1458_p2      |     +    |      0|  0|   8|           8|           8|
    |p_Val2_12_fu_518_p2        |     +    |      0|  0|   8|           8|           8|
    |p_Val2_18_fu_534_p2        |     +    |      0|  0|   8|           8|           8|
    |p_Val2_24_fu_340_p2        |     +    |      0|  0|  15|           8|           8|
    |p_Val2_25_fu_556_p2        |     +    |      0|  0|   8|           8|           8|
    |p_Val2_28_fu_567_p2        |     +    |      0|  0|   8|           8|           8|
    |p_Val2_33_fu_584_p2        |     +    |      0|  0|   8|           8|           8|
    |p_Val2_35_fu_600_p2        |     +    |      0|  0|   8|           8|           8|
    |p_Val2_38_fu_611_p2        |     +    |      0|  0|   8|           8|           8|
    |p_Val2_39_fu_617_p2        |     +    |      0|  0|   8|           8|           8|
    |p_Val2_43_fu_633_p2        |     +    |      0|  0|   8|           8|           8|
    |p_Val2_48_fu_666_p2        |     +    |      0|  0|   8|           8|           8|
    |p_Val2_51_fu_274_p2        |     +    |      0|  0|  15|           9|           9|
    |p_Val2_53_fu_288_p2        |     +    |      0|  0|  14|          10|          10|
    |p_Val2_54_cast_fu_675_p2   |     +    |      0|  0|  15|           9|           9|
    |p_Val2_55_fu_304_p2        |     +    |      0|  0|  14|          10|          10|
    |p_Val2_56_cast_fu_690_p2   |     +    |      0|  0|  15|           9|           9|
    |p_Val2_57_fu_708_p2        |     +    |      0|  0|   8|           9|           9|
    |p_Val2_59_fu_392_p2        |     +    |      0|  0|   8|          10|          10|
    |p_Val2_64_fu_427_p2        |     +    |      0|  0|   8|          10|          10|
    |p_Val2_65_fu_789_p2        |     +    |      0|  0|   8|           9|           9|
    |p_Val2_6_fu_501_p2         |     +    |      0|  0|   8|           8|           8|
    |p_Val2_70_fu_904_p2        |     +    |      0|  0|   8|           9|           9|
    |p_Val2_8_fu_316_p2         |     +    |      0|  0|  15|           8|           8|
    |p_Val2_92_fu_1361_p2       |     +    |      0|  0|   8|           8|           8|
    |p_Val2_95_fu_1422_p2       |     +    |      0|  0|   8|           8|           8|
    |p_Val2_98_fu_1375_p2       |     +    |      0|  0|   8|           8|           8|
    |tmp10_fu_1404_p2           |     +    |      0|  0|  15|           8|           8|
    |tmp11_fu_1467_p2           |     +    |      0|  0|   8|           8|           8|
    |tmp1_fu_595_p2             |     +    |      0|  0|   8|           8|           8|
    |tmp2_fu_1408_p2            |     +    |      0|  0|   8|           8|           8|
    |tmp3_fu_1325_p2            |     +    |      0|  0|  15|           8|           8|
    |tmp4_fu_1329_p2            |     +    |      0|  0|  15|           8|           8|
    |tmp5_fu_1346_p2            |     +    |      0|  0|   8|           8|           8|
    |tmp6_fu_1333_p2            |     +    |      0|  0|   8|           8|           8|
    |tmp7_fu_1341_p2            |     +    |      0|  0|   8|           8|           8|
    |tmp8_fu_1337_p2            |     +    |      0|  0|   8|           8|           8|
    |tmp9_fu_1371_p2            |     +    |      0|  0|   8|           8|           8|
    |tmp_18_fu_716_p2           |     +    |      0|  0|   8|           9|           9|
    |tmp_21_fu_401_p2           |     +    |      0|  0|   8|          10|          10|
    |tmp_23_fu_411_p2           |     +    |      0|  0|   8|          10|          10|
    |tmp_25_fu_421_p2           |     +    |      0|  0|   8|          10|          10|
    |tmp_27_fu_749_p2           |     +    |      0|  0|   8|          10|          10|
    |tmp_30_fu_438_p2           |     +    |      0|  0|   8|          10|          10|
    |tmp_31_fu_444_p2           |     +    |      0|  0|   8|          10|          10|
    |tmp_32_fu_770_p2           |     +    |      0|  0|   8|          10|          10|
    |tmp_35_cast_fu_736_p2      |     +    |      0|  0|   8|          10|          10|
    |tmp_35_fu_799_p2           |     +    |      0|  0|   8|           9|           9|
    |tmp_37_fu_820_p2           |     +    |      0|  0|   8|           9|           9|
    |tmp_3_fu_573_p2            |     +    |      0|  0|   8|           8|           8|
    |tmp_41_fu_467_p2           |     +    |      0|  0|   8|          10|          10|
    |tmp_42_fu_841_p2           |     +    |      0|  0|   8|          10|          10|
    |tmp_44_fu_478_p2           |     +    |      0|  0|   8|          10|          10|
    |tmp_46_fu_490_p2           |     +    |      0|  0|   8|          10|          10|
    |tmp_47_fu_862_p2           |     +    |      0|  0|   8|          10|          10|
    |tmp_49_fu_884_p2           |     +    |      0|  0|   8|           9|           9|
    |tmp_52_fu_910_p2           |     +    |      0|  0|   8|           9|           9|
    |tmp_54_fu_932_p2           |     +    |      0|  0|   8|           9|           9|
    |tmp_64_cast_fu_836_p2      |     +    |      0|  0|   8|          10|          10|
    |tmp_8_fu_650_p2            |     +    |      0|  0|   8|           8|           8|
    |tmp_fu_551_p2              |     +    |      0|  0|   8|           8|           8|
    |tmp_s_fu_540_p2            |     +    |      0|  0|   8|           8|           8|
    |output_0_1_V               |     -    |      0|  0|   8|           8|           8|
    |output_1_0_V               |     -    |      0|  0|   8|           8|           8|
    |p_Val2_100_fu_1385_p2      |     -    |      0|  0|   8|           8|           8|
    |p_Val2_101_fu_1438_p2      |     -    |      0|  0|   8|           8|           8|
    |p_Val2_102_fu_1442_p2      |     -    |      0|  0|   8|           8|           8|
    |p_Val2_103_fu_1447_p2      |     -    |      0|  0|   8|           8|           8|
    |p_Val2_105_fu_1390_p2      |     -    |      0|  0|  15|           8|           8|
    |p_Val2_106_fu_1394_p2      |     -    |      0|  0|   8|           8|           8|
    |p_Val2_107_fu_1399_p2      |     -    |      0|  0|   8|           8|           8|
    |p_Val2_109_fu_1462_p2      |     -    |      0|  0|   8|           8|           8|
    |p_Val2_10_fu_512_p2        |     -    |      0|  0|   8|           8|           8|
    |p_Val2_11_fu_322_p2        |     -    |      0|  0|  15|           8|           8|
    |p_Val2_13_fu_523_p2        |     -    |      0|  0|   8|           8|           8|
    |p_Val2_15_fu_328_p2        |     -    |      0|  0|  15|           8|           8|
    |p_Val2_16_fu_529_p2        |     -    |      0|  0|   8|           8|           8|
    |p_Val2_21_fu_334_p2        |     -    |      0|  0|  15|           8|           8|
    |p_Val2_22_fu_545_p2        |     -    |      0|  0|   8|           8|           8|
    |p_Val2_26_fu_346_p2        |     -    |      0|  0|   8|           1|           8|
    |p_Val2_27_fu_352_p2        |     -    |      0|  0|  15|           8|           8|
    |p_Val2_2_fu_310_p2         |     -    |      0|  0|  15|           8|           8|
    |p_Val2_30_fu_358_p2        |     -    |      0|  0|  15|           8|           8|
    |p_Val2_31_fu_578_p2        |     -    |      0|  0|   8|           8|           8|
    |p_Val2_32_fu_364_p2        |     -    |      0|  0|  15|           8|           8|
    |p_Val2_34_fu_589_p2        |     -    |      0|  0|   8|           8|           8|
    |p_Val2_36_fu_376_p2        |     -    |      0|  0|  15|           8|           8|
    |p_Val2_37_fu_606_p2        |     -    |      0|  0|   8|           8|           8|
    |p_Val2_40_fu_622_p2        |     -    |      0|  0|   8|           8|           8|
    |p_Val2_45_fu_644_p2        |     -    |      0|  0|   8|           8|           8|
    |p_Val2_46_fu_655_p2        |     -    |      0|  0|   8|           8|           8|
    |p_Val2_4_fu_496_p2         |     -    |      0|  0|   8|           8|           8|
    |p_Val2_54_fu_294_p2        |     -    |      0|  0|  15|           9|           9|
    |p_Val2_66_fu_815_p2        |     -    |      0|  0|   8|           9|           9|
    |p_Val2_67_fu_450_p2        |     -    |      0|  0|   8|          10|          10|
    |p_Val2_68_fu_473_p2        |     -    |      0|  0|   8|          10|          10|
    |p_Val2_69_fu_878_p2        |     -    |      0|  0|   8|           9|           9|
    |p_Val2_71_fu_926_p2        |     -    |      0|  0|   8|           9|           9|
    |p_Val2_90_fu_1352_p2       |     -    |      0|  0|   8|           8|           8|
    |p_Val2_91_fu_1356_p2       |     -    |      0|  0|   8|           8|           8|
    |p_Val2_93_fu_1366_p2       |     -    |      0|  0|   8|           8|           8|
    |p_Val2_94_fu_1418_p2       |     -    |      0|  0|   8|           8|           8|
    |p_Val2_96_fu_1427_p2       |     -    |      0|  0|   8|           8|           8|
    |p_Val2_99_fu_1380_p2       |     -    |      0|  0|   8|           8|           8|
    |p_Val2_s_8_fu_507_p2       |     -    |      0|  0|   8|           8|           8|
    |tmp_29_fu_432_p2           |     -    |      0|  0|   8|          10|          10|
    |tmp_2_fu_562_p2            |     -    |      0|  0|   8|           8|           8|
    |tmp_39_fu_455_p2           |     -    |      0|  0|   8|          10|          10|
    |tmp_40_fu_461_p2           |     -    |      0|  0|   8|          10|          10|
    |tmp_45_cast_fu_765_p2      |     -    |      0|  0|   8|          10|          10|
    |tmp_45_fu_484_p2           |     -    |      0|  0|   8|          10|          10|
    |tmp_4_fu_370_p2            |     -    |      0|  0|   8|           8|           8|
    |tmp_5_fu_382_p2            |     -    |      0|  0|  15|           8|           8|
    |tmp_6_fu_628_p2            |     -    |      0|  0|   8|           8|           8|
    |tmp_72_cast_fu_857_p2      |     -    |      0|  0|   8|          10|          10|
    |tmp_7_fu_639_p2            |     -    |      0|  0|   8|           8|           8|
    |tmp_9_fu_661_p2            |     -    |      0|  0|   8|           8|           8|
    +---------------------------+----------+-------+---+----+------------+------------+
    |Total                      |          |      0|  0|1753|        1141|        1148|
    +---------------------------+----------+-------+---+----+------------+------------+

    * Multiplexer: 
    +-----------+----+-----------+-----+-----------+
    |    Name   | LUT| Input Size| Bits| Total Bits|
    +-----------+----+-----------+-----+-----------+
    |ap_NS_fsm  |  33|          6|    1|          6|
    +-----------+----+-----------+-----+-----------+
    |Total      |  33|          6|    1|          6|
    +-----------+----+-----------+-----+-----------+

    * Register: 
    +---------------------+----+----+-----+-----------+
    |         Name        | FF | LUT| Bits| Const Bits|
    +---------------------+----+----+-----+-----------+
    |ap_CS_fsm            |   5|   0|    5|          0|
    |p_Val2_100_reg_1737  |   8|   0|    8|          0|
    |p_Val2_107_reg_1742  |   8|   0|    8|          0|
    |p_Val2_11_reg_1527   |   8|   0|    8|          0|
    |p_Val2_15_reg_1532   |   8|   0|    8|          0|
    |p_Val2_21_reg_1537   |   8|   0|    8|          0|
    |p_Val2_24_reg_1543   |   8|   0|    8|          0|
    |p_Val2_27_reg_1549   |   8|   0|    8|          0|
    |p_Val2_2_reg_1517    |   8|   0|    8|          0|
    |p_Val2_30_reg_1555   |   8|   0|    8|          0|
    |p_Val2_32_reg_1561   |   8|   0|    8|          0|
    |p_Val2_36_reg_1571   |   8|   0|    8|          0|
    |p_Val2_51_reg_1489   |   9|   0|    9|          0|
    |p_Val2_53_reg_1500   |  10|   0|   10|          0|
    |p_Val2_54_reg_1506   |   9|   0|    9|          0|
    |p_Val2_55_reg_1511   |  10|   0|   10|          0|
    |p_Val2_73_reg_1617   |   8|   0|    8|          0|
    |p_Val2_74_reg_1622   |   8|   0|    8|          0|
    |p_Val2_75_reg_1628   |   8|   0|    8|          0|
    |p_Val2_76_reg_1634   |   8|   0|    8|          0|
    |p_Val2_77_reg_1639   |   8|   0|    8|          0|
    |p_Val2_78_reg_1645   |   8|   0|    8|          0|
    |p_Val2_79_reg_1653   |   8|   0|    8|          0|
    |p_Val2_80_reg_1661   |   8|   0|    8|          0|
    |p_Val2_81_reg_1667   |   8|   0|    8|          0|
    |p_Val2_82_reg_1673   |   8|   0|    8|          0|
    |p_Val2_83_reg_1681   |   8|   0|    8|          0|
    |p_Val2_84_reg_1689   |   8|   0|    8|          0|
    |p_Val2_85_reg_1695   |   8|   0|    8|          0|
    |p_Val2_86_reg_1700   |   8|   0|    8|          0|
    |p_Val2_87_reg_1706   |   8|   0|    8|          0|
    |p_Val2_88_reg_1712   |   8|   0|    8|          0|
    |p_Val2_8_reg_1522    |   8|   0|    8|          0|
    |p_Val2_93_reg_1732   |   8|   0|    8|          0|
    |tmp10_reg_1747       |   8|   0|    8|          0|
    |tmp3_reg_1717        |   8|   0|    8|          0|
    |tmp4_reg_1722        |   8|   0|    8|          0|
    |tmp5_reg_1727        |   8|   0|    8|          0|
    |tmp_1_reg_1483       |   9|   0|    9|          0|
    |tmp_25_reg_1597      |  10|   0|   10|          0|
    |tmp_31_reg_1602      |  10|   0|   10|          0|
    |tmp_41_reg_1607      |  10|   0|   10|          0|
    |tmp_46_reg_1612      |  10|   0|   10|          0|
    |tmp_4_reg_1566       |   8|   0|    8|          0|
    |tmp_5_reg_1576       |   8|   0|    8|          0|
    +---------------------+----+----+-----+-----------+
    |Total                | 372|   0|  372|          0|
    +---------------------+----+----+-----+-----------+



================================================================
== Interface
================================================================
* Summary: 
+---------------------+-----+-----+------------+--------------------+--------------+
|      RTL Ports      | Dir | Bits|  Protocol  |    Source Object   |    C Type    |
+---------------------+-----+-----+------------+--------------------+--------------+
|ap_clk               |  in |    1| ap_ctrl_hs | winograd_top_accel | return value |
|ap_rst               |  in |    1| ap_ctrl_hs | winograd_top_accel | return value |
|ap_start             |  in |    1| ap_ctrl_hs | winograd_top_accel | return value |
|ap_done              | out |    1| ap_ctrl_hs | winograd_top_accel | return value |
|ap_idle              | out |    1| ap_ctrl_hs | winograd_top_accel | return value |
|ap_ready             | out |    1| ap_ctrl_hs | winograd_top_accel | return value |
|input_0_0_V          |  in |    8|   ap_none  |     input_0_0_V    |    pointer   |
|input_0_1_V          |  in |    8|   ap_none  |     input_0_1_V    |    pointer   |
|input_0_2_V          |  in |    8|   ap_none  |     input_0_2_V    |    pointer   |
|input_0_3_V          |  in |    8|   ap_none  |     input_0_3_V    |    pointer   |
|input_1_0_V          |  in |    8|   ap_none  |     input_1_0_V    |    pointer   |
|input_1_1_V          |  in |    8|   ap_none  |     input_1_1_V    |    pointer   |
|input_1_2_V          |  in |    8|   ap_none  |     input_1_2_V    |    pointer   |
|input_1_3_V          |  in |    8|   ap_none  |     input_1_3_V    |    pointer   |
|input_2_0_V          |  in |    8|   ap_none  |     input_2_0_V    |    pointer   |
|input_2_1_V          |  in |    8|   ap_none  |     input_2_1_V    |    pointer   |
|input_2_2_V          |  in |    8|   ap_none  |     input_2_2_V    |    pointer   |
|input_2_3_V          |  in |    8|   ap_none  |     input_2_3_V    |    pointer   |
|input_3_0_V          |  in |    8|   ap_none  |     input_3_0_V    |    pointer   |
|input_3_1_V          |  in |    8|   ap_none  |     input_3_1_V    |    pointer   |
|input_3_2_V          |  in |    8|   ap_none  |     input_3_2_V    |    pointer   |
|input_3_3_V          |  in |    8|   ap_none  |     input_3_3_V    |    pointer   |
|kernel_0_0_V         |  in |    8|   ap_none  |    kernel_0_0_V    |    pointer   |
|kernel_0_1_V         |  in |    8|   ap_none  |    kernel_0_1_V    |    pointer   |
|kernel_0_2_V         |  in |    8|   ap_none  |    kernel_0_2_V    |    pointer   |
|kernel_1_0_V         |  in |    8|   ap_none  |    kernel_1_0_V    |    pointer   |
|kernel_1_1_V         |  in |    8|   ap_none  |    kernel_1_1_V    |    pointer   |
|kernel_1_2_V         |  in |    8|   ap_none  |    kernel_1_2_V    |    pointer   |
|kernel_2_0_V         |  in |    8|   ap_none  |    kernel_2_0_V    |    pointer   |
|kernel_2_1_V         |  in |    8|   ap_none  |    kernel_2_1_V    |    pointer   |
|kernel_2_2_V         |  in |    8|   ap_none  |    kernel_2_2_V    |    pointer   |
|output_0_0_V         | out |    8|   ap_vld   |    output_0_0_V    |    pointer   |
|output_0_0_V_ap_vld  | out |    1|   ap_vld   |    output_0_0_V    |    pointer   |
|output_0_1_V         | out |    8|   ap_vld   |    output_0_1_V    |    pointer   |
|output_0_1_V_ap_vld  | out |    1|   ap_vld   |    output_0_1_V    |    pointer   |
|output_1_0_V         | out |    8|   ap_vld   |    output_1_0_V    |    pointer   |
|output_1_0_V_ap_vld  | out |    1|   ap_vld   |    output_1_0_V    |    pointer   |
|output_1_1_V         | out |    8|   ap_vld   |    output_1_1_V    |    pointer   |
|output_1_1_V_ap_vld  | out |    1|   ap_vld   |    output_1_1_V    |    pointer   |
+---------------------+-----+-----+------------+--------------------+--------------+

