<?xml version="1.0" encoding="utf-8"  standalone="no"?>
<svg 
 width="640" height="480"
 viewBox="0 0 640 480"
 xmlns="http://www.w3.org/2000/svg"
 xmlns:xlink="http://www.w3.org/1999/xlink"
>

<title>Gnuplot</title>
<desc>Produced by GNUPLOT 5.2 patchlevel 8 </desc>

<g id="gnuplot_canvas">

<rect x="0" y="0" width="640" height="480" fill="none"/>
<defs>

	<circle id='gpDot' r='0.5' stroke-width='0.5' stroke='currentColor'/>
	<path id='gpPt0' stroke-width='0.222' stroke='currentColor' d='M-1,0 h2 M0,-1 v2'/>
	<path id='gpPt1' stroke-width='0.222' stroke='currentColor' d='M-1,-1 L1,1 M1,-1 L-1,1'/>
	<path id='gpPt2' stroke-width='0.222' stroke='currentColor' d='M-1,0 L1,0 M0,-1 L0,1 M-1,-1 L1,1 M-1,1 L1,-1'/>
	<rect id='gpPt3' stroke-width='0.222' stroke='currentColor' x='-1' y='-1' width='2' height='2'/>
	<rect id='gpPt4' stroke-width='0.222' stroke='currentColor' fill='currentColor' x='-1' y='-1' width='2' height='2'/>
	<circle id='gpPt5' stroke-width='0.222' stroke='currentColor' cx='0' cy='0' r='1'/>
	<use xlink:href='#gpPt5' id='gpPt6' fill='currentColor' stroke='none'/>
	<path id='gpPt7' stroke-width='0.222' stroke='currentColor' d='M0,-1.33 L-1.33,0.67 L1.33,0.67 z'/>
	<use xlink:href='#gpPt7' id='gpPt8' fill='currentColor' stroke='none'/>
	<use xlink:href='#gpPt7' id='gpPt9' stroke='currentColor' transform='rotate(180)'/>
	<use xlink:href='#gpPt9' id='gpPt10' fill='currentColor' stroke='none'/>
	<use xlink:href='#gpPt3' id='gpPt11' stroke='currentColor' transform='rotate(45)'/>
	<use xlink:href='#gpPt11' id='gpPt12' fill='currentColor' stroke='none'/>
	<path id='gpPt13' stroke-width='0.222' stroke='currentColor' d='M0,1.330 L1.265,0.411 L0.782,-1.067 L-0.782,-1.076 L-1.265,0.411 z'/>
	<use xlink:href='#gpPt13' id='gpPt14' fill='currentColor' stroke='none'/>
	<filter id='textbox' filterUnits='objectBoundingBox' x='0' y='0' height='1' width='1'>
	  <feFlood flood-color='white' flood-opacity='1' result='bgnd'/>
	  <feComposite in='SourceGraphic' in2='bgnd' operator='atop'/>
	</filter>
	<filter id='greybox' filterUnits='objectBoundingBox' x='0' y='0' height='1' width='1'>
	  <feFlood flood-color='lightgrey' flood-opacity='1' result='grey'/>
	  <feComposite in='SourceGraphic' in2='grey' operator='atop'/>
	</filter>
</defs>
<g fill="none" color="white" stroke="currentColor" stroke-width="1.00" stroke-linecap="butt" stroke-linejoin="miter">
</g>
<g fill="none" color="black" stroke="currentColor" stroke-width="1.00" stroke-linecap="butt" stroke-linejoin="miter">
	<path stroke='black'  d='M71.9,422.4 L80.9,422.4 M615.0,422.4 L606.0,422.4  '/>	<g transform="translate(63.6,426.3)" stroke="none" fill="black" font-family="Arial" font-size="12.00"  text-anchor="end">
		<text><tspan font-family="Arial" > 0</tspan></text>
	</g>
</g>
<g fill="none" color="black" stroke="currentColor" stroke-width="1.00" stroke-linecap="butt" stroke-linejoin="miter">
	<path stroke='black'  d='M71.9,341.5 L80.9,341.5 M615.0,341.5 L606.0,341.5  '/>	<g transform="translate(63.6,345.4)" stroke="none" fill="black" font-family="Arial" font-size="12.00"  text-anchor="end">
		<text><tspan font-family="Arial" > 0.2</tspan></text>
	</g>
</g>
<g fill="none" color="black" stroke="currentColor" stroke-width="1.00" stroke-linecap="butt" stroke-linejoin="miter">
	<path stroke='black'  d='M71.9,260.7 L80.9,260.7 M615.0,260.7 L606.0,260.7  '/>	<g transform="translate(63.6,264.6)" stroke="none" fill="black" font-family="Arial" font-size="12.00"  text-anchor="end">
		<text><tspan font-family="Arial" > 0.4</tspan></text>
	</g>
</g>
<g fill="none" color="black" stroke="currentColor" stroke-width="1.00" stroke-linecap="butt" stroke-linejoin="miter">
	<path stroke='black'  d='M71.9,179.8 L80.9,179.8 M615.0,179.8 L606.0,179.8  '/>	<g transform="translate(63.6,183.7)" stroke="none" fill="black" font-family="Arial" font-size="12.00"  text-anchor="end">
		<text><tspan font-family="Arial" > 0.6</tspan></text>
	</g>
</g>
<g fill="none" color="black" stroke="currentColor" stroke-width="1.00" stroke-linecap="butt" stroke-linejoin="miter">
	<path stroke='black'  d='M71.9,99.0 L80.9,99.0 M615.0,99.0 L606.0,99.0  '/>	<g transform="translate(63.6,102.9)" stroke="none" fill="black" font-family="Arial" font-size="12.00"  text-anchor="end">
		<text><tspan font-family="Arial" > 0.8</tspan></text>
	</g>
</g>
<g fill="none" color="black" stroke="currentColor" stroke-width="1.00" stroke-linecap="butt" stroke-linejoin="miter">
	<path stroke='black'  d='M71.9,18.1 L80.9,18.1 M615.0,18.1 L606.0,18.1  '/>	<g transform="translate(63.6,22.0)" stroke="none" fill="black" font-family="Arial" font-size="12.00"  text-anchor="end">
		<text><tspan font-family="Arial" > 1</tspan></text>
	</g>
</g>
<g fill="none" color="black" stroke="currentColor" stroke-width="1.00" stroke-linecap="butt" stroke-linejoin="miter">
	<path stroke='black'  d='M71.9,422.4 L71.9,413.4 M71.9,18.1 L71.9,27.1  '/>	<g transform="translate(71.9,444.3)" stroke="none" fill="black" font-family="Arial" font-size="12.00"  text-anchor="middle">
		<text><tspan font-family="Arial" > 0</tspan></text>
	</g>
</g>
<g fill="none" color="black" stroke="currentColor" stroke-width="1.00" stroke-linecap="butt" stroke-linejoin="miter">
	<path stroke='black'  d='M162.4,422.4 L162.4,413.4 M162.4,18.1 L162.4,27.1  '/>	<g transform="translate(162.4,444.3)" stroke="none" fill="black" font-family="Arial" font-size="12.00"  text-anchor="middle">
		<text><tspan font-family="Arial" > 0.05</tspan></text>
	</g>
</g>
<g fill="none" color="black" stroke="currentColor" stroke-width="1.00" stroke-linecap="butt" stroke-linejoin="miter">
	<path stroke='black'  d='M252.9,422.4 L252.9,413.4 M252.9,18.1 L252.9,27.1  '/>	<g transform="translate(252.9,444.3)" stroke="none" fill="black" font-family="Arial" font-size="12.00"  text-anchor="middle">
		<text><tspan font-family="Arial" > 0.1</tspan></text>
	</g>
</g>
<g fill="none" color="black" stroke="currentColor" stroke-width="1.00" stroke-linecap="butt" stroke-linejoin="miter">
	<path stroke='black'  d='M343.5,422.4 L343.5,413.4 M343.5,18.1 L343.5,27.1  '/>	<g transform="translate(343.5,444.3)" stroke="none" fill="black" font-family="Arial" font-size="12.00"  text-anchor="middle">
		<text><tspan font-family="Arial" > 0.15</tspan></text>
	</g>
</g>
<g fill="none" color="black" stroke="currentColor" stroke-width="1.00" stroke-linecap="butt" stroke-linejoin="miter">
	<path stroke='black'  d='M434.0,422.4 L434.0,413.4 M434.0,18.1 L434.0,27.1  '/>	<g transform="translate(434.0,444.3)" stroke="none" fill="black" font-family="Arial" font-size="12.00"  text-anchor="middle">
		<text><tspan font-family="Arial" > 0.2</tspan></text>
	</g>
</g>
<g fill="none" color="black" stroke="currentColor" stroke-width="1.00" stroke-linecap="butt" stroke-linejoin="miter">
	<path stroke='black'  d='M524.5,422.4 L524.5,413.4 M524.5,18.1 L524.5,27.1  '/>	<g transform="translate(524.5,444.3)" stroke="none" fill="black" font-family="Arial" font-size="12.00"  text-anchor="middle">
		<text><tspan font-family="Arial" > 0.25</tspan></text>
	</g>
</g>
<g fill="none" color="black" stroke="currentColor" stroke-width="1.00" stroke-linecap="butt" stroke-linejoin="miter">
	<path stroke='black'  d='M615.0,422.4 L615.0,413.4 M615.0,18.1 L615.0,27.1  '/>	<g transform="translate(615.0,444.3)" stroke="none" fill="black" font-family="Arial" font-size="12.00"  text-anchor="middle">
		<text><tspan font-family="Arial" > 0.3</tspan></text>
	</g>
</g>
<g fill="none" color="black" stroke="currentColor" stroke-width="1.00" stroke-linecap="butt" stroke-linejoin="miter">
</g>
<g fill="none" color="black" stroke="currentColor" stroke-width="1.00" stroke-linecap="butt" stroke-linejoin="miter">
	<path stroke='black'  d='M71.9,18.1 L71.9,422.4 L615.0,422.4 L615.0,18.1 L71.9,18.1 Z  '/></g>
<g fill="none" color="black" stroke="currentColor" stroke-width="1.00" stroke-linecap="butt" stroke-linejoin="miter">
	<g transform="translate(19.0,220.3) rotate(270)" stroke="none" fill="black" font-family="Arial" font-size="12.00"  text-anchor="middle">
		<text><tspan font-family="Arial" >Scaled occurence (1/max)</tspan></text>
	</g>
</g>
<g fill="none" color="black" stroke="currentColor" stroke-width="1.00" stroke-linecap="butt" stroke-linejoin="miter">
	<g transform="translate(343.4,471.3)" stroke="none" fill="black" font-family="Arial" font-size="12.00"  text-anchor="middle">
		<text><tspan font-family="Arial" >Normalised Error (0 to 1)</tspan></text>
	</g>
</g>
<g fill="none" color="black" stroke="currentColor" stroke-width="1.00" stroke-linecap="butt" stroke-linejoin="miter">
</g>
	<g id="gnuplot_plot_1" ><title>W = 4</title>
<g fill="none" color="black" stroke="currentColor" stroke-width="1.00" stroke-linecap="butt" stroke-linejoin="miter">
	<g transform="translate(547.9,40.0)" stroke="none" fill="black" font-family="Arial" font-size="12.00"  text-anchor="end">
		<text><tspan font-family="Arial" >W = 4</tspan></text>
	</g>
</g>
<g fill="none" color="black" stroke="currentColor" stroke-width="1.00" stroke-linecap="butt" stroke-linejoin="miter">
	<path stroke='rgb(148,   0, 211)'  d='M556.2,36.1 L598.4,36.1 M71.9,33.1 L73.0,27.2 L74.1,29.6 L75.2,18.1 L76.2,50.6 L77.3,40.5
		L78.4,36.6 L79.5,41.9 L80.6,42.6 L81.7,58.6 L82.8,53.4 L83.8,52.3 L84.9,73.0 L86.0,53.7
		L87.1,60.0 L88.2,104.8 L89.3,81.3 L90.4,82.7 L91.5,105.8 L92.5,85.5 L93.6,110.4 L94.7,110.0
		L95.8,103.0 L96.9,108.6 L98.0,106.9 L99.1,118.4 L100.1,114.9 L101.2,129.6 L102.3,138.0 L103.4,130.3
		L104.5,129.2 L105.6,131.3 L106.7,129.9 L107.7,133.4 L108.8,124.7 L109.9,147.4 L111.0,140.4 L112.1,151.9
		L113.2,118.7 L114.3,144.6 L115.3,148.1 L116.4,141.1 L117.5,145.3 L118.6,141.5 L119.7,149.5 L120.8,113.8
		L121.9,136.2 L123.0,148.8 L124.0,119.4 L125.1,140.8 L126.2,141.1 L127.3,131.7 L128.4,136.9 L129.5,149.5
		L130.6,134.5 L131.6,158.2 L132.7,145.6 L133.8,138.0 L134.9,132.4 L136.0,126.4 L137.1,133.8 L138.2,133.1
		L139.2,139.4 L140.3,157.9 L141.4,144.6 L142.5,142.5 L143.6,150.5 L144.7,151.6 L145.8,149.8 L146.8,150.5
		L147.9,175.0 L149.0,153.0 L150.1,156.1 L151.2,172.2 L152.3,164.9 L153.4,170.5 L154.5,174.6 L155.5,169.8
		L156.6,165.9 L157.7,160.0 L158.8,169.8 L159.9,168.4 L161.0,156.1 L162.1,168.4 L163.1,150.2 L164.2,169.4
		L165.3,161.0 L166.4,191.8 L167.5,164.5 L168.6,176.0 L169.7,175.3 L170.7,202.3 L171.8,181.6 L172.9,204.4
		L174.0,174.3 L175.1,177.1 L176.2,181.6 L177.3,189.0 L178.3,178.8 L179.4,190.7 L180.5,182.7 L181.6,177.1
		L182.7,161.0 L183.8,187.6 L184.9,184.8 L186.0,167.3 L187.0,181.3 L188.1,190.7 L189.2,191.1 L190.3,189.3
		L191.4,200.9 L192.5,192.1 L193.6,190.4 L194.6,200.9 L195.7,192.8 L196.8,201.6 L197.9,203.7 L199.0,196.3
		L200.1,215.2 L201.2,209.6 L202.2,206.4 L203.3,214.8 L204.4,229.2 L205.5,206.4 L206.6,205.0 L207.7,193.9
		L208.8,206.4 L209.8,219.4 L210.9,207.5 L212.0,218.7 L213.1,216.2 L214.2,221.5 L215.3,209.2 L216.4,221.5
		L217.5,219.0 L218.5,219.0 L219.6,212.4 L220.7,213.4 L221.8,225.0 L222.9,213.1 L224.0,215.2 L225.1,216.6
		L226.1,211.7 L227.2,230.2 L228.3,233.0 L229.4,217.6 L230.5,244.5 L231.6,227.4 L232.7,222.2 L233.7,225.0
		L234.8,221.8 L235.9,206.4 L237.0,207.8 L238.1,227.1 L239.2,236.5 L240.3,235.1 L241.3,211.3 L242.4,223.2
		L243.5,229.5 L244.6,219.0 L245.7,231.6 L246.8,230.6 L247.9,229.5 L249.0,215.9 L250.0,218.7 L251.1,216.2
		L252.2,227.8 L253.3,227.8 L254.4,233.7 L255.5,222.5 L256.6,235.1 L257.6,236.1 L258.7,232.0 L259.8,240.3
		L260.9,228.5 L262.0,249.1 L263.1,237.5 L264.2,236.1 L265.2,246.6 L266.3,232.3 L267.4,242.4 L268.5,241.0
		L269.6,249.8 L270.7,251.9 L271.8,237.2 L272.8,253.6 L273.9,232.7 L275.0,240.3 L276.1,237.5 L277.2,248.4
		L278.3,247.7 L279.4,240.3 L280.5,245.9 L281.5,233.0 L282.6,224.6 L283.7,258.2 L284.8,257.8 L285.9,249.4
		L287.0,234.8 L288.1,252.9 L289.1,248.7 L290.2,258.2 L291.3,240.7 L292.4,260.3 L293.5,241.0 L294.6,250.8
		L295.7,257.5 L296.7,258.9 L297.8,254.0 L298.9,252.6 L300.0,250.5 L301.1,259.6 L302.2,253.3 L303.3,243.8
		L304.3,262.0 L305.4,236.1 L306.5,237.2 L307.6,244.2 L308.7,249.1 L309.8,239.3 L310.9,251.2 L312.0,259.2
		L313.0,252.2 L314.1,248.7 L315.2,251.5 L316.3,252.9 L317.4,257.5 L318.5,266.9 L319.6,250.5 L320.6,258.9
		L321.7,252.6 L322.8,257.5 L323.9,254.3 L325.0,244.9 L326.1,248.7 L327.2,258.5 L328.2,258.9 L329.3,249.4
		L330.4,265.9 L331.5,249.8 L332.6,256.4 L333.7,256.8 L334.8,253.6 L335.8,257.5 L336.9,265.9 L338.0,284.7
		L339.1,261.7 L340.2,263.1 L341.3,270.7 L342.4,266.9 L343.4,280.9 L344.5,266.9 L345.6,284.7 L346.7,274.6
		L347.8,271.1 L348.9,283.3 L350.0,278.4 L351.1,279.8 L352.1,295.2 L353.2,283.3 L354.3,295.2 L355.4,286.5
		L356.5,277.7 L357.6,297.0 L358.7,284.0 L359.7,281.9 L360.8,284.4 L361.9,291.7 L363.0,274.6 L364.1,291.7
		L365.2,287.9 L366.3,303.9 L367.3,284.0 L368.4,288.9 L369.5,285.8 L370.6,299.4 L371.7,292.4 L372.8,287.5
		L373.9,288.2 L374.9,295.6 L376.0,276.0 L377.1,286.8 L378.2,292.8 L379.3,287.9 L380.4,288.6 L381.5,297.3
		L382.6,303.6 L383.6,291.7 L384.7,290.7 L385.8,280.2 L386.9,290.3 L388.0,287.9 L389.1,278.1 L390.2,286.1
		L391.2,300.8 L392.3,287.2 L393.4,293.5 L394.5,304.6 L395.6,277.4 L396.7,276.3 L397.8,291.7 L398.8,290.0
		L399.9,289.3 L401.0,289.3 L402.1,300.8 L403.2,293.5 L404.3,288.6 L405.4,279.8 L406.4,285.4 L407.5,276.0
		L408.6,289.6 L409.7,288.2 L410.8,300.1 L411.9,290.3 L413.0,288.9 L414.1,293.8 L415.1,281.6 L416.2,284.7
		L417.3,277.0 L418.4,293.1 L419.5,293.8 L420.6,294.2 L421.7,304.3 L422.7,298.7 L423.8,305.3 L424.9,307.8
		L426.0,313.4 L427.1,313.4 L428.2,316.2 L429.3,314.1 L430.3,306.7 L431.4,310.6 L432.5,308.8 L433.6,307.1
		L434.7,311.3 L435.8,313.0 L436.9,321.4 L437.9,324.9 L439.0,315.1 L440.1,319.0 L441.2,323.5 L442.3,319.7
		L443.4,315.8 L444.5,305.3 L445.6,318.3 L446.6,308.5 L447.7,308.1 L448.8,312.3 L449.9,317.6 L451.0,310.9
		L452.1,312.0 L453.2,324.6 L454.2,300.4 L455.3,313.0 L456.4,313.0 L457.5,312.0 L458.6,305.7 L459.7,303.6
		L460.8,301.1 L461.8,299.0 L462.9,304.3 L464.0,309.5 L465.1,306.7 L466.2,313.0 L467.3,304.3 L468.4,305.0
		L469.4,309.2 L470.5,293.1 L471.6,298.0 L472.7,287.5 L473.8,288.6 L474.9,300.8 L476.0,289.3 L477.1,294.2
		L478.1,288.6 L479.2,277.7 L480.3,299.7 L481.4,295.6 L482.5,294.9 L483.6,286.1 L484.7,297.0 L485.7,297.3
		L486.8,284.4 L487.9,299.7 L489.0,290.0 L490.1,274.9 L491.2,270.0 L492.3,281.6 L493.3,271.1 L494.4,272.8
		L495.5,266.6 L496.6,275.3 L497.7,278.1 L498.8,279.8 L499.9,283.3 L500.9,291.0 L502.0,293.5 L503.1,290.3
		L504.2,288.6 L505.3,300.1 L506.4,287.5 L507.5,298.7 L508.6,299.7 L509.6,295.2 L510.7,304.3 L511.8,305.7
		L512.9,300.8 L514.0,287.2 L515.1,304.6 L516.2,289.3 L517.2,302.9 L518.3,298.3 L519.4,298.3 L520.5,301.5
		L521.6,286.1 L522.7,288.2 L523.8,292.8 L524.8,296.3 L525.9,315.5 L527.0,314.8 L528.1,305.7 L529.2,315.8
		L530.3,310.6 L531.4,316.5 L532.4,325.3 L533.5,317.2 L534.6,323.9 L535.7,325.3 L536.8,321.1 L537.9,323.2
		L539.0,332.6 L540.1,334.3 L541.1,321.4 L542.2,327.4 L543.3,335.7 L544.4,337.5 L545.5,332.9 L546.6,338.2
		L547.7,332.2 L548.7,336.4 L549.8,342.7 L550.9,329.4 L552.0,342.4 L553.1,342.0 L554.2,344.5 L555.3,329.1
		L556.3,341.7 L557.4,344.5 L558.5,346.2 L559.6,344.8 L560.7,354.3 L561.8,348.7 L562.9,342.7 L563.9,349.4
		L565.0,355.0 L566.1,338.5 L567.2,352.2 L568.3,350.8 L569.4,351.1 L570.5,351.8 L571.6,348.0 L572.6,351.5
		L573.7,358.1 L574.8,348.3 L575.9,359.2 L577.0,351.8 L578.1,350.8 L579.2,351.5 L580.2,346.2 L581.3,357.1
		L582.4,356.0 L583.5,347.3 L584.6,349.7 L585.7,357.1 L586.8,348.3 L587.8,343.8 L588.9,355.3 L590.0,357.8
		L591.1,346.9 L592.2,344.1 L593.3,357.1 L594.4,340.6 L595.4,353.2 L596.5,359.9 L597.6,336.8 L598.7,345.2
		L599.8,354.3 L600.9,353.6 L602.0,336.4 L603.1,343.8 L604.1,343.4 L605.2,350.8 L606.3,352.9 L607.4,343.1
		L608.5,348.0 L609.6,348.0 L610.7,342.4 L611.7,345.2 L612.8,346.9 L613.9,347.6  '/></g>
	</g>
	<g id="gnuplot_plot_2" ><title>W = 6</title>
<g fill="none" color="black" stroke="currentColor" stroke-width="1.00" stroke-linecap="butt" stroke-linejoin="miter">
	<g transform="translate(547.9,58.0)" stroke="none" fill="black" font-family="Arial" font-size="12.00"  text-anchor="end">
		<text><tspan font-family="Arial" >W = 6</tspan></text>
	</g>
</g>
<g fill="none" color="black" stroke="currentColor" stroke-width="1.00" stroke-linecap="butt" stroke-linejoin="miter">
	<path stroke='rgb(  0, 158, 115)'  d='M556.2,54.1 L598.4,54.1 M71.9,338.9 L73.0,352.0 L74.1,354.2 L75.2,343.7 L76.2,347.7 L77.3,345.9
		L78.4,348.5 L79.5,345.9 L80.6,340.2 L81.7,350.7 L82.8,336.7 L83.8,345.5 L84.9,345.5 L86.0,343.7
		L87.1,338.0 L88.2,344.6 L89.3,345.0 L90.4,332.8 L91.5,334.1 L92.5,337.6 L93.6,328.4 L94.7,328.9
		L95.8,340.7 L96.9,342.4 L98.0,332.4 L99.1,342.4 L100.1,344.2 L101.2,324.9 L102.3,321.9 L103.4,335.9
		L104.5,328.4 L105.6,324.5 L106.7,328.9 L107.7,325.4 L108.8,313.6 L109.9,293.9 L111.0,312.3 L112.1,300.9
		L113.2,302.6 L114.3,306.1 L115.3,305.7 L116.4,293.9 L117.5,297.8 L118.6,277.3 L119.7,286.9 L120.8,277.3
		L121.9,279.5 L123.0,284.3 L124.0,258.5 L125.1,262.4 L126.2,272.9 L127.3,259.8 L128.4,265.9 L129.5,262.4
		L130.6,253.2 L131.6,249.8 L132.7,235.8 L133.8,217.8 L134.9,216.1 L136.0,222.2 L137.1,225.7 L138.2,201.7
		L139.2,214.8 L140.3,194.7 L141.4,189.0 L142.5,181.6 L143.6,198.6 L144.7,192.9 L145.8,183.3 L146.8,171.1
		L147.9,186.4 L149.0,158.4 L150.1,189.9 L151.2,191.6 L152.3,181.1 L153.4,175.0 L154.5,169.8 L155.5,159.7
		L156.6,171.5 L157.7,151.0 L158.8,180.3 L159.9,137.4 L161.0,155.8 L162.1,154.5 L163.1,146.2 L164.2,140.5
		L165.3,143.5 L166.4,152.3 L167.5,133.9 L168.6,156.2 L169.7,158.8 L170.7,144.4 L171.8,140.9 L172.9,147.9
		L174.0,145.3 L175.1,140.5 L176.2,114.3 L177.3,140.5 L178.3,119.9 L179.4,152.7 L180.5,145.7 L181.6,137.0
		L182.7,158.0 L183.8,136.5 L184.9,143.1 L186.0,127.4 L187.0,113.8 L188.1,135.2 L189.2,130.0 L190.3,116.9
		L191.4,139.6 L192.5,126.9 L193.6,137.9 L194.6,117.3 L195.7,118.6 L196.8,136.1 L197.9,133.1 L199.0,97.6
		L200.1,119.1 L201.2,121.3 L202.2,116.9 L203.3,141.4 L204.4,130.0 L205.5,121.3 L206.6,120.4 L207.7,110.3
		L208.8,113.4 L209.8,115.6 L210.9,125.2 L212.0,128.2 L213.1,115.6 L214.2,120.8 L215.3,134.8 L216.4,99.0
		L217.5,112.9 L218.5,106.8 L219.6,107.3 L220.7,127.4 L221.8,114.3 L222.9,128.2 L224.0,92.8 L225.1,124.7
		L226.1,119.5 L227.2,119.1 L228.3,134.8 L229.4,108.1 L230.5,131.7 L231.6,116.4 L232.7,106.0 L233.7,129.1
		L234.8,111.2 L235.9,115.1 L237.0,119.9 L238.1,110.3 L239.2,112.1 L240.3,90.2 L241.3,93.7 L242.4,83.2
		L243.5,92.0 L244.6,66.6 L245.7,92.0 L246.8,72.3 L247.9,93.3 L249.0,88.5 L250.0,77.1 L251.1,70.5
		L252.2,77.1 L253.3,67.5 L254.4,83.7 L255.5,78.9 L256.6,74.9 L257.6,79.7 L258.7,61.4 L259.8,90.7
		L260.9,70.5 L262.0,62.2 L263.1,71.0 L264.2,68.8 L265.2,65.7 L266.3,83.2 L267.4,68.4 L268.5,78.9
		L269.6,79.7 L270.7,84.1 L271.8,42.6 L272.8,94.6 L273.9,80.6 L275.0,52.6 L276.1,64.4 L277.2,60.5
		L278.3,59.2 L279.4,44.3 L280.5,44.3 L281.5,58.3 L282.6,42.6 L283.7,72.7 L284.8,71.9 L285.9,49.6
		L287.0,42.6 L288.1,55.7 L289.1,27.7 L290.2,29.0 L291.3,18.1 L292.4,23.3 L293.5,34.7 L294.6,30.8
		L295.7,24.7 L296.7,29.0 L297.8,46.9 L298.9,23.8 L300.0,21.6 L301.1,38.6 L302.2,26.8 L303.3,20.3
		L304.3,23.8 L305.4,19.0 L306.5,31.2 L307.6,52.6 L308.7,51.3 L309.8,53.1 L310.9,44.8 L312.0,50.4
		L313.0,33.8 L314.1,58.3 L315.2,49.1 L316.3,63.6 L317.4,49.6 L318.5,69.2 L319.6,55.3 L320.6,65.3
		L321.7,71.0 L322.8,80.6 L323.9,58.3 L325.0,34.3 L326.1,51.3 L327.2,73.6 L328.2,60.5 L329.3,58.3
		L330.4,69.7 L331.5,38.6 L332.6,74.0 L333.7,61.8 L334.8,53.9 L335.8,68.4 L336.9,94.2 L338.0,62.2
		L339.1,38.2 L340.2,55.3 L341.3,81.0 L342.4,44.8 L343.4,64.0 L344.5,65.7 L345.6,55.7 L346.7,60.5
		L347.8,50.0 L348.9,86.7 L350.0,72.3 L351.1,53.1 L352.1,64.9 L353.2,65.7 L354.3,69.7 L355.4,55.7
		L356.5,26.4 L357.6,83.2 L358.7,52.2 L359.7,37.3 L360.8,57.9 L361.9,56.6 L363.0,64.4 L364.1,64.9
		L365.2,76.2 L366.3,88.0 L367.3,85.4 L368.4,66.6 L369.5,98.5 L370.6,116.9 L371.7,90.2 L372.8,92.8
		L373.9,111.6 L374.9,113.8 L376.0,104.6 L377.1,118.6 L378.2,130.0 L379.3,121.7 L380.4,154.5 L381.5,120.8
		L382.6,148.8 L383.6,136.5 L384.7,132.2 L385.8,130.9 L386.9,143.5 L388.0,132.2 L389.1,121.7 L390.2,132.2
		L391.2,140.0 L392.3,144.0 L393.4,136.1 L394.5,163.2 L395.6,135.7 L396.7,128.2 L397.8,130.0 L398.8,146.2
		L399.9,141.8 L401.0,132.6 L402.1,143.5 L403.2,128.2 L404.3,136.1 L405.4,108.6 L406.4,125.2 L407.5,116.4
		L408.6,122.6 L409.7,117.8 L410.8,126.5 L411.9,127.8 L413.0,104.2 L414.1,90.2 L415.1,100.3 L416.2,80.2
		L417.3,78.0 L418.4,81.5 L419.5,80.2 L420.6,76.2 L421.7,75.8 L422.7,66.2 L423.8,92.8 L424.9,84.5
		L426.0,92.0 L427.1,92.4 L428.2,115.1 L429.3,92.4 L430.3,91.5 L431.4,121.3 L432.5,75.4 L433.6,68.8
		L434.7,68.4 L435.8,88.0 L436.9,74.0 L437.9,81.0 L439.0,88.0 L440.1,92.0 L441.2,74.5 L442.3,106.0
		L443.4,81.9 L444.5,89.3 L445.6,111.2 L446.6,102.0 L447.7,110.3 L448.8,139.6 L449.9,132.2 L451.0,128.7
		L452.1,125.6 L453.2,147.9 L454.2,154.5 L455.3,149.2 L456.4,143.5 L457.5,137.0 L458.6,146.6 L459.7,140.5
		L460.8,159.3 L461.8,166.3 L462.9,158.0 L464.0,160.6 L465.1,153.2 L466.2,159.7 L467.3,153.2 L468.4,182.4
		L469.4,203.9 L470.5,191.6 L471.6,200.8 L472.7,224.4 L473.8,223.5 L474.9,213.9 L476.0,228.8 L477.1,244.9
		L478.1,231.0 L479.2,251.1 L480.3,247.6 L481.4,267.7 L482.5,268.5 L483.6,280.3 L484.7,254.1 L485.7,285.2
		L486.8,301.8 L487.9,290.8 L489.0,290.4 L490.1,284.3 L491.2,291.3 L492.3,310.5 L493.3,301.8 L494.4,298.7
		L495.5,305.3 L496.6,323.6 L497.7,312.3 L498.8,300.5 L499.9,314.9 L500.9,319.7 L502.0,325.8 L503.1,327.6
		L504.2,340.2 L505.3,326.2 L506.4,323.2 L507.5,331.5 L508.6,335.4 L509.6,321.9 L510.7,336.7 L511.8,331.1
		L512.9,338.5 L514.0,341.1 L515.1,336.3 L516.2,338.0 L517.2,343.3 L518.3,337.6 L519.4,346.8 L520.5,338.5
		L521.6,351.6 L522.7,345.5 L523.8,347.2 L524.8,349.8 L525.9,349.4 L527.0,359.9 L528.1,356.0 L529.2,366.9
		L530.3,361.2 L531.4,362.5 L532.4,364.3 L533.5,365.6 L534.6,366.5 L535.7,363.0 L536.8,372.6 L537.9,367.8
		L539.0,376.5 L540.1,376.1 L541.1,367.8 L542.2,376.5 L543.3,373.9 L544.4,383.1 L545.5,367.8 L546.6,377.4
		L547.7,376.5 L548.7,383.1 L549.8,379.1 L550.9,377.4 L552.0,379.1 L553.1,380.9 L554.2,374.3 L555.3,378.7
		L556.3,383.1 L557.4,381.3 L558.5,374.8 L559.6,375.6 L560.7,377.8 L561.8,371.3 L562.9,368.2 L563.9,375.6
		L565.0,381.3 L566.1,381.3 L567.2,375.2 L568.3,372.1 L569.4,381.3 L570.5,380.4 L571.6,381.3 L572.6,386.6
		L573.7,391.8 L574.8,389.2 L575.9,390.5 L577.0,386.6 L578.1,389.6 L579.2,395.7 L580.2,392.7 L581.3,390.9
		L582.4,391.8 L583.5,390.1 L584.6,391.4 L585.7,392.7 L586.8,394.9 L587.8,392.2 L588.9,398.8 L590.0,392.7
		L591.1,394.4 L592.2,393.1 L593.3,401.0 L594.4,397.9 L595.4,390.9 L596.5,392.2 L597.6,385.7 L598.7,399.7
		L599.8,394.9 L600.9,397.9 L602.0,398.4 L603.1,397.5 L604.1,390.1 L605.2,395.3 L606.3,383.1 L607.4,390.5
		L608.5,385.2 L609.6,388.3 L610.7,390.1 L611.7,393.6 L612.8,396.2 L613.9,391.4  '/></g>
	</g>
	<g id="gnuplot_plot_3" ><title>W = 8</title>
<g fill="none" color="black" stroke="currentColor" stroke-width="1.00" stroke-linecap="butt" stroke-linejoin="miter">
	<g transform="translate(547.9,76.0)" stroke="none" fill="black" font-family="Arial" font-size="12.00"  text-anchor="end">
		<text><tspan font-family="Arial" >W = 8</tspan></text>
	</g>
</g>
<g fill="none" color="black" stroke="currentColor" stroke-width="1.00" stroke-linecap="butt" stroke-linejoin="miter">
	<path stroke='rgb( 86, 180, 233)'  d='M556.2,72.1 L598.4,72.1 M71.9,421.5 L73.0,421.5 L74.1,421.9 L75.2,421.5 L76.2,421.5 L77.3,421.2
		L78.4,420.0 L79.5,420.9 L80.6,418.0 L81.7,414.9 L82.8,415.6 L83.8,413.8 L84.9,414.6 L86.0,411.0
		L87.1,411.7 L88.2,408.0 L89.3,410.7 L90.4,406.5 L91.5,403.3 L92.5,402.0 L93.6,399.6 L94.7,397.9
		L95.8,394.8 L96.9,395.7 L98.0,393.9 L99.1,391.3 L100.1,384.7 L101.2,388.3 L102.3,385.0 L103.4,379.9
		L104.5,380.8 L105.6,374.9 L106.7,367.3 L107.7,369.2 L108.8,367.7 L109.9,366.5 L111.0,356.9 L112.1,363.1
		L113.2,360.0 L114.3,358.8 L115.3,348.3 L116.4,349.2 L117.5,351.5 L118.6,345.9 L119.7,340.8 L120.8,338.9
		L121.9,339.3 L123.0,336.2 L124.0,337.2 L125.1,334.8 L126.2,336.6 L127.3,327.0 L128.4,342.0 L129.5,333.8
		L130.6,327.1 L131.6,328.8 L132.7,325.0 L133.8,323.5 L134.9,323.1 L136.0,324.1 L137.1,327.6 L138.2,319.0
		L139.2,324.3 L140.3,311.8 L141.4,320.1 L142.5,310.8 L143.6,315.1 L144.7,314.7 L145.8,312.7 L146.8,305.7
		L147.9,307.3 L149.0,293.5 L150.1,298.2 L151.2,303.3 L152.3,304.3 L153.4,291.4 L154.5,290.2 L155.5,287.3
		L156.6,278.5 L157.7,280.3 L158.8,280.3 L159.9,265.8 L161.0,258.8 L162.1,251.3 L163.1,246.9 L164.2,237.8
		L165.3,229.0 L166.4,224.8 L167.5,209.8 L168.6,210.4 L169.7,203.6 L170.7,182.6 L171.8,186.7 L172.9,176.3
		L174.0,163.4 L175.1,162.0 L176.2,157.2 L177.3,148.7 L178.3,147.6 L179.4,137.4 L180.5,138.4 L181.6,142.8
		L182.7,150.6 L183.8,138.4 L184.9,128.4 L186.0,127.0 L187.0,131.7 L188.1,120.9 L189.2,132.1 L190.3,122.2
		L191.4,123.7 L192.5,120.6 L193.6,122.2 L194.6,115.2 L195.7,114.3 L196.8,119.4 L197.9,106.1 L199.0,133.5
		L200.1,114.4 L201.2,104.3 L202.2,118.2 L203.3,108.1 L204.4,111.1 L205.5,120.3 L206.6,101.2 L207.7,103.4
		L208.8,101.2 L209.8,104.9 L210.9,109.3 L212.0,107.5 L213.1,97.0 L214.2,101.9 L215.3,95.0 L216.4,91.0
		L217.5,98.8 L218.5,78.9 L219.6,80.9 L220.7,70.7 L221.8,81.2 L222.9,83.8 L224.0,72.2 L225.1,55.4
		L226.1,62.1 L227.2,77.3 L228.3,53.3 L229.4,59.0 L230.5,51.2 L231.6,33.1 L232.7,20.7 L233.7,33.0
		L234.8,38.4 L235.9,37.5 L237.0,31.5 L238.1,46.6 L239.2,35.5 L240.3,36.6 L241.3,26.5 L242.4,37.3
		L243.5,28.2 L244.6,18.1 L245.7,45.0 L246.8,39.6 L247.9,56.3 L249.0,54.5 L250.0,57.8 L251.1,77.3
		L252.2,78.6 L253.3,77.3 L254.4,83.0 L255.5,92.8 L256.6,109.4 L257.6,97.1 L258.7,116.2 L259.8,124.5
		L260.9,127.9 L262.0,150.3 L263.1,141.4 L264.2,163.1 L265.2,160.1 L266.3,175.1 L267.4,176.3 L268.5,187.4
		L269.6,206.5 L270.7,209.7 L271.8,232.6 L272.8,237.3 L273.9,249.2 L275.0,263.6 L276.1,271.7 L277.2,280.7
		L278.3,286.6 L279.4,295.0 L280.5,307.8 L281.5,318.3 L282.6,325.5 L283.7,333.3 L284.8,342.8 L285.9,347.6
		L287.0,358.1 L288.1,358.8 L289.1,367.6 L290.2,370.3 L291.3,372.4 L292.4,371.9 L293.5,376.9 L294.6,385.9
		L295.7,385.3 L296.7,387.4 L297.8,394.2 L298.9,397.2 L300.0,399.9 L301.1,402.1 L302.2,400.8 L303.3,405.0
		L304.3,404.7 L305.4,407.1 L306.5,411.6 L307.6,411.1 L308.7,413.5 L309.8,414.7 L310.9,413.8 L312.0,417.4
		L313.0,418.9 L314.1,418.8 L315.2,419.1 L316.3,418.3 L317.4,421.0 L318.5,419.8 L319.6,419.8 L320.6,420.3
		L321.7,420.9 L322.8,421.5 L323.9,421.5 L325.0,421.3 L326.1,422.1 L327.2,422.2 L328.2,422.1 L329.3,422.1
		L330.4,422.2 L331.5,422.2 L332.6,422.4 L333.7,422.4 L334.8,422.4 L335.8,422.4 L336.9,422.4 L338.0,422.4
		L339.1,422.4 L340.2,422.4 L341.3,422.4 L342.4,422.4 L343.4,422.4 L344.5,422.4 L345.6,422.4 L346.7,422.4
		L347.8,422.4 L348.9,422.4 L350.0,422.4 L351.1,422.4 L352.1,422.4 L353.2,422.4 L354.3,422.4 L355.4,422.4
		L356.5,422.4 L357.6,422.4 L358.7,422.4 L359.7,422.4 L360.8,422.4 L361.9,422.4 L363.0,422.4 L364.1,422.4
		L365.2,422.4 L366.3,422.4 L367.3,422.4 L368.4,422.4 L369.5,422.4 L370.6,422.4 L371.7,422.4 L372.8,422.4
		L373.9,422.4 L374.9,422.4 L376.0,422.4 L377.1,422.4 L378.2,422.4 L379.3,422.4 L380.4,422.4 L381.5,422.4
		L382.6,422.4 L383.6,422.4 L384.7,422.4 L385.8,422.4 L386.9,422.4 L388.0,422.4 L389.1,422.4 L390.2,422.4
		L391.2,422.4 L392.3,422.4 L393.4,422.4 L394.5,422.4 L395.6,422.4 L396.7,422.4 L397.8,422.4 L398.8,422.4
		L399.9,422.4 L401.0,422.4 L402.1,422.4 L403.2,422.4 L404.3,422.4 L405.4,422.4 L406.4,422.4 L407.5,422.4
		L408.6,422.4 L409.7,422.4 L410.8,422.4 L411.9,422.4 L413.0,422.4 L414.1,422.4 L415.1,422.4 L416.2,422.4
		L417.3,422.4 L418.4,422.4 L419.5,422.4 L420.6,422.4 L421.7,422.4 L422.7,422.4 L423.8,422.4 L424.9,422.4
		L426.0,422.4 L427.1,422.4 L428.2,422.4 L429.3,422.4 L430.3,422.4 L431.4,422.4 L432.5,422.4 L433.6,422.4
		L434.7,422.4 L435.8,422.4 L436.9,422.4 L437.9,422.4 L439.0,422.4 L440.1,422.4 L441.2,422.4 L442.3,422.4
		L443.4,422.4 L444.5,422.4 L445.6,422.4 L446.6,422.4 L447.7,422.4 L448.8,422.4 L449.9,422.4 L451.0,422.4
		L452.1,422.4 L453.2,422.4 L454.2,422.4 L455.3,422.4 L456.4,422.4 L457.5,422.4 L458.6,422.4 L459.7,422.4
		L460.8,422.4 L461.8,422.4 L462.9,422.4 L464.0,422.4 L465.1,422.4 L466.2,422.4 L467.3,422.4 L468.4,422.4
		L469.4,422.4 L470.5,422.4 L471.6,422.4 L472.7,422.4 L473.8,422.4 L474.9,422.4 L476.0,422.4 L477.1,422.4
		L478.1,422.4 L479.2,422.4 L480.3,422.4 L481.4,422.4 L482.5,422.4 L483.6,422.4 L484.7,422.4 L485.7,422.4
		L486.8,422.4 L487.9,422.4 L489.0,422.4 L490.1,422.4 L491.2,422.4 L492.3,422.4 L493.3,422.4 L494.4,422.4
		L495.5,422.4 L496.6,422.4 L497.7,422.4 L498.8,422.4 L499.9,422.4 L500.9,422.4 L502.0,422.4 L503.1,422.4
		L504.2,422.4 L505.3,422.4 L506.4,422.4 L507.5,422.4 L508.6,422.4 L509.6,422.4 L510.7,422.4 L511.8,422.4
		L512.9,422.4 L514.0,422.4 L515.1,422.4 L516.2,422.4 L517.2,422.4 L518.3,422.4 L519.4,422.4 L520.5,422.4
		L521.6,422.4 L522.7,422.4 L523.8,422.4 L524.8,422.4 L525.9,422.4 L527.0,422.4 L528.1,422.4 L529.2,422.4
		L530.3,422.4 L531.4,422.4 L532.4,422.4 L533.5,422.4 L534.6,422.4 L535.7,422.4 L536.8,422.4 L537.9,422.4
		L539.0,422.4 L540.1,422.4 L541.1,422.4 L542.2,422.4 L543.3,422.4 L544.4,422.4 L545.5,422.4 L546.6,422.4
		L547.7,422.4 L548.7,422.4 L549.8,422.4 L550.9,422.4 L552.0,422.4 L553.1,422.4 L554.2,422.4 L555.3,422.4
		L556.3,422.4 L557.4,422.4 L558.5,422.4 L559.6,422.4 L560.7,422.4 L561.8,422.4 L562.9,422.4 L563.9,422.4
		L565.0,422.4 L566.1,422.4 L567.2,422.4 L568.3,422.4 L569.4,422.4 L570.5,422.4 L571.6,422.4 L572.6,422.4
		L573.7,422.4 L574.8,422.4 L575.9,422.4 L577.0,422.4 L578.1,422.4 L579.2,422.4 L580.2,422.4 L581.3,422.4
		L582.4,422.4 L583.5,422.4 L584.6,422.4 L585.7,422.4 L586.8,422.4 L587.8,422.4 L588.9,422.4 L590.0,422.4
		L591.1,422.4 L592.2,422.4 L593.3,422.4 L594.4,422.4 L595.4,422.4 L596.5,422.4 L597.6,422.4 L598.7,422.4
		L599.8,422.4 L600.9,422.4 L602.0,422.4 L603.1,422.4 L604.1,422.4 L605.2,422.4 L606.3,422.4 L607.4,422.4
		L608.5,422.4 L609.6,422.4 L610.7,422.4 L611.7,422.4 L612.8,422.4 L613.9,422.4  '/></g>
	</g>
	<g id="gnuplot_plot_4" ><title>W = 10</title>
<g fill="none" color="black" stroke="currentColor" stroke-width="1.00" stroke-linecap="butt" stroke-linejoin="miter">
	<g transform="translate(547.9,94.0)" stroke="none" fill="black" font-family="Arial" font-size="12.00"  text-anchor="end">
		<text><tspan font-family="Arial" >W = 10</tspan></text>
	</g>
</g>
<g fill="none" color="black" stroke="currentColor" stroke-width="1.00" stroke-linecap="butt" stroke-linejoin="miter">
	<path stroke='rgb(230, 159,   0)'  d='M556.2,90.1 L598.4,90.1 M71.9,377.3 L73.0,375.3 L74.1,376.1 L75.2,370.4 L76.2,368.7 L77.3,366.5
		L78.4,364.8 L79.5,363.5 L80.6,358.4 L81.7,356.5 L82.8,352.4 L83.8,346.6 L84.9,337.8 L86.0,333.1
		L87.1,325.4 L88.2,310.1 L89.3,307.4 L90.4,299.1 L91.5,286.8 L92.5,282.9 L93.6,269.7 L94.7,265.9
		L95.8,254.3 L96.9,240.0 L98.0,217.8 L99.1,213.2 L100.1,192.3 L101.2,168.4 L102.3,153.0 L103.4,128.8
		L104.5,112.6 L105.6,86.2 L106.7,73.3 L107.7,61.1 L108.8,44.2 L109.9,38.8 L111.0,27.9 L112.1,18.3
		L113.2,28.5 L114.3,18.1 L115.3,23.9 L116.4,29.5 L117.5,28.3 L118.6,34.8 L119.7,38.0 L120.8,50.2
		L121.9,61.0 L123.0,72.6 L124.0,77.4 L125.1,102.5 L126.2,110.4 L127.3,117.4 L128.4,137.6 L129.5,146.3
		L130.6,167.8 L131.6,183.8 L132.7,201.7 L133.8,217.1 L134.9,244.1 L136.0,262.3 L137.1,285.9 L138.2,302.9
		L139.2,322.2 L140.3,339.7 L141.4,344.6 L142.5,359.2 L143.6,368.8 L144.7,373.3 L145.8,380.9 L146.8,387.7
		L147.9,395.2 L149.0,398.0 L150.1,402.5 L151.2,407.7 L152.3,410.4 L153.4,413.0 L154.5,415.1 L155.5,416.7
		L156.6,419.8 L157.7,420.0 L158.8,420.8 L159.9,421.1 L161.0,421.2 L162.1,422.0 L163.1,422.1 L164.2,422.2
		L165.3,422.4 L166.4,422.4 L167.5,422.4 L168.6,422.4 L169.7,422.4 L170.7,422.4 L171.8,422.4 L172.9,422.4
		L174.0,422.4 L175.1,422.4 L176.2,422.4 L177.3,422.4 L178.3,422.4 L179.4,422.4 L180.5,422.4 L181.6,422.4
		L182.7,422.4 L183.8,422.4 L184.9,422.4 L186.0,422.4 L187.0,422.4 L188.1,422.4 L189.2,422.4 L190.3,422.4
		L191.4,422.4 L192.5,422.4 L193.6,422.4 L194.6,422.4 L195.7,422.4 L196.8,422.4 L197.9,422.4 L199.0,422.4
		L200.1,422.4 L201.2,422.4 L202.2,422.4 L203.3,422.4 L204.4,422.4 L205.5,422.4 L206.6,422.4 L207.7,422.4
		L208.8,422.4 L209.8,422.4 L210.9,422.4 L212.0,422.4 L213.1,422.4 L214.2,422.4 L215.3,422.4 L216.4,422.4
		L217.5,422.4 L218.5,422.4 L219.6,422.4 L220.7,422.4 L221.8,422.4 L222.9,422.4 L224.0,422.4 L225.1,422.4
		L226.1,422.4 L227.2,422.4 L228.3,422.4 L229.4,422.4 L230.5,422.4 L231.6,422.4 L232.7,422.4 L233.7,422.4
		L234.8,422.4 L235.9,422.4 L237.0,422.4 L238.1,422.4 L239.2,422.4 L240.3,422.4 L241.3,422.4 L242.4,422.4
		L243.5,422.4 L244.6,422.4 L245.7,422.4 L246.8,422.4 L247.9,422.4 L249.0,422.4 L250.0,422.4 L251.1,422.4
		L252.2,422.4 L253.3,422.4 L254.4,422.4 L255.5,422.4 L256.6,422.4 L257.6,422.4 L258.7,422.4 L259.8,422.4
		L260.9,422.4 L262.0,422.4 L263.1,422.4 L264.2,422.4 L265.2,422.4 L266.3,422.4 L267.4,422.4 L268.5,422.4
		L269.6,422.4 L270.7,422.4 L271.8,422.4 L272.8,422.4 L273.9,422.4 L275.0,422.4 L276.1,422.4 L277.2,422.4
		L278.3,422.4 L279.4,422.4 L280.5,422.4 L281.5,422.4 L282.6,422.4 L283.7,422.4 L284.8,422.4 L285.9,422.4
		L287.0,422.4 L288.1,422.4 L289.1,422.4 L290.2,422.4 L291.3,422.4 L292.4,422.4 L293.5,422.4 L294.6,422.4
		L295.7,422.4 L296.7,422.4 L297.8,422.4 L298.9,422.4 L300.0,422.4 L301.1,422.4 L302.2,422.4 L303.3,422.4
		L304.3,422.4 L305.4,422.4 L306.5,422.4 L307.6,422.4 L308.7,422.4 L309.8,422.4 L310.9,422.4 L312.0,422.4
		L313.0,422.4 L314.1,422.4 L315.2,422.4 L316.3,422.4 L317.4,422.4 L318.5,422.4 L319.6,422.4 L320.6,422.4
		L321.7,422.4 L322.8,422.4 L323.9,422.4 L325.0,422.4 L326.1,422.4 L327.2,422.4 L328.2,422.4 L329.3,422.4
		L330.4,422.4 L331.5,422.4 L332.6,422.4 L333.7,422.4 L334.8,422.4 L335.8,422.4 L336.9,422.4 L338.0,422.4
		L339.1,422.4 L340.2,422.4 L341.3,422.4 L342.4,422.4 L343.4,422.4 L344.5,422.4 L345.6,422.4 L346.7,422.4
		L347.8,422.4 L348.9,422.4 L350.0,422.4 L351.1,422.4 L352.1,422.4 L353.2,422.4 L354.3,422.4 L355.4,422.4
		L356.5,422.4 L357.6,422.4 L358.7,422.4 L359.7,422.4 L360.8,422.4 L361.9,422.4 L363.0,422.4 L364.1,422.4
		L365.2,422.4 L366.3,422.4 L367.3,422.4 L368.4,422.4 L369.5,422.4 L370.6,422.4 L371.7,422.4 L372.8,422.4
		L373.9,422.4 L374.9,422.4 L376.0,422.4 L377.1,422.4 L378.2,422.4 L379.3,422.4 L380.4,422.4 L381.5,422.4
		L382.6,422.4 L383.6,422.4 L384.7,422.4 L385.8,422.4 L386.9,422.4 L388.0,422.4 L389.1,422.4 L390.2,422.4
		L391.2,422.4 L392.3,422.4 L393.4,422.4 L394.5,422.4 L395.6,422.4 L396.7,422.4 L397.8,422.4 L398.8,422.4
		L399.9,422.4 L401.0,422.4 L402.1,422.4 L403.2,422.4 L404.3,422.4 L405.4,422.4 L406.4,422.4 L407.5,422.4
		L408.6,422.4 L409.7,422.4 L410.8,422.4 L411.9,422.4 L413.0,422.4 L414.1,422.4 L415.1,422.4 L416.2,422.4
		L417.3,422.4 L418.4,422.4 L419.5,422.4 L420.6,422.4 L421.7,422.4 L422.7,422.4 L423.8,422.4 L424.9,422.4
		L426.0,422.4 L427.1,422.4 L428.2,422.4 L429.3,422.4 L430.3,422.4 L431.4,422.4 L432.5,422.4 L433.6,422.4
		L434.7,422.4 L435.8,422.4 L436.9,422.4 L437.9,422.4 L439.0,422.4 L440.1,422.4 L441.2,422.4 L442.3,422.4
		L443.4,422.4 L444.5,422.4 L445.6,422.4 L446.6,422.4 L447.7,422.4 L448.8,422.4 L449.9,422.4 L451.0,422.4
		L452.1,422.4 L453.2,422.4 L454.2,422.4 L455.3,422.4 L456.4,422.4 L457.5,422.4 L458.6,422.4 L459.7,422.4
		L460.8,422.4 L461.8,422.4 L462.9,422.4 L464.0,422.4 L465.1,422.4 L466.2,422.4 L467.3,422.4 L468.4,422.4
		L469.4,422.4 L470.5,422.4 L471.6,422.4 L472.7,422.4 L473.8,422.4 L474.9,422.4 L476.0,422.4 L477.1,422.4
		L478.1,422.4 L479.2,422.4 L480.3,422.4 L481.4,422.4 L482.5,422.4 L483.6,422.4 L484.7,422.4 L485.7,422.4
		L486.8,422.4 L487.9,422.4 L489.0,422.4 L490.1,422.4 L491.2,422.4 L492.3,422.4 L493.3,422.4 L494.4,422.4
		L495.5,422.4 L496.6,422.4 L497.7,422.4 L498.8,422.4 L499.9,422.4 L500.9,422.4 L502.0,422.4 L503.1,422.4
		L504.2,422.4 L505.3,422.4 L506.4,422.4 L507.5,422.4 L508.6,422.4 L509.6,422.4 L510.7,422.4 L511.8,422.4
		L512.9,422.4 L514.0,422.4 L515.1,422.4 L516.2,422.4 L517.2,422.4 L518.3,422.4 L519.4,422.4 L520.5,422.4
		L521.6,422.4 L522.7,422.4 L523.8,422.4 L524.8,422.4 L525.9,422.4 L527.0,422.4 L528.1,422.4 L529.2,422.4
		L530.3,422.4 L531.4,422.4 L532.4,422.4 L533.5,422.4 L534.6,422.4 L535.7,422.4 L536.8,422.4 L537.9,422.4
		L539.0,422.4 L540.1,422.4 L541.1,422.4 L542.2,422.4 L543.3,422.4 L544.4,422.4 L545.5,422.4 L546.6,422.4
		L547.7,422.4 L548.7,422.4 L549.8,422.4 L550.9,422.4 L552.0,422.4 L553.1,422.4 L554.2,422.4 L555.3,422.4
		L556.3,422.4 L557.4,422.4 L558.5,422.4 L559.6,422.4 L560.7,422.4 L561.8,422.4 L562.9,422.4 L563.9,422.4
		L565.0,422.4 L566.1,422.4 L567.2,422.4 L568.3,422.4 L569.4,422.4 L570.5,422.4 L571.6,422.4 L572.6,422.4
		L573.7,422.4 L574.8,422.4 L575.9,422.4 L577.0,422.4 L578.1,422.4 L579.2,422.4 L580.2,422.4 L581.3,422.4
		L582.4,422.4 L583.5,422.4 L584.6,422.4 L585.7,422.4 L586.8,422.4 L587.8,422.4 L588.9,422.4 L590.0,422.4
		L591.1,422.4 L592.2,422.4 L593.3,422.4 L594.4,422.4 L595.4,422.4 L596.5,422.4 L597.6,422.4 L598.7,422.4
		L599.8,422.4 L600.9,422.4 L602.0,422.4 L603.1,422.4 L604.1,422.4 L605.2,422.4 L606.3,422.4 L607.4,422.4
		L608.5,422.4 L609.6,422.4 L610.7,422.4 L611.7,422.4 L612.8,422.4 L613.9,422.4  '/></g>
	</g>
	<g id="gnuplot_plot_5" ><title>W = 12</title>
<g fill="none" color="black" stroke="currentColor" stroke-width="1.00" stroke-linecap="butt" stroke-linejoin="miter">
	<g transform="translate(547.9,112.0)" stroke="none" fill="black" font-family="Arial" font-size="12.00"  text-anchor="end">
		<text><tspan font-family="Arial" >W = 12</tspan></text>
	</g>
</g>
<g fill="none" color="black" stroke="currentColor" stroke-width="1.00" stroke-linecap="butt" stroke-linejoin="miter">
	<path stroke='rgb(240, 228,  66)'  d='M556.2,108.1 L598.4,108.1 M71.9,422.2 L73.0,420.6 L74.1,415.9 L75.2,406.1 L76.2,391.4 L77.3,369.3
		L78.4,346.7 L79.5,328.0 L80.6,304.5 L81.7,277.3 L82.8,244.6 L83.8,204.8 L84.9,168.8 L86.0,117.9
		L87.1,70.2 L88.2,37.1 L89.3,19.5 L90.4,18.1 L91.5,21.5 L92.5,46.0 L93.6,78.1 L94.7,127.4
		L95.8,174.9 L96.9,221.4 L98.0,269.7 L99.1,315.3 L100.1,360.2 L101.2,389.0 L102.3,402.0 L103.4,411.4
		L104.5,417.6 L105.6,420.8 L106.7,422.0 L107.7,422.4 L108.8,422.4 L109.9,422.4 L111.0,422.4 L112.1,422.4
		L113.2,422.4 L114.3,422.4 L115.3,422.4 L116.4,422.4 L117.5,422.4 L118.6,422.4 L119.7,422.4 L120.8,422.4
		L121.9,422.4 L123.0,422.4 L124.0,422.4 L125.1,422.4 L126.2,422.4 L127.3,422.4 L128.4,422.4 L129.5,422.4
		L130.6,422.4 L131.6,422.4 L132.7,422.4 L133.8,422.4 L134.9,422.4 L136.0,422.4 L137.1,422.4 L138.2,422.4
		L139.2,422.4 L140.3,422.4 L141.4,422.4 L142.5,422.4 L143.6,422.4 L144.7,422.4 L145.8,422.4 L146.8,422.4
		L147.9,422.4 L149.0,422.4 L150.1,422.4 L151.2,422.4 L152.3,422.4 L153.4,422.4 L154.5,422.4 L155.5,422.4
		L156.6,422.4 L157.7,422.4 L158.8,422.4 L159.9,422.4 L161.0,422.4 L162.1,422.4 L163.1,422.4 L164.2,422.4
		L165.3,422.4 L166.4,422.4 L167.5,422.4 L168.6,422.4 L169.7,422.4 L170.7,422.4 L171.8,422.4 L172.9,422.4
		L174.0,422.4 L175.1,422.4 L176.2,422.4 L177.3,422.4 L178.3,422.4 L179.4,422.4 L180.5,422.4 L181.6,422.4
		L182.7,422.4 L183.8,422.4 L184.9,422.4 L186.0,422.4 L187.0,422.4 L188.1,422.4 L189.2,422.4 L190.3,422.4
		L191.4,422.4 L192.5,422.4 L193.6,422.4 L194.6,422.4 L195.7,422.4 L196.8,422.4 L197.9,422.4 L199.0,422.4
		L200.1,422.4 L201.2,422.4 L202.2,422.4 L203.3,422.4 L204.4,422.4 L205.5,422.4 L206.6,422.4 L207.7,422.4
		L208.8,422.4 L209.8,422.4 L210.9,422.4 L212.0,422.4 L213.1,422.4 L214.2,422.4 L215.3,422.4 L216.4,422.4
		L217.5,422.4 L218.5,422.4 L219.6,422.4 L220.7,422.4 L221.8,422.4 L222.9,422.4 L224.0,422.4 L225.1,422.4
		L226.1,422.4 L227.2,422.4 L228.3,422.4 L229.4,422.4 L230.5,422.4 L231.6,422.4 L232.7,422.4 L233.7,422.4
		L234.8,422.4 L235.9,422.4 L237.0,422.4 L238.1,422.4 L239.2,422.4 L240.3,422.4 L241.3,422.4 L242.4,422.4
		L243.5,422.4 L244.6,422.4 L245.7,422.4 L246.8,422.4 L247.9,422.4 L249.0,422.4 L250.0,422.4 L251.1,422.4
		L252.2,422.4 L253.3,422.4 L254.4,422.4 L255.5,422.4 L256.6,422.4 L257.6,422.4 L258.7,422.4 L259.8,422.4
		L260.9,422.4 L262.0,422.4 L263.1,422.4 L264.2,422.4 L265.2,422.4 L266.3,422.4 L267.4,422.4 L268.5,422.4
		L269.6,422.4 L270.7,422.4 L271.8,422.4 L272.8,422.4 L273.9,422.4 L275.0,422.4 L276.1,422.4 L277.2,422.4
		L278.3,422.4 L279.4,422.4 L280.5,422.4 L281.5,422.4 L282.6,422.4 L283.7,422.4 L284.8,422.4 L285.9,422.4
		L287.0,422.4 L288.1,422.4 L289.1,422.4 L290.2,422.4 L291.3,422.4 L292.4,422.4 L293.5,422.4 L294.6,422.4
		L295.7,422.4 L296.7,422.4 L297.8,422.4 L298.9,422.4 L300.0,422.4 L301.1,422.4 L302.2,422.4 L303.3,422.4
		L304.3,422.4 L305.4,422.4 L306.5,422.4 L307.6,422.4 L308.7,422.4 L309.8,422.4 L310.9,422.4 L312.0,422.4
		L313.0,422.4 L314.1,422.4 L315.2,422.4 L316.3,422.4 L317.4,422.4 L318.5,422.4 L319.6,422.4 L320.6,422.4
		L321.7,422.4 L322.8,422.4 L323.9,422.4 L325.0,422.4 L326.1,422.4 L327.2,422.4 L328.2,422.4 L329.3,422.4
		L330.4,422.4 L331.5,422.4 L332.6,422.4 L333.7,422.4 L334.8,422.4 L335.8,422.4 L336.9,422.4 L338.0,422.4
		L339.1,422.4 L340.2,422.4 L341.3,422.4 L342.4,422.4 L343.4,422.4 L344.5,422.4 L345.6,422.4 L346.7,422.4
		L347.8,422.4 L348.9,422.4 L350.0,422.4 L351.1,422.4 L352.1,422.4 L353.2,422.4 L354.3,422.4 L355.4,422.4
		L356.5,422.4 L357.6,422.4 L358.7,422.4 L359.7,422.4 L360.8,422.4 L361.9,422.4 L363.0,422.4 L364.1,422.4
		L365.2,422.4 L366.3,422.4 L367.3,422.4 L368.4,422.4 L369.5,422.4 L370.6,422.4 L371.7,422.4 L372.8,422.4
		L373.9,422.4 L374.9,422.4 L376.0,422.4 L377.1,422.4 L378.2,422.4 L379.3,422.4 L380.4,422.4 L381.5,422.4
		L382.6,422.4 L383.6,422.4 L384.7,422.4 L385.8,422.4 L386.9,422.4 L388.0,422.4 L389.1,422.4 L390.2,422.4
		L391.2,422.4 L392.3,422.4 L393.4,422.4 L394.5,422.4 L395.6,422.4 L396.7,422.4 L397.8,422.4 L398.8,422.4
		L399.9,422.4 L401.0,422.4 L402.1,422.4 L403.2,422.4 L404.3,422.4 L405.4,422.4 L406.4,422.4 L407.5,422.4
		L408.6,422.4 L409.7,422.4 L410.8,422.4 L411.9,422.4 L413.0,422.4 L414.1,422.4 L415.1,422.4 L416.2,422.4
		L417.3,422.4 L418.4,422.4 L419.5,422.4 L420.6,422.4 L421.7,422.4 L422.7,422.4 L423.8,422.4 L424.9,422.4
		L426.0,422.4 L427.1,422.4 L428.2,422.4 L429.3,422.4 L430.3,422.4 L431.4,422.4 L432.5,422.4 L433.6,422.4
		L434.7,422.4 L435.8,422.4 L436.9,422.4 L437.9,422.4 L439.0,422.4 L440.1,422.4 L441.2,422.4 L442.3,422.4
		L443.4,422.4 L444.5,422.4 L445.6,422.4 L446.6,422.4 L447.7,422.4 L448.8,422.4 L449.9,422.4 L451.0,422.4
		L452.1,422.4 L453.2,422.4 L454.2,422.4 L455.3,422.4 L456.4,422.4 L457.5,422.4 L458.6,422.4 L459.7,422.4
		L460.8,422.4 L461.8,422.4 L462.9,422.4 L464.0,422.4 L465.1,422.4 L466.2,422.4 L467.3,422.4 L468.4,422.4
		L469.4,422.4 L470.5,422.4 L471.6,422.4 L472.7,422.4 L473.8,422.4 L474.9,422.4 L476.0,422.4 L477.1,422.4
		L478.1,422.4 L479.2,422.4 L480.3,422.4 L481.4,422.4 L482.5,422.4 L483.6,422.4 L484.7,422.4 L485.7,422.4
		L486.8,422.4 L487.9,422.4 L489.0,422.4 L490.1,422.4 L491.2,422.4 L492.3,422.4 L493.3,422.4 L494.4,422.4
		L495.5,422.4 L496.6,422.4 L497.7,422.4 L498.8,422.4 L499.9,422.4 L500.9,422.4 L502.0,422.4 L503.1,422.4
		L504.2,422.4 L505.3,422.4 L506.4,422.4 L507.5,422.4 L508.6,422.4 L509.6,422.4 L510.7,422.4 L511.8,422.4
		L512.9,422.4 L514.0,422.4 L515.1,422.4 L516.2,422.4 L517.2,422.4 L518.3,422.4 L519.4,422.4 L520.5,422.4
		L521.6,422.4 L522.7,422.4 L523.8,422.4 L524.8,422.4 L525.9,422.4 L527.0,422.4 L528.1,422.4 L529.2,422.4
		L530.3,422.4 L531.4,422.4 L532.4,422.4 L533.5,422.4 L534.6,422.4 L535.7,422.4 L536.8,422.4 L537.9,422.4
		L539.0,422.4 L540.1,422.4 L541.1,422.4 L542.2,422.4 L543.3,422.4 L544.4,422.4 L545.5,422.4 L546.6,422.4
		L547.7,422.4 L548.7,422.4 L549.8,422.4 L550.9,422.4 L552.0,422.4 L553.1,422.4 L554.2,422.4 L555.3,422.4
		L556.3,422.4 L557.4,422.4 L558.5,422.4 L559.6,422.4 L560.7,422.4 L561.8,422.4 L562.9,422.4 L563.9,422.4
		L565.0,422.4 L566.1,422.4 L567.2,422.4 L568.3,422.4 L569.4,422.4 L570.5,422.4 L571.6,422.4 L572.6,422.4
		L573.7,422.4 L574.8,422.4 L575.9,422.4 L577.0,422.4 L578.1,422.4 L579.2,422.4 L580.2,422.4 L581.3,422.4
		L582.4,422.4 L583.5,422.4 L584.6,422.4 L585.7,422.4 L586.8,422.4 L587.8,422.4 L588.9,422.4 L590.0,422.4
		L591.1,422.4 L592.2,422.4 L593.3,422.4 L594.4,422.4 L595.4,422.4 L596.5,422.4 L597.6,422.4 L598.7,422.4
		L599.8,422.4 L600.9,422.4 L602.0,422.4 L603.1,422.4 L604.1,422.4 L605.2,422.4 L606.3,422.4 L607.4,422.4
		L608.5,422.4 L609.6,422.4 L610.7,422.4 L611.7,422.4 L612.8,422.4 L613.9,422.4  '/></g>
	</g>
	<g id="gnuplot_plot_6" ><title>W = 14</title>
<g fill="none" color="black" stroke="currentColor" stroke-width="1.00" stroke-linecap="butt" stroke-linejoin="miter">
	<g transform="translate(547.9,130.0)" stroke="none" fill="black" font-family="Arial" font-size="12.00"  text-anchor="end">
		<text><tspan font-family="Arial" >W = 14</tspan></text>
	</g>
</g>
<g fill="none" color="black" stroke="currentColor" stroke-width="1.00" stroke-linecap="butt" stroke-linejoin="miter">
	<path stroke='rgb(  0, 114, 178)'  d='M556.2,126.1 L598.4,126.1 M71.9,422.3 L73.0,418.9 L74.1,395.6 L75.2,335.9 L76.2,181.1 L77.3,48.8
		L78.4,18.8 L79.5,18.1 L80.6,27.6 L81.7,63.3 L82.8,168.9 L83.8,336.7 L84.9,410.4 L86.0,421.8
		L87.1,422.4 L88.2,422.4 L89.3,422.4 L90.4,422.4 L91.5,422.4 L92.5,422.4 L93.6,422.4 L94.7,422.4
		L95.8,422.4 L96.9,422.4 L98.0,422.4 L99.1,422.4 L100.1,422.4 L101.2,422.4 L102.3,422.4 L103.4,422.4
		L104.5,422.4 L105.6,422.4 L106.7,422.4 L107.7,422.4 L108.8,422.4 L109.9,422.4 L111.0,422.4 L112.1,422.4
		L113.2,422.4 L114.3,422.4 L115.3,422.4 L116.4,422.4 L117.5,422.4 L118.6,422.4 L119.7,422.4 L120.8,422.4
		L121.9,422.4 L123.0,422.4 L124.0,422.4 L125.1,422.4 L126.2,422.4 L127.3,422.4 L128.4,422.4 L129.5,422.4
		L130.6,422.4 L131.6,422.4 L132.7,422.4 L133.8,422.4 L134.9,422.4 L136.0,422.4 L137.1,422.4 L138.2,422.4
		L139.2,422.4 L140.3,422.4 L141.4,422.4 L142.5,422.4 L143.6,422.4 L144.7,422.4 L145.8,422.4 L146.8,422.4
		L147.9,422.4 L149.0,422.4 L150.1,422.4 L151.2,422.4 L152.3,422.4 L153.4,422.4 L154.5,422.4 L155.5,422.4
		L156.6,422.4 L157.7,422.4 L158.8,422.4 L159.9,422.4 L161.0,422.4 L162.1,422.4 L163.1,422.4 L164.2,422.4
		L165.3,422.4 L166.4,422.4 L167.5,422.4 L168.6,422.4 L169.7,422.4 L170.7,422.4 L171.8,422.4 L172.9,422.4
		L174.0,422.4 L175.1,422.4 L176.2,422.4 L177.3,422.4 L178.3,422.4 L179.4,422.4 L180.5,422.4 L181.6,422.4
		L182.7,422.4 L183.8,422.4 L184.9,422.4 L186.0,422.4 L187.0,422.4 L188.1,422.4 L189.2,422.4 L190.3,422.4
		L191.4,422.4 L192.5,422.4 L193.6,422.4 L194.6,422.4 L195.7,422.4 L196.8,422.4 L197.9,422.4 L199.0,422.4
		L200.1,422.4 L201.2,422.4 L202.2,422.4 L203.3,422.4 L204.4,422.4 L205.5,422.4 L206.6,422.4 L207.7,422.4
		L208.8,422.4 L209.8,422.4 L210.9,422.4 L212.0,422.4 L213.1,422.4 L214.2,422.4 L215.3,422.4 L216.4,422.4
		L217.5,422.4 L218.5,422.4 L219.6,422.4 L220.7,422.4 L221.8,422.4 L222.9,422.4 L224.0,422.4 L225.1,422.4
		L226.1,422.4 L227.2,422.4 L228.3,422.4 L229.4,422.4 L230.5,422.4 L231.6,422.4 L232.7,422.4 L233.7,422.4
		L234.8,422.4 L235.9,422.4 L237.0,422.4 L238.1,422.4 L239.2,422.4 L240.3,422.4 L241.3,422.4 L242.4,422.4
		L243.5,422.4 L244.6,422.4 L245.7,422.4 L246.8,422.4 L247.9,422.4 L249.0,422.4 L250.0,422.4 L251.1,422.4
		L252.2,422.4 L253.3,422.4 L254.4,422.4 L255.5,422.4 L256.6,422.4 L257.6,422.4 L258.7,422.4 L259.8,422.4
		L260.9,422.4 L262.0,422.4 L263.1,422.4 L264.2,422.4 L265.2,422.4 L266.3,422.4 L267.4,422.4 L268.5,422.4
		L269.6,422.4 L270.7,422.4 L271.8,422.4 L272.8,422.4 L273.9,422.4 L275.0,422.4 L276.1,422.4 L277.2,422.4
		L278.3,422.4 L279.4,422.4 L280.5,422.4 L281.5,422.4 L282.6,422.4 L283.7,422.4 L284.8,422.4 L285.9,422.4
		L287.0,422.4 L288.1,422.4 L289.1,422.4 L290.2,422.4 L291.3,422.4 L292.4,422.4 L293.5,422.4 L294.6,422.4
		L295.7,422.4 L296.7,422.4 L297.8,422.4 L298.9,422.4 L300.0,422.4 L301.1,422.4 L302.2,422.4 L303.3,422.4
		L304.3,422.4 L305.4,422.4 L306.5,422.4 L307.6,422.4 L308.7,422.4 L309.8,422.4 L310.9,422.4 L312.0,422.4
		L313.0,422.4 L314.1,422.4 L315.2,422.4 L316.3,422.4 L317.4,422.4 L318.5,422.4 L319.6,422.4 L320.6,422.4
		L321.7,422.4 L322.8,422.4 L323.9,422.4 L325.0,422.4 L326.1,422.4 L327.2,422.4 L328.2,422.4 L329.3,422.4
		L330.4,422.4 L331.5,422.4 L332.6,422.4 L333.7,422.4 L334.8,422.4 L335.8,422.4 L336.9,422.4 L338.0,422.4
		L339.1,422.4 L340.2,422.4 L341.3,422.4 L342.4,422.4 L343.4,422.4 L344.5,422.4 L345.6,422.4 L346.7,422.4
		L347.8,422.4 L348.9,422.4 L350.0,422.4 L351.1,422.4 L352.1,422.4 L353.2,422.4 L354.3,422.4 L355.4,422.4
		L356.5,422.4 L357.6,422.4 L358.7,422.4 L359.7,422.4 L360.8,422.4 L361.9,422.4 L363.0,422.4 L364.1,422.4
		L365.2,422.4 L366.3,422.4 L367.3,422.4 L368.4,422.4 L369.5,422.4 L370.6,422.4 L371.7,422.4 L372.8,422.4
		L373.9,422.4 L374.9,422.4 L376.0,422.4 L377.1,422.4 L378.2,422.4 L379.3,422.4 L380.4,422.4 L381.5,422.4
		L382.6,422.4 L383.6,422.4 L384.7,422.4 L385.8,422.4 L386.9,422.4 L388.0,422.4 L389.1,422.4 L390.2,422.4
		L391.2,422.4 L392.3,422.4 L393.4,422.4 L394.5,422.4 L395.6,422.4 L396.7,422.4 L397.8,422.4 L398.8,422.4
		L399.9,422.4 L401.0,422.4 L402.1,422.4 L403.2,422.4 L404.3,422.4 L405.4,422.4 L406.4,422.4 L407.5,422.4
		L408.6,422.4 L409.7,422.4 L410.8,422.4 L411.9,422.4 L413.0,422.4 L414.1,422.4 L415.1,422.4 L416.2,422.4
		L417.3,422.4 L418.4,422.4 L419.5,422.4 L420.6,422.4 L421.7,422.4 L422.7,422.4 L423.8,422.4 L424.9,422.4
		L426.0,422.4 L427.1,422.4 L428.2,422.4 L429.3,422.4 L430.3,422.4 L431.4,422.4 L432.5,422.4 L433.6,422.4
		L434.7,422.4 L435.8,422.4 L436.9,422.4 L437.9,422.4 L439.0,422.4 L440.1,422.4 L441.2,422.4 L442.3,422.4
		L443.4,422.4 L444.5,422.4 L445.6,422.4 L446.6,422.4 L447.7,422.4 L448.8,422.4 L449.9,422.4 L451.0,422.4
		L452.1,422.4 L453.2,422.4 L454.2,422.4 L455.3,422.4 L456.4,422.4 L457.5,422.4 L458.6,422.4 L459.7,422.4
		L460.8,422.4 L461.8,422.4 L462.9,422.4 L464.0,422.4 L465.1,422.4 L466.2,422.4 L467.3,422.4 L468.4,422.4
		L469.4,422.4 L470.5,422.4 L471.6,422.4 L472.7,422.4 L473.8,422.4 L474.9,422.4 L476.0,422.4 L477.1,422.4
		L478.1,422.4 L479.2,422.4 L480.3,422.4 L481.4,422.4 L482.5,422.4 L483.6,422.4 L484.7,422.4 L485.7,422.4
		L486.8,422.4 L487.9,422.4 L489.0,422.4 L490.1,422.4 L491.2,422.4 L492.3,422.4 L493.3,422.4 L494.4,422.4
		L495.5,422.4 L496.6,422.4 L497.7,422.4 L498.8,422.4 L499.9,422.4 L500.9,422.4 L502.0,422.4 L503.1,422.4
		L504.2,422.4 L505.3,422.4 L506.4,422.4 L507.5,422.4 L508.6,422.4 L509.6,422.4 L510.7,422.4 L511.8,422.4
		L512.9,422.4 L514.0,422.4 L515.1,422.4 L516.2,422.4 L517.2,422.4 L518.3,422.4 L519.4,422.4 L520.5,422.4
		L521.6,422.4 L522.7,422.4 L523.8,422.4 L524.8,422.4 L525.9,422.4 L527.0,422.4 L528.1,422.4 L529.2,422.4
		L530.3,422.4 L531.4,422.4 L532.4,422.4 L533.5,422.4 L534.6,422.4 L535.7,422.4 L536.8,422.4 L537.9,422.4
		L539.0,422.4 L540.1,422.4 L541.1,422.4 L542.2,422.4 L543.3,422.4 L544.4,422.4 L545.5,422.4 L546.6,422.4
		L547.7,422.4 L548.7,422.4 L549.8,422.4 L550.9,422.4 L552.0,422.4 L553.1,422.4 L554.2,422.4 L555.3,422.4
		L556.3,422.4 L557.4,422.4 L558.5,422.4 L559.6,422.4 L560.7,422.4 L561.8,422.4 L562.9,422.4 L563.9,422.4
		L565.0,422.4 L566.1,422.4 L567.2,422.4 L568.3,422.4 L569.4,422.4 L570.5,422.4 L571.6,422.4 L572.6,422.4
		L573.7,422.4 L574.8,422.4 L575.9,422.4 L577.0,422.4 L578.1,422.4 L579.2,422.4 L580.2,422.4 L581.3,422.4
		L582.4,422.4 L583.5,422.4 L584.6,422.4 L585.7,422.4 L586.8,422.4 L587.8,422.4 L588.9,422.4 L590.0,422.4
		L591.1,422.4 L592.2,422.4 L593.3,422.4 L594.4,422.4 L595.4,422.4 L596.5,422.4 L597.6,422.4 L598.7,422.4
		L599.8,422.4 L600.9,422.4 L602.0,422.4 L603.1,422.4 L604.1,422.4 L605.2,422.4 L606.3,422.4 L607.4,422.4
		L608.5,422.4 L609.6,422.4 L610.7,422.4 L611.7,422.4 L612.8,422.4 L613.9,422.4  '/></g>
	</g>
	<g id="gnuplot_plot_7" ><title>W = 16</title>
<g fill="none" color="black" stroke="currentColor" stroke-width="1.00" stroke-linecap="butt" stroke-linejoin="miter">
	<g transform="translate(547.9,148.0)" stroke="none" fill="black" font-family="Arial" font-size="12.00"  text-anchor="end">
		<text><tspan font-family="Arial" >W = 16</tspan></text>
	</g>
</g>
<g fill="none" color="black" stroke="currentColor" stroke-width="1.00" stroke-linecap="butt" stroke-linejoin="miter">
	<path stroke='rgb(229,  30,  16)'  d='M556.2,144.1 L598.4,144.1 M71.9,386.6 L73.0,83.2 L74.1,21.9 L75.2,21.4 L76.2,21.7 L77.3,18.1
		L78.4,21.3 L79.5,192.7 L80.6,420.7 L81.7,422.4 L82.8,422.4 L83.8,422.4 L84.9,422.4 L86.0,422.4
		L87.1,422.4 L88.2,422.4 L89.3,422.4 L90.4,422.4 L91.5,422.4 L92.5,422.4 L93.6,422.4 L94.7,422.4
		L95.8,422.4 L96.9,422.4 L98.0,422.4 L99.1,422.4 L100.1,422.4 L101.2,422.4 L102.3,422.4 L103.4,422.4
		L104.5,422.4 L105.6,422.4 L106.7,422.4 L107.7,422.4 L108.8,422.4 L109.9,422.4 L111.0,422.4 L112.1,422.4
		L113.2,422.4 L114.3,422.4 L115.3,422.4 L116.4,422.4 L117.5,422.4 L118.6,422.4 L119.7,422.4 L120.8,422.4
		L121.9,422.4 L123.0,422.4 L124.0,422.4 L125.1,422.4 L126.2,422.4 L127.3,422.4 L128.4,422.4 L129.5,422.4
		L130.6,422.4 L131.6,422.4 L132.7,422.4 L133.8,422.4 L134.9,422.4 L136.0,422.4 L137.1,422.4 L138.2,422.4
		L139.2,422.4 L140.3,422.4 L141.4,422.4 L142.5,422.4 L143.6,422.4 L144.7,422.4 L145.8,422.4 L146.8,422.4
		L147.9,422.4 L149.0,422.4 L150.1,422.4 L151.2,422.4 L152.3,422.4 L153.4,422.4 L154.5,422.4 L155.5,422.4
		L156.6,422.4 L157.7,422.4 L158.8,422.4 L159.9,422.4 L161.0,422.4 L162.1,422.4 L163.1,422.4 L164.2,422.4
		L165.3,422.4 L166.4,422.4 L167.5,422.4 L168.6,422.4 L169.7,422.4 L170.7,422.4 L171.8,422.4 L172.9,422.4
		L174.0,422.4 L175.1,422.4 L176.2,422.4 L177.3,422.4 L178.3,422.4 L179.4,422.4 L180.5,422.4 L181.6,422.4
		L182.7,422.4 L183.8,422.4 L184.9,422.4 L186.0,422.4 L187.0,422.4 L188.1,422.4 L189.2,422.4 L190.3,422.4
		L191.4,422.4 L192.5,422.4 L193.6,422.4 L194.6,422.4 L195.7,422.4 L196.8,422.4 L197.9,422.4 L199.0,422.4
		L200.1,422.4 L201.2,422.4 L202.2,422.4 L203.3,422.4 L204.4,422.4 L205.5,422.4 L206.6,422.4 L207.7,422.4
		L208.8,422.4 L209.8,422.4 L210.9,422.4 L212.0,422.4 L213.1,422.4 L214.2,422.4 L215.3,422.4 L216.4,422.4
		L217.5,422.4 L218.5,422.4 L219.6,422.4 L220.7,422.4 L221.8,422.4 L222.9,422.4 L224.0,422.4 L225.1,422.4
		L226.1,422.4 L227.2,422.4 L228.3,422.4 L229.4,422.4 L230.5,422.4 L231.6,422.4 L232.7,422.4 L233.7,422.4
		L234.8,422.4 L235.9,422.4 L237.0,422.4 L238.1,422.4 L239.2,422.4 L240.3,422.4 L241.3,422.4 L242.4,422.4
		L243.5,422.4 L244.6,422.4 L245.7,422.4 L246.8,422.4 L247.9,422.4 L249.0,422.4 L250.0,422.4 L251.1,422.4
		L252.2,422.4 L253.3,422.4 L254.4,422.4 L255.5,422.4 L256.6,422.4 L257.6,422.4 L258.7,422.4 L259.8,422.4
		L260.9,422.4 L262.0,422.4 L263.1,422.4 L264.2,422.4 L265.2,422.4 L266.3,422.4 L267.4,422.4 L268.5,422.4
		L269.6,422.4 L270.7,422.4 L271.8,422.4 L272.8,422.4 L273.9,422.4 L275.0,422.4 L276.1,422.4 L277.2,422.4
		L278.3,422.4 L279.4,422.4 L280.5,422.4 L281.5,422.4 L282.6,422.4 L283.7,422.4 L284.8,422.4 L285.9,422.4
		L287.0,422.4 L288.1,422.4 L289.1,422.4 L290.2,422.4 L291.3,422.4 L292.4,422.4 L293.5,422.4 L294.6,422.4
		L295.7,422.4 L296.7,422.4 L297.8,422.4 L298.9,422.4 L300.0,422.4 L301.1,422.4 L302.2,422.4 L303.3,422.4
		L304.3,422.4 L305.4,422.4 L306.5,422.4 L307.6,422.4 L308.7,422.4 L309.8,422.4 L310.9,422.4 L312.0,422.4
		L313.0,422.4 L314.1,422.4 L315.2,422.4 L316.3,422.4 L317.4,422.4 L318.5,422.4 L319.6,422.4 L320.6,422.4
		L321.7,422.4 L322.8,422.4 L323.9,422.4 L325.0,422.4 L326.1,422.4 L327.2,422.4 L328.2,422.4 L329.3,422.4
		L330.4,422.4 L331.5,422.4 L332.6,422.4 L333.7,422.4 L334.8,422.4 L335.8,422.4 L336.9,422.4 L338.0,422.4
		L339.1,422.4 L340.2,422.4 L341.3,422.4 L342.4,422.4 L343.4,422.4 L344.5,422.4 L345.6,422.4 L346.7,422.4
		L347.8,422.4 L348.9,422.4 L350.0,422.4 L351.1,422.4 L352.1,422.4 L353.2,422.4 L354.3,422.4 L355.4,422.4
		L356.5,422.4 L357.6,422.4 L358.7,422.4 L359.7,422.4 L360.8,422.4 L361.9,422.4 L363.0,422.4 L364.1,422.4
		L365.2,422.4 L366.3,422.4 L367.3,422.4 L368.4,422.4 L369.5,422.4 L370.6,422.4 L371.7,422.4 L372.8,422.4
		L373.9,422.4 L374.9,422.4 L376.0,422.4 L377.1,422.4 L378.2,422.4 L379.3,422.4 L380.4,422.4 L381.5,422.4
		L382.6,422.4 L383.6,422.4 L384.7,422.4 L385.8,422.4 L386.9,422.4 L388.0,422.4 L389.1,422.4 L390.2,422.4
		L391.2,422.4 L392.3,422.4 L393.4,422.4 L394.5,422.4 L395.6,422.4 L396.7,422.4 L397.8,422.4 L398.8,422.4
		L399.9,422.4 L401.0,422.4 L402.1,422.4 L403.2,422.4 L404.3,422.4 L405.4,422.4 L406.4,422.4 L407.5,422.4
		L408.6,422.4 L409.7,422.4 L410.8,422.4 L411.9,422.4 L413.0,422.4 L414.1,422.4 L415.1,422.4 L416.2,422.4
		L417.3,422.4 L418.4,422.4 L419.5,422.4 L420.6,422.4 L421.7,422.4 L422.7,422.4 L423.8,422.4 L424.9,422.4
		L426.0,422.4 L427.1,422.4 L428.2,422.4 L429.3,422.4 L430.3,422.4 L431.4,422.4 L432.5,422.4 L433.6,422.4
		L434.7,422.4 L435.8,422.4 L436.9,422.4 L437.9,422.4 L439.0,422.4 L440.1,422.4 L441.2,422.4 L442.3,422.4
		L443.4,422.4 L444.5,422.4 L445.6,422.4 L446.6,422.4 L447.7,422.4 L448.8,422.4 L449.9,422.4 L451.0,422.4
		L452.1,422.4 L453.2,422.4 L454.2,422.4 L455.3,422.4 L456.4,422.4 L457.5,422.4 L458.6,422.4 L459.7,422.4
		L460.8,422.4 L461.8,422.4 L462.9,422.4 L464.0,422.4 L465.1,422.4 L466.2,422.4 L467.3,422.4 L468.4,422.4
		L469.4,422.4 L470.5,422.4 L471.6,422.4 L472.7,422.4 L473.8,422.4 L474.9,422.4 L476.0,422.4 L477.1,422.4
		L478.1,422.4 L479.2,422.4 L480.3,422.4 L481.4,422.4 L482.5,422.4 L483.6,422.4 L484.7,422.4 L485.7,422.4
		L486.8,422.4 L487.9,422.4 L489.0,422.4 L490.1,422.4 L491.2,422.4 L492.3,422.4 L493.3,422.4 L494.4,422.4
		L495.5,422.4 L496.6,422.4 L497.7,422.4 L498.8,422.4 L499.9,422.4 L500.9,422.4 L502.0,422.4 L503.1,422.4
		L504.2,422.4 L505.3,422.4 L506.4,422.4 L507.5,422.4 L508.6,422.4 L509.6,422.4 L510.7,422.4 L511.8,422.4
		L512.9,422.4 L514.0,422.4 L515.1,422.4 L516.2,422.4 L517.2,422.4 L518.3,422.4 L519.4,422.4 L520.5,422.4
		L521.6,422.4 L522.7,422.4 L523.8,422.4 L524.8,422.4 L525.9,422.4 L527.0,422.4 L528.1,422.4 L529.2,422.4
		L530.3,422.4 L531.4,422.4 L532.4,422.4 L533.5,422.4 L534.6,422.4 L535.7,422.4 L536.8,422.4 L537.9,422.4
		L539.0,422.4 L540.1,422.4 L541.1,422.4 L542.2,422.4 L543.3,422.4 L544.4,422.4 L545.5,422.4 L546.6,422.4
		L547.7,422.4 L548.7,422.4 L549.8,422.4 L550.9,422.4 L552.0,422.4 L553.1,422.4 L554.2,422.4 L555.3,422.4
		L556.3,422.4 L557.4,422.4 L558.5,422.4 L559.6,422.4 L560.7,422.4 L561.8,422.4 L562.9,422.4 L563.9,422.4
		L565.0,422.4 L566.1,422.4 L567.2,422.4 L568.3,422.4 L569.4,422.4 L570.5,422.4 L571.6,422.4 L572.6,422.4
		L573.7,422.4 L574.8,422.4 L575.9,422.4 L577.0,422.4 L578.1,422.4 L579.2,422.4 L580.2,422.4 L581.3,422.4
		L582.4,422.4 L583.5,422.4 L584.6,422.4 L585.7,422.4 L586.8,422.4 L587.8,422.4 L588.9,422.4 L590.0,422.4
		L591.1,422.4 L592.2,422.4 L593.3,422.4 L594.4,422.4 L595.4,422.4 L596.5,422.4 L597.6,422.4 L598.7,422.4
		L599.8,422.4 L600.9,422.4 L602.0,422.4 L603.1,422.4 L604.1,422.4 L605.2,422.4 L606.3,422.4 L607.4,422.4
		L608.5,422.4 L609.6,422.4 L610.7,422.4 L611.7,422.4 L612.8,422.4 L613.9,422.4  '/></g>
	</g>
<g fill="none" color="white" stroke="rgb(229,  30,  16)" stroke-width="2.00" stroke-linecap="butt" stroke-linejoin="miter">
</g>
<g fill="none" color="black" stroke="currentColor" stroke-width="2.00" stroke-linecap="butt" stroke-linejoin="miter">
</g>
<g fill="none" color="black" stroke="black" stroke-width="1.00" stroke-linecap="butt" stroke-linejoin="miter">
</g>
<g fill="none" color="black" stroke="currentColor" stroke-width="1.00" stroke-linecap="butt" stroke-linejoin="miter">
	<path stroke='black'  d='M71.9,18.1 L71.9,422.4 L615.0,422.4 L615.0,18.1 L71.9,18.1 Z  '/></g>
<g fill="none" color="black" stroke="currentColor" stroke-width="1.00" stroke-linecap="butt" stroke-linejoin="miter">
</g>
</g>
</svg>

