<?xml version="1.0" encoding="utf-8"  standalone="no"?>
<svg 
 width="640" height="480"
 viewBox="0 0 640 480"
 xmlns="http://www.w3.org/2000/svg"
 xmlns:xlink="http://www.w3.org/1999/xlink"
>

<title>Gnuplot</title>
<desc>Produced by GNUPLOT 5.2 patchlevel 8 </desc>

<g id="gnuplot_canvas">

<rect x="0" y="0" width="640" height="480" fill="none"/>
<defs>

	<circle id='gpDot' r='0.5' stroke-width='0.5' stroke='currentColor'/>
	<path id='gpPt0' stroke-width='0.222' stroke='currentColor' d='M-1,0 h2 M0,-1 v2'/>
	<path id='gpPt1' stroke-width='0.222' stroke='currentColor' d='M-1,-1 L1,1 M1,-1 L-1,1'/>
	<path id='gpPt2' stroke-width='0.222' stroke='currentColor' d='M-1,0 L1,0 M0,-1 L0,1 M-1,-1 L1,1 M-1,1 L1,-1'/>
	<rect id='gpPt3' stroke-width='0.222' stroke='currentColor' x='-1' y='-1' width='2' height='2'/>
	<rect id='gpPt4' stroke-width='0.222' stroke='currentColor' fill='currentColor' x='-1' y='-1' width='2' height='2'/>
	<circle id='gpPt5' stroke-width='0.222' stroke='currentColor' cx='0' cy='0' r='1'/>
	<use xlink:href='#gpPt5' id='gpPt6' fill='currentColor' stroke='none'/>
	<path id='gpPt7' stroke-width='0.222' stroke='currentColor' d='M0,-1.33 L-1.33,0.67 L1.33,0.67 z'/>
	<use xlink:href='#gpPt7' id='gpPt8' fill='currentColor' stroke='none'/>
	<use xlink:href='#gpPt7' id='gpPt9' stroke='currentColor' transform='rotate(180)'/>
	<use xlink:href='#gpPt9' id='gpPt10' fill='currentColor' stroke='none'/>
	<use xlink:href='#gpPt3' id='gpPt11' stroke='currentColor' transform='rotate(45)'/>
	<use xlink:href='#gpPt11' id='gpPt12' fill='currentColor' stroke='none'/>
	<path id='gpPt13' stroke-width='0.222' stroke='currentColor' d='M0,1.330 L1.265,0.411 L0.782,-1.067 L-0.782,-1.076 L-1.265,0.411 z'/>
	<use xlink:href='#gpPt13' id='gpPt14' fill='currentColor' stroke='none'/>
	<filter id='textbox' filterUnits='objectBoundingBox' x='0' y='0' height='1' width='1'>
	  <feFlood flood-color='white' flood-opacity='1' result='bgnd'/>
	  <feComposite in='SourceGraphic' in2='bgnd' operator='atop'/>
	</filter>
	<filter id='greybox' filterUnits='objectBoundingBox' x='0' y='0' height='1' width='1'>
	  <feFlood flood-color='lightgrey' flood-opacity='1' result='grey'/>
	  <feComposite in='SourceGraphic' in2='grey' operator='atop'/>
	</filter>
</defs>
<g fill="none" color="white" stroke="currentColor" stroke-width="1.00" stroke-linecap="butt" stroke-linejoin="miter">
</g>
<g fill="none" color="black" stroke="currentColor" stroke-width="1.00" stroke-linecap="butt" stroke-linejoin="miter">
	<path stroke='black'  d='M71.9,422.4 L80.9,422.4 M615.0,422.4 L606.0,422.4  '/>	<g transform="translate(63.6,426.3)" stroke="none" fill="black" font-family="Arial" font-size="12.00"  text-anchor="end">
		<text><tspan font-family="Arial" > 0</tspan></text>
	</g>
</g>
<g fill="none" color="black" stroke="currentColor" stroke-width="1.00" stroke-linecap="butt" stroke-linejoin="miter">
	<path stroke='black'  d='M71.9,341.5 L80.9,341.5 M615.0,341.5 L606.0,341.5  '/>	<g transform="translate(63.6,345.4)" stroke="none" fill="black" font-family="Arial" font-size="12.00"  text-anchor="end">
		<text><tspan font-family="Arial" > 0.2</tspan></text>
	</g>
</g>
<g fill="none" color="black" stroke="currentColor" stroke-width="1.00" stroke-linecap="butt" stroke-linejoin="miter">
	<path stroke='black'  d='M71.9,260.7 L80.9,260.7 M615.0,260.7 L606.0,260.7  '/>	<g transform="translate(63.6,264.6)" stroke="none" fill="black" font-family="Arial" font-size="12.00"  text-anchor="end">
		<text><tspan font-family="Arial" > 0.4</tspan></text>
	</g>
</g>
<g fill="none" color="black" stroke="currentColor" stroke-width="1.00" stroke-linecap="butt" stroke-linejoin="miter">
	<path stroke='black'  d='M71.9,179.8 L80.9,179.8 M615.0,179.8 L606.0,179.8  '/>	<g transform="translate(63.6,183.7)" stroke="none" fill="black" font-family="Arial" font-size="12.00"  text-anchor="end">
		<text><tspan font-family="Arial" > 0.6</tspan></text>
	</g>
</g>
<g fill="none" color="black" stroke="currentColor" stroke-width="1.00" stroke-linecap="butt" stroke-linejoin="miter">
	<path stroke='black'  d='M71.9,99.0 L80.9,99.0 M615.0,99.0 L606.0,99.0  '/>	<g transform="translate(63.6,102.9)" stroke="none" fill="black" font-family="Arial" font-size="12.00"  text-anchor="end">
		<text><tspan font-family="Arial" > 0.8</tspan></text>
	</g>
</g>
<g fill="none" color="black" stroke="currentColor" stroke-width="1.00" stroke-linecap="butt" stroke-linejoin="miter">
	<path stroke='black'  d='M71.9,18.1 L80.9,18.1 M615.0,18.1 L606.0,18.1  '/>	<g transform="translate(63.6,22.0)" stroke="none" fill="black" font-family="Arial" font-size="12.00"  text-anchor="end">
		<text><tspan font-family="Arial" > 1</tspan></text>
	</g>
</g>
<g fill="none" color="black" stroke="currentColor" stroke-width="1.00" stroke-linecap="butt" stroke-linejoin="miter">
	<path stroke='black'  d='M71.9,422.4 L71.9,413.4 M71.9,18.1 L71.9,27.1  '/>	<g transform="translate(71.9,444.3)" stroke="none" fill="black" font-family="Arial" font-size="12.00"  text-anchor="middle">
		<text><tspan font-family="Arial" > 0</tspan></text>
	</g>
</g>
<g fill="none" color="black" stroke="currentColor" stroke-width="1.00" stroke-linecap="butt" stroke-linejoin="miter">
	<path stroke='black'  d='M162.4,422.4 L162.4,413.4 M162.4,18.1 L162.4,27.1  '/>	<g transform="translate(162.4,444.3)" stroke="none" fill="black" font-family="Arial" font-size="12.00"  text-anchor="middle">
		<text><tspan font-family="Arial" > 0.05</tspan></text>
	</g>
</g>
<g fill="none" color="black" stroke="currentColor" stroke-width="1.00" stroke-linecap="butt" stroke-linejoin="miter">
	<path stroke='black'  d='M252.9,422.4 L252.9,413.4 M252.9,18.1 L252.9,27.1  '/>	<g transform="translate(252.9,444.3)" stroke="none" fill="black" font-family="Arial" font-size="12.00"  text-anchor="middle">
		<text><tspan font-family="Arial" > 0.1</tspan></text>
	</g>
</g>
<g fill="none" color="black" stroke="currentColor" stroke-width="1.00" stroke-linecap="butt" stroke-linejoin="miter">
	<path stroke='black'  d='M343.5,422.4 L343.5,413.4 M343.5,18.1 L343.5,27.1  '/>	<g transform="translate(343.5,444.3)" stroke="none" fill="black" font-family="Arial" font-size="12.00"  text-anchor="middle">
		<text><tspan font-family="Arial" > 0.15</tspan></text>
	</g>
</g>
<g fill="none" color="black" stroke="currentColor" stroke-width="1.00" stroke-linecap="butt" stroke-linejoin="miter">
	<path stroke='black'  d='M434.0,422.4 L434.0,413.4 M434.0,18.1 L434.0,27.1  '/>	<g transform="translate(434.0,444.3)" stroke="none" fill="black" font-family="Arial" font-size="12.00"  text-anchor="middle">
		<text><tspan font-family="Arial" > 0.2</tspan></text>
	</g>
</g>
<g fill="none" color="black" stroke="currentColor" stroke-width="1.00" stroke-linecap="butt" stroke-linejoin="miter">
	<path stroke='black'  d='M524.5,422.4 L524.5,413.4 M524.5,18.1 L524.5,27.1  '/>	<g transform="translate(524.5,444.3)" stroke="none" fill="black" font-family="Arial" font-size="12.00"  text-anchor="middle">
		<text><tspan font-family="Arial" > 0.25</tspan></text>
	</g>
</g>
<g fill="none" color="black" stroke="currentColor" stroke-width="1.00" stroke-linecap="butt" stroke-linejoin="miter">
	<path stroke='black'  d='M615.0,422.4 L615.0,413.4 M615.0,18.1 L615.0,27.1  '/>	<g transform="translate(615.0,444.3)" stroke="none" fill="black" font-family="Arial" font-size="12.00"  text-anchor="middle">
		<text><tspan font-family="Arial" > 0.3</tspan></text>
	</g>
</g>
<g fill="none" color="black" stroke="currentColor" stroke-width="1.00" stroke-linecap="butt" stroke-linejoin="miter">
</g>
<g fill="none" color="black" stroke="currentColor" stroke-width="1.00" stroke-linecap="butt" stroke-linejoin="miter">
	<path stroke='black'  d='M71.9,18.1 L71.9,422.4 L615.0,422.4 L615.0,18.1 L71.9,18.1 Z  '/></g>
<g fill="none" color="black" stroke="currentColor" stroke-width="1.00" stroke-linecap="butt" stroke-linejoin="miter">
	<g transform="translate(19.0,220.3) rotate(270)" stroke="none" fill="black" font-family="Arial" font-size="12.00"  text-anchor="middle">
		<text><tspan font-family="Arial" >Scaled occurence (1/max)</tspan></text>
	</g>
</g>
<g fill="none" color="black" stroke="currentColor" stroke-width="1.00" stroke-linecap="butt" stroke-linejoin="miter">
	<g transform="translate(343.4,471.3)" stroke="none" fill="black" font-family="Arial" font-size="12.00"  text-anchor="middle">
		<text><tspan font-family="Arial" >Normalised Error (0 to 1)</tspan></text>
	</g>
</g>
<g fill="none" color="black" stroke="currentColor" stroke-width="1.00" stroke-linecap="butt" stroke-linejoin="miter">
</g>
	<g id="gnuplot_plot_1" ><title>W = 4</title>
<g fill="none" color="black" stroke="currentColor" stroke-width="1.00" stroke-linecap="butt" stroke-linejoin="miter">
	<g transform="translate(547.9,40.0)" stroke="none" fill="black" font-family="Arial" font-size="12.00"  text-anchor="end">
		<text><tspan font-family="Arial" >W = 4</tspan></text>
	</g>
</g>
<g fill="none" color="black" stroke="currentColor" stroke-width="1.00" stroke-linecap="butt" stroke-linejoin="miter">
	<path stroke='rgb(148,   0, 211)'  d='M556.2,36.1 L598.4,36.1 M71.9,421.7 L73.0,422.4 L74.1,421.0 L75.2,421.0 L76.2,419.6 L77.3,419.6
		L78.4,418.9 L79.5,422.4 L80.6,418.2 L81.7,418.9 L82.8,421.0 L83.8,420.3 L84.9,418.9 L86.0,415.4
		L87.1,416.8 L88.2,414.0 L89.3,418.9 L90.4,414.0 L91.5,414.0 L92.5,407.7 L93.6,411.2 L94.7,402.8
		L95.8,412.6 L96.9,411.2 L98.0,402.1 L99.1,408.4 L100.1,390.2 L101.2,402.8 L102.3,390.2 L103.4,400.0
		L104.5,381.8 L105.6,395.1 L106.7,384.6 L107.7,398.6 L108.8,378.3 L109.9,400.7 L111.0,397.2 L112.1,382.5
		L113.2,395.8 L114.3,376.2 L115.3,384.6 L116.4,371.2 L117.5,376.9 L118.6,370.5 L119.7,374.8 L120.8,369.8
		L121.9,386.0 L123.0,387.4 L124.0,369.8 L125.1,372.7 L126.2,364.2 L127.3,379.0 L128.4,356.5 L129.5,376.9
		L130.6,346.0 L131.6,368.4 L132.7,355.1 L133.8,373.4 L134.9,367.0 L136.0,329.9 L137.1,372.7 L138.2,346.7
		L139.2,368.4 L140.3,340.4 L141.4,364.9 L142.5,328.5 L143.6,365.6 L144.7,340.4 L145.8,357.9 L146.8,322.2
		L147.9,362.1 L149.0,367.0 L150.1,328.5 L151.2,348.8 L152.3,314.5 L153.4,355.1 L154.5,329.2 L155.5,348.1
		L156.6,311.0 L157.7,357.2 L158.8,318.0 L159.9,350.2 L161.0,353.7 L162.1,322.9 L163.1,362.8 L164.2,327.1
		L165.3,361.4 L166.4,325.7 L167.5,359.3 L168.6,325.7 L169.7,351.6 L170.7,309.6 L171.8,355.1 L172.9,300.5
		L174.0,343.2 L175.1,348.8 L176.2,315.9 L177.3,345.3 L178.3,318.7 L179.4,341.8 L180.5,303.3 L181.6,349.5
		L182.7,305.4 L183.8,346.7 L184.9,301.2 L186.0,354.4 L187.0,339.7 L188.1,299.8 L189.2,334.1 L190.3,309.6
		L191.4,332.0 L192.5,320.8 L193.6,348.8 L194.6,301.9 L195.7,341.1 L196.8,304.7 L197.9,329.2 L199.0,350.9
		L200.1,299.8 L201.2,334.1 L202.2,288.6 L203.3,341.8 L204.4,290.7 L205.5,340.4 L206.6,297.0 L207.7,333.4
		L208.8,292.8 L209.8,320.8 L210.9,290.0 L212.0,337.6 L213.1,344.6 L214.2,285.1 L215.3,334.8 L216.4,297.0
		L217.5,345.3 L218.5,294.2 L219.6,331.3 L220.7,285.8 L221.8,325.7 L222.9,293.5 L224.0,344.6 L225.1,340.4
		L226.1,279.5 L227.2,338.3 L228.3,269.6 L229.4,322.9 L230.5,290.7 L231.6,325.7 L232.7,276.7 L233.7,322.2
		L234.8,272.5 L235.9,329.9 L237.0,278.8 L238.1,314.5 L239.2,325.0 L240.3,278.8 L241.3,315.2 L242.4,280.2
		L243.5,316.6 L244.6,252.8 L245.7,319.4 L246.8,285.1 L247.9,305.4 L249.0,271.1 L250.0,318.7 L251.1,323.6
		L252.2,264.7 L253.3,316.6 L254.4,241.6 L255.5,313.1 L256.6,245.8 L257.6,315.9 L258.7,259.1 L259.8,319.4
		L260.9,261.2 L262.0,308.2 L263.1,310.3 L264.2,257.7 L265.2,296.3 L266.3,246.5 L267.4,316.6 L268.5,264.7
		L269.6,302.6 L270.7,243.7 L271.8,308.9 L272.8,243.7 L273.9,304.0 L275.0,239.5 L276.1,303.3 L277.2,287.9
		L278.3,235.3 L279.4,295.6 L280.5,249.3 L281.5,288.6 L282.6,222.0 L283.7,313.8 L284.8,251.4 L285.9,301.9
		L287.0,237.4 L288.1,282.3 L289.1,298.4 L290.2,225.5 L291.3,280.2 L292.4,219.2 L293.5,291.4 L294.6,221.3
		L295.7,277.4 L296.7,202.4 L297.8,273.9 L298.9,198.9 L300.0,285.1 L301.1,187.7 L302.2,270.3 L303.3,265.4
		L304.3,190.5 L305.4,280.2 L306.5,171.6 L307.6,244.4 L308.7,159.6 L309.8,236.7 L310.9,161.7 L312.0,261.2
		L313.0,164.5 L314.1,215.7 L315.2,237.4 L316.3,153.3 L317.4,215.0 L318.5,127.4 L319.6,239.5 L320.6,117.6
		L321.7,225.5 L322.8,137.2 L323.9,224.8 L325.0,119.0 L326.1,215.0 L327.2,205.9 L328.2,93.8 L329.3,217.1
		L330.4,91.0 L331.5,208.0 L332.6,111.3 L333.7,193.3 L334.8,112.7 L335.8,212.9 L336.9,103.6 L338.0,217.8
		L339.1,122.5 L340.2,202.4 L341.3,173.0 L342.4,84.0 L343.4,193.3 L344.5,96.6 L345.6,197.5 L346.7,45.4
		L347.8,198.9 L348.9,90.3 L350.0,185.6 L351.1,85.4 L352.1,208.0 L353.2,199.6 L354.3,68.5 L355.4,203.1
		L356.5,76.3 L357.6,201.7 L358.7,53.8 L359.7,203.1 L360.8,90.3 L361.9,180.7 L363.0,77.7 L364.1,186.3
		L365.2,98.0 L366.3,187.7 L367.3,195.4 L368.4,90.3 L369.5,190.5 L370.6,66.4 L371.7,173.7 L372.8,35.6
		L373.9,180.0 L374.9,76.3 L376.0,174.4 L377.1,70.7 L378.2,165.9 L379.3,168.0 L380.4,75.6 L381.5,212.2
		L382.6,48.9 L383.6,182.1 L384.7,55.9 L385.8,170.9 L386.9,49.6 L388.0,191.2 L389.1,46.8 L390.2,188.4
		L391.2,154.0 L392.3,53.1 L393.4,167.3 L394.5,55.9 L395.6,189.8 L396.7,55.2 L397.8,179.3 L398.8,60.1
		L399.9,174.4 L401.0,44.7 L402.1,170.9 L403.2,41.9 L404.3,181.4 L405.4,174.4 L406.4,60.1 L407.5,165.9
		L408.6,51.0 L409.7,168.0 L410.8,26.5 L411.9,168.0 L413.0,48.9 L414.1,156.8 L415.1,59.4 L416.2,175.1
		L417.3,182.8 L418.4,38.4 L419.5,162.4 L420.6,23.0 L421.7,173.0 L422.7,20.2 L423.8,174.4 L424.9,45.4
		L426.0,153.3 L427.1,71.4 L428.2,156.8 L429.3,30.7 L430.3,150.5 L431.4,172.3 L432.5,46.1 L433.6,165.9
		L434.7,60.8 L435.8,134.4 L436.9,18.1 L437.9,145.6 L439.0,38.4 L440.1,157.5 L441.2,26.5 L442.3,155.4
		L443.4,154.7 L444.5,28.6 L445.6,159.6 L446.6,18.1 L447.7,170.2 L448.8,39.1 L449.9,158.2 L451.0,34.9
		L452.1,142.8 L453.2,38.4 L454.2,177.9 L455.3,151.2 L456.4,46.1 L457.5,161.7 L458.6,22.3 L459.7,156.8
		L460.8,44.0 L461.8,168.7 L462.9,39.1 L464.0,161.7 L465.1,46.8 L466.2,165.9 L467.3,70.0 L468.4,166.6
		L469.4,174.4 L470.5,27.9 L471.6,182.1 L472.7,48.2 L473.8,153.3 L474.9,46.8 L476.0,180.0 L477.1,80.5
		L478.1,203.1 L479.2,41.9 L480.3,182.8 L481.4,184.2 L482.5,72.8 L483.6,163.8 L484.7,81.2 L485.7,187.0
		L486.8,86.1 L487.9,193.3 L489.0,60.8 L490.1,177.2 L491.2,86.1 L492.3,223.4 L493.3,88.2 L494.4,194.7
		L495.5,222.7 L496.6,118.3 L497.7,205.9 L498.8,98.0 L499.9,205.9 L500.9,116.9 L502.0,215.0 L503.1,106.4
		L504.2,205.2 L505.3,86.1 L506.4,201.7 L507.5,236.0 L508.6,99.4 L509.6,208.7 L510.7,105.0 L511.8,206.6
		L512.9,92.4 L514.0,208.0 L515.1,65.7 L516.2,209.4 L517.2,102.9 L518.3,212.9 L519.4,225.5 L520.5,81.9
		L521.6,201.0 L522.7,98.0 L523.8,199.6 L524.8,112.0 L525.9,204.5 L527.0,83.3 L528.1,200.3 L529.2,91.0
		L530.3,191.2 L531.4,66.4 L532.4,219.9 L533.5,204.5 L534.6,103.6 L535.7,206.6 L536.8,92.4 L537.9,215.0
		L539.0,99.4 L540.1,199.6 L541.1,116.9 L542.2,228.3 L543.3,140.7 L544.4,226.2 L545.5,214.3 L546.6,121.1
		L547.7,232.5 L548.7,139.3 L549.8,247.2 L550.9,137.9 L552.0,236.0 L553.1,118.3 L554.2,233.9 L555.3,123.9
		L556.3,244.4 L557.4,137.2 L558.5,219.2 L559.6,257.7 L560.7,174.4 L561.8,250.7 L562.9,183.5 L563.9,260.5
		L565.0,172.3 L566.1,273.2 L567.2,205.9 L568.3,267.5 L569.4,187.7 L570.5,259.8 L571.6,251.4 L572.6,174.4
		L573.7,262.6 L574.8,192.6 L575.9,267.5 L577.0,208.0 L578.1,279.5 L579.2,178.6 L580.2,277.4 L581.3,200.3
		L582.4,273.2 L583.5,268.9 L584.6,239.5 L585.7,282.3 L586.8,235.3 L587.8,290.7 L588.9,208.7 L590.0,291.4
		L591.1,219.9 L592.2,283.0 L593.3,227.6 L594.4,285.1 L595.4,240.9 L596.5,281.6 L597.6,304.7 L598.7,238.8
		L599.8,299.1 L600.9,221.3 L602.0,291.4 L603.1,228.3 L604.1,289.3 L605.2,252.1 L606.3,289.3 L607.4,242.3
		L608.5,306.8 L609.6,300.5 L610.7,250.7 L611.7,322.2 L612.8,242.3 L613.9,316.6  '/></g>
	</g>
	<g id="gnuplot_plot_2" ><title>W = 6</title>
<g fill="none" color="black" stroke="currentColor" stroke-width="1.00" stroke-linecap="butt" stroke-linejoin="miter">
	<g transform="translate(547.9,58.0)" stroke="none" fill="black" font-family="Arial" font-size="12.00"  text-anchor="end">
		<text><tspan font-family="Arial" >W = 6</tspan></text>
	</g>
</g>
<g fill="none" color="black" stroke="currentColor" stroke-width="1.00" stroke-linecap="butt" stroke-linejoin="miter">
	<path stroke='rgb(  0, 158, 115)'  d='M556.2,54.1 L598.4,54.1 M71.9,422.4 L73.0,422.4 L74.1,422.4 L75.2,422.4 L76.2,422.4 L77.3,422.4
		L78.4,422.4 L79.5,422.4 L80.6,422.4 L81.7,422.4 L82.8,422.4 L83.8,422.2 L84.9,422.2 L86.0,422.2
		L87.1,422.2 L88.2,422.2 L89.3,422.4 L90.4,422.2 L91.5,422.4 L92.5,421.8 L93.6,421.6 L94.7,421.6
		L95.8,421.8 L96.9,421.5 L98.0,421.6 L99.1,421.3 L100.1,420.9 L101.2,421.1 L102.3,420.7 L103.4,420.5
		L104.5,418.8 L105.6,419.6 L106.7,419.0 L107.7,419.8 L108.8,417.3 L109.9,420.7 L111.0,419.9 L112.1,418.1
		L113.2,419.9 L114.3,417.5 L115.3,416.9 L116.4,416.2 L117.5,418.1 L118.6,416.2 L119.7,417.7 L120.8,415.6
		L121.9,416.9 L123.0,417.3 L124.0,416.0 L125.1,415.4 L126.2,414.5 L127.3,417.7 L128.4,412.6 L129.5,414.7
		L130.6,411.8 L131.6,413.9 L132.7,411.4 L133.8,413.9 L134.9,415.0 L136.0,408.8 L137.1,414.3 L138.2,409.0
		L139.2,412.6 L140.3,408.2 L141.4,411.6 L142.5,403.3 L143.6,412.0 L144.7,404.4 L145.8,409.4 L146.8,402.0
		L147.9,407.8 L149.0,409.9 L150.1,399.7 L151.2,402.9 L152.3,397.6 L153.4,405.8 L154.5,398.6 L155.5,404.1
		L156.6,391.0 L157.7,403.9 L158.8,391.6 L159.9,401.0 L161.0,403.3 L162.1,391.6 L163.1,401.4 L164.2,389.7
		L165.3,399.5 L166.4,390.8 L167.5,402.0 L168.6,390.6 L169.7,401.6 L170.7,387.6 L171.8,398.6 L172.9,384.2
		L174.0,397.3 L175.1,395.6 L176.2,381.0 L177.3,397.1 L178.3,384.8 L179.4,393.7 L180.5,384.2 L181.6,396.1
		L182.7,382.3 L183.8,391.4 L184.9,378.4 L186.0,393.3 L187.0,390.8 L188.1,376.3 L189.2,390.6 L190.3,381.6
		L191.4,386.7 L192.5,369.7 L193.6,391.2 L194.6,363.6 L195.7,387.4 L196.8,365.9 L197.9,378.9 L199.0,385.2
		L200.1,363.0 L201.2,376.5 L202.2,352.1 L203.3,376.3 L204.4,348.9 L205.5,370.6 L206.6,347.0 L207.7,374.6
		L208.8,340.7 L209.8,366.5 L210.9,337.7 L212.0,369.3 L213.1,367.2 L214.2,327.5 L215.3,364.6 L216.4,327.3
		L217.5,362.7 L218.5,325.8 L219.6,353.4 L220.7,326.9 L221.8,355.1 L222.9,321.5 L224.0,353.2 L225.1,353.4
		L226.1,310.1 L227.2,354.9 L228.3,303.7 L229.4,338.5 L230.5,303.3 L231.6,339.0 L232.7,299.0 L233.7,338.1
		L234.8,290.1 L235.9,329.4 L237.0,281.0 L238.1,325.4 L239.2,321.7 L240.3,266.1 L241.3,316.6 L242.4,265.7
		L243.5,314.3 L244.6,242.8 L245.7,310.9 L246.8,243.2 L247.9,294.6 L249.0,235.5 L250.0,297.1 L251.1,298.4
		L252.2,223.0 L253.3,285.2 L254.4,210.5 L255.5,285.6 L256.6,206.2 L257.6,271.0 L258.7,197.7 L259.8,282.5
		L260.9,205.6 L262.0,268.4 L263.1,260.0 L264.2,182.0 L265.2,258.5 L266.3,173.3 L267.4,261.7 L268.5,175.7
		L269.6,252.5 L270.7,162.9 L271.8,241.3 L272.8,149.3 L273.9,237.0 L275.0,141.9 L276.1,239.4 L277.2,229.8
		L278.3,135.3 L279.4,227.5 L280.5,128.5 L281.5,225.6 L282.6,128.9 L283.7,221.1 L284.8,106.2 L285.9,195.8
		L287.0,95.6 L288.1,204.5 L289.1,204.3 L290.2,86.3 L291.3,200.3 L292.4,83.1 L293.5,195.0 L294.6,69.5
		L295.7,189.9 L296.7,71.6 L297.8,195.6 L298.9,51.6 L300.0,182.2 L301.1,66.3 L302.2,178.0 L303.3,180.5
		L304.3,50.8 L305.4,169.1 L306.5,50.6 L307.6,168.2 L308.7,44.2 L309.8,177.4 L310.9,44.9 L312.0,168.4
		L313.0,51.2 L314.1,163.5 L315.2,160.8 L316.3,39.8 L317.4,168.2 L318.5,34.0 L319.6,164.4 L320.6,44.6
		L321.7,165.7 L322.8,40.4 L323.9,162.1 L325.0,18.1 L326.1,170.6 L327.2,156.3 L328.2,23.0 L329.3,165.7
		L330.4,19.8 L331.5,160.4 L332.6,18.9 L333.7,163.8 L334.8,20.2 L335.8,168.0 L336.9,18.7 L338.0,166.9
		L339.1,30.0 L340.2,158.0 L341.3,164.8 L342.4,20.9 L343.4,161.9 L344.5,27.7 L345.6,148.7 L346.7,34.9
		L347.8,171.6 L348.9,38.7 L350.0,177.1 L351.1,48.7 L352.1,158.2 L353.2,178.4 L354.3,63.3 L355.4,194.8
		L356.5,68.9 L357.6,186.3 L358.7,82.2 L359.7,190.1 L360.8,87.5 L361.9,184.6 L363.0,83.3 L364.1,205.2
		L365.2,96.9 L366.3,204.7 L367.3,207.9 L368.4,109.0 L369.5,213.9 L370.6,116.2 L371.7,222.2 L372.8,114.5
		L373.9,213.4 L374.9,118.8 L376.0,223.6 L377.1,129.4 L378.2,226.2 L379.3,230.6 L380.4,147.2 L381.5,237.2
		L382.6,149.7 L383.6,242.6 L384.7,155.1 L385.8,249.5 L386.9,162.9 L388.0,262.5 L389.1,178.6 L390.2,255.3
		L391.2,266.3 L392.3,178.4 L393.4,268.4 L394.5,190.5 L395.6,271.4 L396.7,208.1 L397.8,279.9 L398.8,204.3
		L399.9,289.9 L401.0,216.9 L402.1,298.4 L403.2,232.6 L404.3,295.9 L405.4,305.6 L406.4,250.8 L407.5,319.8
		L408.6,260.8 L409.7,318.4 L410.8,275.0 L411.9,317.7 L413.0,284.8 L414.1,325.2 L415.1,278.7 L416.2,329.2
		L417.3,335.8 L418.4,284.8 L419.5,337.2 L420.6,295.4 L421.7,344.0 L422.7,305.0 L423.8,340.7 L424.9,302.8
		L426.0,348.1 L427.1,308.2 L428.2,353.0 L429.3,315.2 L430.3,362.9 L431.4,361.2 L432.5,327.3 L433.6,361.9
		L434.7,338.7 L435.8,364.2 L436.9,332.2 L437.9,369.9 L439.0,347.9 L440.1,364.8 L441.2,347.0 L442.3,374.8
		L443.4,378.9 L444.5,351.0 L445.6,380.4 L446.6,355.9 L447.7,389.7 L448.8,357.8 L449.9,380.8 L451.0,364.9
		L452.1,387.2 L453.2,367.2 L454.2,387.2 L455.3,386.9 L456.4,366.1 L457.5,385.7 L458.6,366.5 L459.7,384.6
		L460.8,375.9 L461.8,394.6 L462.9,375.1 L464.0,393.7 L465.1,377.0 L466.2,392.5 L467.3,374.2 L468.4,391.0
		L469.4,391.0 L470.5,375.3 L471.6,393.3 L472.7,373.4 L473.8,388.8 L474.9,373.8 L476.0,389.7 L477.1,373.4
		L478.1,387.1 L479.2,375.5 L480.3,385.7 L481.4,392.2 L482.5,372.5 L483.6,386.7 L484.7,369.7 L485.7,389.7
		L486.8,370.6 L487.9,385.4 L489.0,373.3 L490.1,390.6 L491.2,372.9 L492.3,387.8 L493.3,372.7 L494.4,391.8
		L495.5,390.3 L496.6,379.3 L497.7,392.7 L498.8,377.6 L499.9,395.6 L500.9,382.9 L502.0,391.2 L503.1,383.5
		L504.2,399.7 L505.3,382.3 L506.4,399.0 L507.5,395.6 L508.6,386.7 L509.6,401.2 L510.7,390.6 L511.8,402.7
		L512.9,388.9 L514.0,399.3 L515.1,391.4 L516.2,400.9 L517.2,397.5 L518.3,400.5 L519.4,402.7 L520.5,396.9
		L521.6,404.8 L522.7,398.4 L523.8,405.8 L524.8,397.8 L525.9,404.4 L527.0,398.8 L528.1,409.2 L529.2,401.2
		L530.3,407.8 L531.4,401.8 L532.4,407.7 L533.5,411.6 L534.6,408.0 L535.7,411.1 L536.8,406.7 L537.9,414.7
		L539.0,412.2 L540.1,415.4 L541.1,412.6 L542.2,419.0 L543.3,416.2 L544.4,419.8 L545.5,419.2 L546.6,417.7
		L547.7,418.6 L548.7,419.2 L549.8,421.3 L550.9,419.8 L552.0,421.3 L553.1,420.5 L554.2,421.8 L555.3,421.3
		L556.3,422.4 L557.4,421.3 L558.5,421.8 L559.6,422.2 L560.7,421.8 L561.8,422.2 L562.9,422.4 L563.9,422.4
		L565.0,422.4 L566.1,422.4 L567.2,422.4 L568.3,422.4 L569.4,422.4 L570.5,422.4 L571.6,422.4 L572.6,422.4
		L573.7,422.4 L574.8,422.4 L575.9,422.4 L577.0,422.4 L578.1,422.4 L579.2,422.4 L580.2,422.4 L581.3,422.4
		L582.4,422.4 L583.5,422.4 L584.6,422.4 L585.7,422.4 L586.8,422.4 L587.8,422.4 L588.9,422.4 L590.0,422.4
		L591.1,422.4 L592.2,422.4 L593.3,422.4 L594.4,422.4 L595.4,422.4 L596.5,422.4 L597.6,422.4 L598.7,422.4
		L599.8,422.4 L600.9,422.4 L602.0,422.4 L603.1,422.4 L604.1,422.4 L605.2,422.4 L606.3,422.4 L607.4,422.4
		L608.5,422.4 L609.6,422.4 L610.7,422.4 L611.7,422.4 L612.8,422.4 L613.9,422.4  '/></g>
	</g>
	<g id="gnuplot_plot_3" ><title>W = 8</title>
<g fill="none" color="black" stroke="currentColor" stroke-width="1.00" stroke-linecap="butt" stroke-linejoin="miter">
	<g transform="translate(547.9,76.0)" stroke="none" fill="black" font-family="Arial" font-size="12.00"  text-anchor="end">
		<text><tspan font-family="Arial" >W = 8</tspan></text>
	</g>
</g>
<g fill="none" color="black" stroke="currentColor" stroke-width="1.00" stroke-linecap="butt" stroke-linejoin="miter">
	<path stroke='rgb( 86, 180, 233)'  d='M556.2,72.1 L598.4,72.1 M71.9,422.4 L73.0,422.4 L74.1,422.4 L75.2,422.4 L76.2,422.4 L77.3,422.4
		L78.4,422.4 L79.5,422.4 L80.6,422.3 L81.7,422.3 L82.8,422.2 L83.8,422.1 L84.9,422.2 L86.0,421.5
		L87.1,422.1 L88.2,421.3 L89.3,421.5 L90.4,420.2 L91.5,420.5 L92.5,418.4 L93.6,419.3 L94.7,417.4
		L95.8,417.4 L96.9,417.1 L98.0,413.1 L99.1,414.2 L100.1,405.8 L101.2,406.9 L102.3,395.2 L103.4,400.6
		L104.5,383.9 L105.6,390.2 L106.7,364.6 L107.7,378.8 L108.8,344.2 L109.9,359.0 L111.0,353.7 L112.1,305.6
		L113.2,329.0 L114.3,270.1 L115.3,308.2 L116.4,229.7 L117.5,281.3 L118.6,188.7 L119.7,251.3 L120.8,144.2
		L121.9,222.3 L123.0,219.3 L124.0,95.6 L125.1,195.3 L126.2,65.2 L127.3,173.6 L128.4,43.7 L129.5,158.4
		L130.6,18.1 L131.6,153.2 L132.7,20.0 L133.8,158.3 L134.9,159.8 L136.0,41.8 L137.1,178.1 L138.2,58.7
		L139.2,197.9 L140.3,94.6 L141.4,216.7 L142.5,136.2 L143.6,243.4 L144.7,173.8 L145.8,269.3 L146.8,218.7
		L147.9,301.6 L149.0,311.5 L150.1,270.1 L151.2,332.1 L152.3,303.7 L153.4,353.9 L154.5,335.9 L155.5,373.9
		L156.6,360.1 L157.7,388.1 L158.8,379.0 L159.9,397.4 L161.0,400.1 L162.1,397.1 L163.1,408.8 L164.2,404.4
		L165.3,413.5 L166.4,412.2 L167.5,417.5 L168.6,416.2 L169.7,419.3 L170.7,419.3 L171.8,420.9 L172.9,420.7
		L174.0,421.7 L175.1,421.7 L176.2,421.5 L177.3,422.0 L178.3,422.0 L179.4,422.2 L180.5,422.3 L181.6,422.4
		L182.7,422.4 L183.8,422.4 L184.9,422.4 L186.0,422.4 L187.0,422.4 L188.1,422.4 L189.2,422.4 L190.3,422.4
		L191.4,422.4 L192.5,422.4 L193.6,422.4 L194.6,422.4 L195.7,422.4 L196.8,422.4 L197.9,422.4 L199.0,422.4
		L200.1,422.4 L201.2,422.4 L202.2,422.4 L203.3,422.4 L204.4,422.4 L205.5,422.4 L206.6,422.4 L207.7,422.4
		L208.8,422.4 L209.8,422.4 L210.9,422.4 L212.0,422.4 L213.1,422.4 L214.2,422.4 L215.3,422.4 L216.4,422.4
		L217.5,422.4 L218.5,422.4 L219.6,422.4 L220.7,422.4 L221.8,422.4 L222.9,422.4 L224.0,422.4 L225.1,422.4
		L226.1,422.4 L227.2,422.4 L228.3,422.4 L229.4,422.4 L230.5,422.4 L231.6,422.4 L232.7,422.4 L233.7,422.4
		L234.8,422.4 L235.9,422.4 L237.0,422.4 L238.1,422.4 L239.2,422.4 L240.3,422.4 L241.3,422.4 L242.4,422.4
		L243.5,422.4 L244.6,422.4 L245.7,422.4 L246.8,422.4 L247.9,422.4 L249.0,422.4 L250.0,422.4 L251.1,422.4
		L252.2,422.4 L253.3,422.4 L254.4,422.4 L255.5,422.4 L256.6,422.4 L257.6,422.4 L258.7,422.4 L259.8,422.4
		L260.9,422.4 L262.0,422.4 L263.1,422.4 L264.2,422.4 L265.2,422.4 L266.3,422.4 L267.4,422.4 L268.5,422.4
		L269.6,422.4 L270.7,422.4 L271.8,422.4 L272.8,422.4 L273.9,422.4 L275.0,422.4 L276.1,422.4 L277.2,422.4
		L278.3,422.4 L279.4,422.4 L280.5,422.4 L281.5,422.4 L282.6,422.4 L283.7,422.4 L284.8,422.4 L285.9,422.4
		L287.0,422.4 L288.1,422.4 L289.1,422.4 L290.2,422.4 L291.3,422.4 L292.4,422.4 L293.5,422.4 L294.6,422.4
		L295.7,422.4 L296.7,422.4 L297.8,422.4 L298.9,422.4 L300.0,422.4 L301.1,422.4 L302.2,422.4 L303.3,422.4
		L304.3,422.4 L305.4,422.4 L306.5,422.4 L307.6,422.4 L308.7,422.4 L309.8,422.4 L310.9,422.4 L312.0,422.4
		L313.0,422.4 L314.1,422.4 L315.2,422.4 L316.3,422.4 L317.4,422.4 L318.5,422.4 L319.6,422.4 L320.6,422.4
		L321.7,422.4 L322.8,422.4 L323.9,422.4 L325.0,422.4 L326.1,422.4 L327.2,422.4 L328.2,422.4 L329.3,422.4
		L330.4,422.4 L331.5,422.4 L332.6,422.4 L333.7,422.4 L334.8,422.4 L335.8,422.4 L336.9,422.4 L338.0,422.4
		L339.1,422.4 L340.2,422.4 L341.3,422.4 L342.4,422.4 L343.4,422.4 L344.5,422.4 L345.6,422.4 L346.7,422.4
		L347.8,422.4 L348.9,422.4 L350.0,422.4 L351.1,422.4 L352.1,422.4 L353.2,422.4 L354.3,422.4 L355.4,422.4
		L356.5,422.4 L357.6,422.4 L358.7,422.4 L359.7,422.4 L360.8,422.4 L361.9,422.4 L363.0,422.4 L364.1,422.4
		L365.2,422.4 L366.3,422.4 L367.3,422.4 L368.4,422.4 L369.5,422.4 L370.6,422.4 L371.7,422.4 L372.8,422.4
		L373.9,422.4 L374.9,422.4 L376.0,422.4 L377.1,422.4 L378.2,422.4 L379.3,422.4 L380.4,422.4 L381.5,422.4
		L382.6,422.4 L383.6,422.4 L384.7,422.4 L385.8,422.4 L386.9,422.4 L388.0,422.4 L389.1,422.4 L390.2,422.4
		L391.2,422.4 L392.3,422.4 L393.4,422.4 L394.5,422.4 L395.6,422.4 L396.7,422.4 L397.8,422.4 L398.8,422.4
		L399.9,422.4 L401.0,422.4 L402.1,422.4 L403.2,422.4 L404.3,422.4 L405.4,422.4 L406.4,422.4 L407.5,422.4
		L408.6,422.4 L409.7,422.4 L410.8,422.4 L411.9,422.4 L413.0,422.4 L414.1,422.4 L415.1,422.4 L416.2,422.4
		L417.3,422.4 L418.4,422.4 L419.5,422.4 L420.6,422.4 L421.7,422.4 L422.7,422.4 L423.8,422.4 L424.9,422.4
		L426.0,422.4 L427.1,422.4 L428.2,422.4 L429.3,422.4 L430.3,422.4 L431.4,422.4 L432.5,422.4 L433.6,422.4
		L434.7,422.4 L435.8,422.4 L436.9,422.4 L437.9,422.4 L439.0,422.4 L440.1,422.4 L441.2,422.4 L442.3,422.4
		L443.4,422.4 L444.5,422.4 L445.6,422.4 L446.6,422.4 L447.7,422.4 L448.8,422.4 L449.9,422.4 L451.0,422.4
		L452.1,422.4 L453.2,422.4 L454.2,422.4 L455.3,422.4 L456.4,422.4 L457.5,422.4 L458.6,422.4 L459.7,422.4
		L460.8,422.4 L461.8,422.4 L462.9,422.4 L464.0,422.4 L465.1,422.4 L466.2,422.4 L467.3,422.4 L468.4,422.4
		L469.4,422.4 L470.5,422.4 L471.6,422.4 L472.7,422.4 L473.8,422.4 L474.9,422.4 L476.0,422.4 L477.1,422.4
		L478.1,422.4 L479.2,422.4 L480.3,422.4 L481.4,422.4 L482.5,422.4 L483.6,422.4 L484.7,422.4 L485.7,422.4
		L486.8,422.4 L487.9,422.4 L489.0,422.4 L490.1,422.4 L491.2,422.4 L492.3,422.4 L493.3,422.4 L494.4,422.4
		L495.5,422.4 L496.6,422.4 L497.7,422.4 L498.8,422.4 L499.9,422.4 L500.9,422.4 L502.0,422.4 L503.1,422.4
		L504.2,422.4 L505.3,422.4 L506.4,422.4 L507.5,422.4 L508.6,422.4 L509.6,422.4 L510.7,422.4 L511.8,422.4
		L512.9,422.4 L514.0,422.4 L515.1,422.4 L516.2,422.4 L517.2,422.4 L518.3,422.4 L519.4,422.4 L520.5,422.4
		L521.6,422.4 L522.7,422.4 L523.8,422.4 L524.8,422.4 L525.9,422.4 L527.0,422.4 L528.1,422.4 L529.2,422.4
		L530.3,422.4 L531.4,422.4 L532.4,422.4 L533.5,422.4 L534.6,422.4 L535.7,422.4 L536.8,422.4 L537.9,422.4
		L539.0,422.4 L540.1,422.4 L541.1,422.4 L542.2,422.4 L543.3,422.4 L544.4,422.4 L545.5,422.4 L546.6,422.4
		L547.7,422.4 L548.7,422.4 L549.8,422.4 L550.9,422.4 L552.0,422.4 L553.1,422.4 L554.2,422.4 L555.3,422.4
		L556.3,422.4 L557.4,422.4 L558.5,422.4 L559.6,422.4 L560.7,422.4 L561.8,422.4 L562.9,422.4 L563.9,422.4
		L565.0,422.4 L566.1,422.4 L567.2,422.4 L568.3,422.4 L569.4,422.4 L570.5,422.4 L571.6,422.4 L572.6,422.4
		L573.7,422.4 L574.8,422.4 L575.9,422.4 L577.0,422.4 L578.1,422.4 L579.2,422.4 L580.2,422.4 L581.3,422.4
		L582.4,422.4 L583.5,422.4 L584.6,422.4 L585.7,422.4 L586.8,422.4 L587.8,422.4 L588.9,422.4 L590.0,422.4
		L591.1,422.4 L592.2,422.4 L593.3,422.4 L594.4,422.4 L595.4,422.4 L596.5,422.4 L597.6,422.4 L598.7,422.4
		L599.8,422.4 L600.9,422.4 L602.0,422.4 L603.1,422.4 L604.1,422.4 L605.2,422.4 L606.3,422.4 L607.4,422.4
		L608.5,422.4 L609.6,422.4 L610.7,422.4 L611.7,422.4 L612.8,422.4 L613.9,422.4  '/></g>
	</g>
	<g id="gnuplot_plot_4" ><title>W = 10</title>
<g fill="none" color="black" stroke="currentColor" stroke-width="1.00" stroke-linecap="butt" stroke-linejoin="miter">
	<g transform="translate(547.9,94.0)" stroke="none" fill="black" font-family="Arial" font-size="12.00"  text-anchor="end">
		<text><tspan font-family="Arial" >W = 10</tspan></text>
	</g>
</g>
<g fill="none" color="black" stroke="currentColor" stroke-width="1.00" stroke-linecap="butt" stroke-linejoin="miter">
	<path stroke='rgb(230, 159,   0)'  d='M556.2,90.1 L598.4,90.1 M71.9,422.4 L73.0,422.2 L74.1,421.3 L75.2,420.0 L76.2,411.5 L77.3,404.7
		L78.4,363.4 L79.5,352.1 L80.6,253.0 L81.7,258.7 L82.8,109.6 L83.8,173.8 L84.9,153.7 L86.0,18.1
		L87.1,173.4 L88.2,104.6 L89.3,260.2 L90.4,251.6 L91.5,353.8 L92.5,368.1 L93.6,404.9 L94.7,412.1
		L95.8,420.4 L96.9,421.6 L98.0,422.1 L99.1,422.4 L100.1,422.4 L101.2,422.4 L102.3,422.4 L103.4,422.4
		L104.5,422.4 L105.6,422.4 L106.7,422.4 L107.7,422.4 L108.8,422.4 L109.9,422.4 L111.0,422.4 L112.1,422.4
		L113.2,422.4 L114.3,422.4 L115.3,422.4 L116.4,422.4 L117.5,422.4 L118.6,422.4 L119.7,422.4 L120.8,422.4
		L121.9,422.4 L123.0,422.4 L124.0,422.4 L125.1,422.4 L126.2,422.4 L127.3,422.4 L128.4,422.4 L129.5,422.4
		L130.6,422.4 L131.6,422.4 L132.7,422.4 L133.8,422.4 L134.9,422.4 L136.0,422.4 L137.1,422.4 L138.2,422.4
		L139.2,422.4 L140.3,422.4 L141.4,422.4 L142.5,422.4 L143.6,422.4 L144.7,422.4 L145.8,422.4 L146.8,422.4
		L147.9,422.4 L149.0,422.4 L150.1,422.4 L151.2,422.4 L152.3,422.4 L153.4,422.4 L154.5,422.4 L155.5,422.4
		L156.6,422.4 L157.7,422.4 L158.8,422.4 L159.9,422.4 L161.0,422.4 L162.1,422.4 L163.1,422.4 L164.2,422.4
		L165.3,422.4 L166.4,422.4 L167.5,422.4 L168.6,422.4 L169.7,422.4 L170.7,422.4 L171.8,422.4 L172.9,422.4
		L174.0,422.4 L175.1,422.4 L176.2,422.4 L177.3,422.4 L178.3,422.4 L179.4,422.4 L180.5,422.4 L181.6,422.4
		L182.7,422.4 L183.8,422.4 L184.9,422.4 L186.0,422.4 L187.0,422.4 L188.1,422.4 L189.2,422.4 L190.3,422.4
		L191.4,422.4 L192.5,422.4 L193.6,422.4 L194.6,422.4 L195.7,422.4 L196.8,422.4 L197.9,422.4 L199.0,422.4
		L200.1,422.4 L201.2,422.4 L202.2,422.4 L203.3,422.4 L204.4,422.4 L205.5,422.4 L206.6,422.4 L207.7,422.4
		L208.8,422.4 L209.8,422.4 L210.9,422.4 L212.0,422.4 L213.1,422.4 L214.2,422.4 L215.3,422.4 L216.4,422.4
		L217.5,422.4 L218.5,422.4 L219.6,422.4 L220.7,422.4 L221.8,422.4 L222.9,422.4 L224.0,422.4 L225.1,422.4
		L226.1,422.4 L227.2,422.4 L228.3,422.4 L229.4,422.4 L230.5,422.4 L231.6,422.4 L232.7,422.4 L233.7,422.4
		L234.8,422.4 L235.9,422.4 L237.0,422.4 L238.1,422.4 L239.2,422.4 L240.3,422.4 L241.3,422.4 L242.4,422.4
		L243.5,422.4 L244.6,422.4 L245.7,422.4 L246.8,422.4 L247.9,422.4 L249.0,422.4 L250.0,422.4 L251.1,422.4
		L252.2,422.4 L253.3,422.4 L254.4,422.4 L255.5,422.4 L256.6,422.4 L257.6,422.4 L258.7,422.4 L259.8,422.4
		L260.9,422.4 L262.0,422.4 L263.1,422.4 L264.2,422.4 L265.2,422.4 L266.3,422.4 L267.4,422.4 L268.5,422.4
		L269.6,422.4 L270.7,422.4 L271.8,422.4 L272.8,422.4 L273.9,422.4 L275.0,422.4 L276.1,422.4 L277.2,422.4
		L278.3,422.4 L279.4,422.4 L280.5,422.4 L281.5,422.4 L282.6,422.4 L283.7,422.4 L284.8,422.4 L285.9,422.4
		L287.0,422.4 L288.1,422.4 L289.1,422.4 L290.2,422.4 L291.3,422.4 L292.4,422.4 L293.5,422.4 L294.6,422.4
		L295.7,422.4 L296.7,422.4 L297.8,422.4 L298.9,422.4 L300.0,422.4 L301.1,422.4 L302.2,422.4 L303.3,422.4
		L304.3,422.4 L305.4,422.4 L306.5,422.4 L307.6,422.4 L308.7,422.4 L309.8,422.4 L310.9,422.4 L312.0,422.4
		L313.0,422.4 L314.1,422.4 L315.2,422.4 L316.3,422.4 L317.4,422.4 L318.5,422.4 L319.6,422.4 L320.6,422.4
		L321.7,422.4 L322.8,422.4 L323.9,422.4 L325.0,422.4 L326.1,422.4 L327.2,422.4 L328.2,422.4 L329.3,422.4
		L330.4,422.4 L331.5,422.4 L332.6,422.4 L333.7,422.4 L334.8,422.4 L335.8,422.4 L336.9,422.4 L338.0,422.4
		L339.1,422.4 L340.2,422.4 L341.3,422.4 L342.4,422.4 L343.4,422.4 L344.5,422.4 L345.6,422.4 L346.7,422.4
		L347.8,422.4 L348.9,422.4 L350.0,422.4 L351.1,422.4 L352.1,422.4 L353.2,422.4 L354.3,422.4 L355.4,422.4
		L356.5,422.4 L357.6,422.4 L358.7,422.4 L359.7,422.4 L360.8,422.4 L361.9,422.4 L363.0,422.4 L364.1,422.4
		L365.2,422.4 L366.3,422.4 L367.3,422.4 L368.4,422.4 L369.5,422.4 L370.6,422.4 L371.7,422.4 L372.8,422.4
		L373.9,422.4 L374.9,422.4 L376.0,422.4 L377.1,422.4 L378.2,422.4 L379.3,422.4 L380.4,422.4 L381.5,422.4
		L382.6,422.4 L383.6,422.4 L384.7,422.4 L385.8,422.4 L386.9,422.4 L388.0,422.4 L389.1,422.4 L390.2,422.4
		L391.2,422.4 L392.3,422.4 L393.4,422.4 L394.5,422.4 L395.6,422.4 L396.7,422.4 L397.8,422.4 L398.8,422.4
		L399.9,422.4 L401.0,422.4 L402.1,422.4 L403.2,422.4 L404.3,422.4 L405.4,422.4 L406.4,422.4 L407.5,422.4
		L408.6,422.4 L409.7,422.4 L410.8,422.4 L411.9,422.4 L413.0,422.4 L414.1,422.4 L415.1,422.4 L416.2,422.4
		L417.3,422.4 L418.4,422.4 L419.5,422.4 L420.6,422.4 L421.7,422.4 L422.7,422.4 L423.8,422.4 L424.9,422.4
		L426.0,422.4 L427.1,422.4 L428.2,422.4 L429.3,422.4 L430.3,422.4 L431.4,422.4 L432.5,422.4 L433.6,422.4
		L434.7,422.4 L435.8,422.4 L436.9,422.4 L437.9,422.4 L439.0,422.4 L440.1,422.4 L441.2,422.4 L442.3,422.4
		L443.4,422.4 L444.5,422.4 L445.6,422.4 L446.6,422.4 L447.7,422.4 L448.8,422.4 L449.9,422.4 L451.0,422.4
		L452.1,422.4 L453.2,422.4 L454.2,422.4 L455.3,422.4 L456.4,422.4 L457.5,422.4 L458.6,422.4 L459.7,422.4
		L460.8,422.4 L461.8,422.4 L462.9,422.4 L464.0,422.4 L465.1,422.4 L466.2,422.4 L467.3,422.4 L468.4,422.4
		L469.4,422.4 L470.5,422.4 L471.6,422.4 L472.7,422.4 L473.8,422.4 L474.9,422.4 L476.0,422.4 L477.1,422.4
		L478.1,422.4 L479.2,422.4 L480.3,422.4 L481.4,422.4 L482.5,422.4 L483.6,422.4 L484.7,422.4 L485.7,422.4
		L486.8,422.4 L487.9,422.4 L489.0,422.4 L490.1,422.4 L491.2,422.4 L492.3,422.4 L493.3,422.4 L494.4,422.4
		L495.5,422.4 L496.6,422.4 L497.7,422.4 L498.8,422.4 L499.9,422.4 L500.9,422.4 L502.0,422.4 L503.1,422.4
		L504.2,422.4 L505.3,422.4 L506.4,422.4 L507.5,422.4 L508.6,422.4 L509.6,422.4 L510.7,422.4 L511.8,422.4
		L512.9,422.4 L514.0,422.4 L515.1,422.4 L516.2,422.4 L517.2,422.4 L518.3,422.4 L519.4,422.4 L520.5,422.4
		L521.6,422.4 L522.7,422.4 L523.8,422.4 L524.8,422.4 L525.9,422.4 L527.0,422.4 L528.1,422.4 L529.2,422.4
		L530.3,422.4 L531.4,422.4 L532.4,422.4 L533.5,422.4 L534.6,422.4 L535.7,422.4 L536.8,422.4 L537.9,422.4
		L539.0,422.4 L540.1,422.4 L541.1,422.4 L542.2,422.4 L543.3,422.4 L544.4,422.4 L545.5,422.4 L546.6,422.4
		L547.7,422.4 L548.7,422.4 L549.8,422.4 L550.9,422.4 L552.0,422.4 L553.1,422.4 L554.2,422.4 L555.3,422.4
		L556.3,422.4 L557.4,422.4 L558.5,422.4 L559.6,422.4 L560.7,422.4 L561.8,422.4 L562.9,422.4 L563.9,422.4
		L565.0,422.4 L566.1,422.4 L567.2,422.4 L568.3,422.4 L569.4,422.4 L570.5,422.4 L571.6,422.4 L572.6,422.4
		L573.7,422.4 L574.8,422.4 L575.9,422.4 L577.0,422.4 L578.1,422.4 L579.2,422.4 L580.2,422.4 L581.3,422.4
		L582.4,422.4 L583.5,422.4 L584.6,422.4 L585.7,422.4 L586.8,422.4 L587.8,422.4 L588.9,422.4 L590.0,422.4
		L591.1,422.4 L592.2,422.4 L593.3,422.4 L594.4,422.4 L595.4,422.4 L596.5,422.4 L597.6,422.4 L598.7,422.4
		L599.8,422.4 L600.9,422.4 L602.0,422.4 L603.1,422.4 L604.1,422.4 L605.2,422.4 L606.3,422.4 L607.4,422.4
		L608.5,422.4 L609.6,422.4 L610.7,422.4 L611.7,422.4 L612.8,422.4 L613.9,422.4  '/></g>
	</g>
	<g id="gnuplot_plot_5" ><title>W = 12</title>
<g fill="none" color="black" stroke="currentColor" stroke-width="1.00" stroke-linecap="butt" stroke-linejoin="miter">
	<g transform="translate(547.9,112.0)" stroke="none" fill="black" font-family="Arial" font-size="12.00"  text-anchor="end">
		<text><tspan font-family="Arial" >W = 12</tspan></text>
	</g>
</g>
<g fill="none" color="black" stroke="currentColor" stroke-width="1.00" stroke-linecap="butt" stroke-linejoin="miter">
	<path stroke='rgb(240, 228,  66)'  d='M556.2,108.1 L598.4,108.1 M71.9,220.1 L73.0,155.0 L74.1,18.1 L75.2,152.2 L76.2,20.2 L77.3,154.4
		L78.4,105.5 L79.5,405.1 L80.6,422.4 L81.7,422.4 L82.8,422.4 L83.8,422.4 L84.9,422.4 L86.0,422.4
		L87.1,422.4 L88.2,422.4 L89.3,422.4 L90.4,422.4 L91.5,422.4 L92.5,422.4 L93.6,422.4 L94.7,422.4
		L95.8,422.4 L96.9,422.4 L98.0,422.4 L99.1,422.4 L100.1,422.4 L101.2,422.4 L102.3,422.4 L103.4,422.4
		L104.5,422.4 L105.6,422.4 L106.7,422.4 L107.7,422.4 L108.8,422.4 L109.9,422.4 L111.0,422.4 L112.1,422.4
		L113.2,422.4 L114.3,422.4 L115.3,422.4 L116.4,422.4 L117.5,422.4 L118.6,422.4 L119.7,422.4 L120.8,422.4
		L121.9,422.4 L123.0,422.4 L124.0,422.4 L125.1,422.4 L126.2,422.4 L127.3,422.4 L128.4,422.4 L129.5,422.4
		L130.6,422.4 L131.6,422.4 L132.7,422.4 L133.8,422.4 L134.9,422.4 L136.0,422.4 L137.1,422.4 L138.2,422.4
		L139.2,422.4 L140.3,422.4 L141.4,422.4 L142.5,422.4 L143.6,422.4 L144.7,422.4 L145.8,422.4 L146.8,422.4
		L147.9,422.4 L149.0,422.4 L150.1,422.4 L151.2,422.4 L152.3,422.4 L153.4,422.4 L154.5,422.4 L155.5,422.4
		L156.6,422.4 L157.7,422.4 L158.8,422.4 L159.9,422.4 L161.0,422.4 L162.1,422.4 L163.1,422.4 L164.2,422.4
		L165.3,422.4 L166.4,422.4 L167.5,422.4 L168.6,422.4 L169.7,422.4 L170.7,422.4 L171.8,422.4 L172.9,422.4
		L174.0,422.4 L175.1,422.4 L176.2,422.4 L177.3,422.4 L178.3,422.4 L179.4,422.4 L180.5,422.4 L181.6,422.4
		L182.7,422.4 L183.8,422.4 L184.9,422.4 L186.0,422.4 L187.0,422.4 L188.1,422.4 L189.2,422.4 L190.3,422.4
		L191.4,422.4 L192.5,422.4 L193.6,422.4 L194.6,422.4 L195.7,422.4 L196.8,422.4 L197.9,422.4 L199.0,422.4
		L200.1,422.4 L201.2,422.4 L202.2,422.4 L203.3,422.4 L204.4,422.4 L205.5,422.4 L206.6,422.4 L207.7,422.4
		L208.8,422.4 L209.8,422.4 L210.9,422.4 L212.0,422.4 L213.1,422.4 L214.2,422.4 L215.3,422.4 L216.4,422.4
		L217.5,422.4 L218.5,422.4 L219.6,422.4 L220.7,422.4 L221.8,422.4 L222.9,422.4 L224.0,422.4 L225.1,422.4
		L226.1,422.4 L227.2,422.4 L228.3,422.4 L229.4,422.4 L230.5,422.4 L231.6,422.4 L232.7,422.4 L233.7,422.4
		L234.8,422.4 L235.9,422.4 L237.0,422.4 L238.1,422.4 L239.2,422.4 L240.3,422.4 L241.3,422.4 L242.4,422.4
		L243.5,422.4 L244.6,422.4 L245.7,422.4 L246.8,422.4 L247.9,422.4 L249.0,422.4 L250.0,422.4 L251.1,422.4
		L252.2,422.4 L253.3,422.4 L254.4,422.4 L255.5,422.4 L256.6,422.4 L257.6,422.4 L258.7,422.4 L259.8,422.4
		L260.9,422.4 L262.0,422.4 L263.1,422.4 L264.2,422.4 L265.2,422.4 L266.3,422.4 L267.4,422.4 L268.5,422.4
		L269.6,422.4 L270.7,422.4 L271.8,422.4 L272.8,422.4 L273.9,422.4 L275.0,422.4 L276.1,422.4 L277.2,422.4
		L278.3,422.4 L279.4,422.4 L280.5,422.4 L281.5,422.4 L282.6,422.4 L283.7,422.4 L284.8,422.4 L285.9,422.4
		L287.0,422.4 L288.1,422.4 L289.1,422.4 L290.2,422.4 L291.3,422.4 L292.4,422.4 L293.5,422.4 L294.6,422.4
		L295.7,422.4 L296.7,422.4 L297.8,422.4 L298.9,422.4 L300.0,422.4 L301.1,422.4 L302.2,422.4 L303.3,422.4
		L304.3,422.4 L305.4,422.4 L306.5,422.4 L307.6,422.4 L308.7,422.4 L309.8,422.4 L310.9,422.4 L312.0,422.4
		L313.0,422.4 L314.1,422.4 L315.2,422.4 L316.3,422.4 L317.4,422.4 L318.5,422.4 L319.6,422.4 L320.6,422.4
		L321.7,422.4 L322.8,422.4 L323.9,422.4 L325.0,422.4 L326.1,422.4 L327.2,422.4 L328.2,422.4 L329.3,422.4
		L330.4,422.4 L331.5,422.4 L332.6,422.4 L333.7,422.4 L334.8,422.4 L335.8,422.4 L336.9,422.4 L338.0,422.4
		L339.1,422.4 L340.2,422.4 L341.3,422.4 L342.4,422.4 L343.4,422.4 L344.5,422.4 L345.6,422.4 L346.7,422.4
		L347.8,422.4 L348.9,422.4 L350.0,422.4 L351.1,422.4 L352.1,422.4 L353.2,422.4 L354.3,422.4 L355.4,422.4
		L356.5,422.4 L357.6,422.4 L358.7,422.4 L359.7,422.4 L360.8,422.4 L361.9,422.4 L363.0,422.4 L364.1,422.4
		L365.2,422.4 L366.3,422.4 L367.3,422.4 L368.4,422.4 L369.5,422.4 L370.6,422.4 L371.7,422.4 L372.8,422.4
		L373.9,422.4 L374.9,422.4 L376.0,422.4 L377.1,422.4 L378.2,422.4 L379.3,422.4 L380.4,422.4 L381.5,422.4
		L382.6,422.4 L383.6,422.4 L384.7,422.4 L385.8,422.4 L386.9,422.4 L388.0,422.4 L389.1,422.4 L390.2,422.4
		L391.2,422.4 L392.3,422.4 L393.4,422.4 L394.5,422.4 L395.6,422.4 L396.7,422.4 L397.8,422.4 L398.8,422.4
		L399.9,422.4 L401.0,422.4 L402.1,422.4 L403.2,422.4 L404.3,422.4 L405.4,422.4 L406.4,422.4 L407.5,422.4
		L408.6,422.4 L409.7,422.4 L410.8,422.4 L411.9,422.4 L413.0,422.4 L414.1,422.4 L415.1,422.4 L416.2,422.4
		L417.3,422.4 L418.4,422.4 L419.5,422.4 L420.6,422.4 L421.7,422.4 L422.7,422.4 L423.8,422.4 L424.9,422.4
		L426.0,422.4 L427.1,422.4 L428.2,422.4 L429.3,422.4 L430.3,422.4 L431.4,422.4 L432.5,422.4 L433.6,422.4
		L434.7,422.4 L435.8,422.4 L436.9,422.4 L437.9,422.4 L439.0,422.4 L440.1,422.4 L441.2,422.4 L442.3,422.4
		L443.4,422.4 L444.5,422.4 L445.6,422.4 L446.6,422.4 L447.7,422.4 L448.8,422.4 L449.9,422.4 L451.0,422.4
		L452.1,422.4 L453.2,422.4 L454.2,422.4 L455.3,422.4 L456.4,422.4 L457.5,422.4 L458.6,422.4 L459.7,422.4
		L460.8,422.4 L461.8,422.4 L462.9,422.4 L464.0,422.4 L465.1,422.4 L466.2,422.4 L467.3,422.4 L468.4,422.4
		L469.4,422.4 L470.5,422.4 L471.6,422.4 L472.7,422.4 L473.8,422.4 L474.9,422.4 L476.0,422.4 L477.1,422.4
		L478.1,422.4 L479.2,422.4 L480.3,422.4 L481.4,422.4 L482.5,422.4 L483.6,422.4 L484.7,422.4 L485.7,422.4
		L486.8,422.4 L487.9,422.4 L489.0,422.4 L490.1,422.4 L491.2,422.4 L492.3,422.4 L493.3,422.4 L494.4,422.4
		L495.5,422.4 L496.6,422.4 L497.7,422.4 L498.8,422.4 L499.9,422.4 L500.9,422.4 L502.0,422.4 L503.1,422.4
		L504.2,422.4 L505.3,422.4 L506.4,422.4 L507.5,422.4 L508.6,422.4 L509.6,422.4 L510.7,422.4 L511.8,422.4
		L512.9,422.4 L514.0,422.4 L515.1,422.4 L516.2,422.4 L517.2,422.4 L518.3,422.4 L519.4,422.4 L520.5,422.4
		L521.6,422.4 L522.7,422.4 L523.8,422.4 L524.8,422.4 L525.9,422.4 L527.0,422.4 L528.1,422.4 L529.2,422.4
		L530.3,422.4 L531.4,422.4 L532.4,422.4 L533.5,422.4 L534.6,422.4 L535.7,422.4 L536.8,422.4 L537.9,422.4
		L539.0,422.4 L540.1,422.4 L541.1,422.4 L542.2,422.4 L543.3,422.4 L544.4,422.4 L545.5,422.4 L546.6,422.4
		L547.7,422.4 L548.7,422.4 L549.8,422.4 L550.9,422.4 L552.0,422.4 L553.1,422.4 L554.2,422.4 L555.3,422.4
		L556.3,422.4 L557.4,422.4 L558.5,422.4 L559.6,422.4 L560.7,422.4 L561.8,422.4 L562.9,422.4 L563.9,422.4
		L565.0,422.4 L566.1,422.4 L567.2,422.4 L568.3,422.4 L569.4,422.4 L570.5,422.4 L571.6,422.4 L572.6,422.4
		L573.7,422.4 L574.8,422.4 L575.9,422.4 L577.0,422.4 L578.1,422.4 L579.2,422.4 L580.2,422.4 L581.3,422.4
		L582.4,422.4 L583.5,422.4 L584.6,422.4 L585.7,422.4 L586.8,422.4 L587.8,422.4 L588.9,422.4 L590.0,422.4
		L591.1,422.4 L592.2,422.4 L593.3,422.4 L594.4,422.4 L595.4,422.4 L596.5,422.4 L597.6,422.4 L598.7,422.4
		L599.8,422.4 L600.9,422.4 L602.0,422.4 L603.1,422.4 L604.1,422.4 L605.2,422.4 L606.3,422.4 L607.4,422.4
		L608.5,422.4 L609.6,422.4 L610.7,422.4 L611.7,422.4 L612.8,422.4 L613.9,422.4  '/></g>
	</g>
	<g id="gnuplot_plot_6" ><title>W = 14</title>
<g fill="none" color="black" stroke="currentColor" stroke-width="1.00" stroke-linecap="butt" stroke-linejoin="miter">
	<g transform="translate(547.9,130.0)" stroke="none" fill="black" font-family="Arial" font-size="12.00"  text-anchor="end">
		<text><tspan font-family="Arial" >W = 14</tspan></text>
	</g>
</g>
<g fill="none" color="black" stroke="currentColor" stroke-width="1.00" stroke-linecap="butt" stroke-linejoin="miter">
	<path stroke='rgb(  0, 114, 178)'  d='M556.2,126.1 L598.4,126.1 M71.9,20.1 L73.0,155.0 L74.1,18.1 L75.2,152.2 L76.2,20.2 L77.3,154.4
		L78.4,288.2 L79.5,422.4 L80.6,422.4 L81.7,422.4 L82.8,422.4 L83.8,422.4 L84.9,422.4 L86.0,422.4
		L87.1,422.4 L88.2,422.4 L89.3,422.4 L90.4,422.4 L91.5,422.4 L92.5,422.4 L93.6,422.4 L94.7,422.4
		L95.8,422.4 L96.9,422.4 L98.0,422.4 L99.1,422.4 L100.1,422.4 L101.2,422.4 L102.3,422.4 L103.4,422.4
		L104.5,422.4 L105.6,422.4 L106.7,422.4 L107.7,422.4 L108.8,422.4 L109.9,422.4 L111.0,422.4 L112.1,422.4
		L113.2,422.4 L114.3,422.4 L115.3,422.4 L116.4,422.4 L117.5,422.4 L118.6,422.4 L119.7,422.4 L120.8,422.4
		L121.9,422.4 L123.0,422.4 L124.0,422.4 L125.1,422.4 L126.2,422.4 L127.3,422.4 L128.4,422.4 L129.5,422.4
		L130.6,422.4 L131.6,422.4 L132.7,422.4 L133.8,422.4 L134.9,422.4 L136.0,422.4 L137.1,422.4 L138.2,422.4
		L139.2,422.4 L140.3,422.4 L141.4,422.4 L142.5,422.4 L143.6,422.4 L144.7,422.4 L145.8,422.4 L146.8,422.4
		L147.9,422.4 L149.0,422.4 L150.1,422.4 L151.2,422.4 L152.3,422.4 L153.4,422.4 L154.5,422.4 L155.5,422.4
		L156.6,422.4 L157.7,422.4 L158.8,422.4 L159.9,422.4 L161.0,422.4 L162.1,422.4 L163.1,422.4 L164.2,422.4
		L165.3,422.4 L166.4,422.4 L167.5,422.4 L168.6,422.4 L169.7,422.4 L170.7,422.4 L171.8,422.4 L172.9,422.4
		L174.0,422.4 L175.1,422.4 L176.2,422.4 L177.3,422.4 L178.3,422.4 L179.4,422.4 L180.5,422.4 L181.6,422.4
		L182.7,422.4 L183.8,422.4 L184.9,422.4 L186.0,422.4 L187.0,422.4 L188.1,422.4 L189.2,422.4 L190.3,422.4
		L191.4,422.4 L192.5,422.4 L193.6,422.4 L194.6,422.4 L195.7,422.4 L196.8,422.4 L197.9,422.4 L199.0,422.4
		L200.1,422.4 L201.2,422.4 L202.2,422.4 L203.3,422.4 L204.4,422.4 L205.5,422.4 L206.6,422.4 L207.7,422.4
		L208.8,422.4 L209.8,422.4 L210.9,422.4 L212.0,422.4 L213.1,422.4 L214.2,422.4 L215.3,422.4 L216.4,422.4
		L217.5,422.4 L218.5,422.4 L219.6,422.4 L220.7,422.4 L221.8,422.4 L222.9,422.4 L224.0,422.4 L225.1,422.4
		L226.1,422.4 L227.2,422.4 L228.3,422.4 L229.4,422.4 L230.5,422.4 L231.6,422.4 L232.7,422.4 L233.7,422.4
		L234.8,422.4 L235.9,422.4 L237.0,422.4 L238.1,422.4 L239.2,422.4 L240.3,422.4 L241.3,422.4 L242.4,422.4
		L243.5,422.4 L244.6,422.4 L245.7,422.4 L246.8,422.4 L247.9,422.4 L249.0,422.4 L250.0,422.4 L251.1,422.4
		L252.2,422.4 L253.3,422.4 L254.4,422.4 L255.5,422.4 L256.6,422.4 L257.6,422.4 L258.7,422.4 L259.8,422.4
		L260.9,422.4 L262.0,422.4 L263.1,422.4 L264.2,422.4 L265.2,422.4 L266.3,422.4 L267.4,422.4 L268.5,422.4
		L269.6,422.4 L270.7,422.4 L271.8,422.4 L272.8,422.4 L273.9,422.4 L275.0,422.4 L276.1,422.4 L277.2,422.4
		L278.3,422.4 L279.4,422.4 L280.5,422.4 L281.5,422.4 L282.6,422.4 L283.7,422.4 L284.8,422.4 L285.9,422.4
		L287.0,422.4 L288.1,422.4 L289.1,422.4 L290.2,422.4 L291.3,422.4 L292.4,422.4 L293.5,422.4 L294.6,422.4
		L295.7,422.4 L296.7,422.4 L297.8,422.4 L298.9,422.4 L300.0,422.4 L301.1,422.4 L302.2,422.4 L303.3,422.4
		L304.3,422.4 L305.4,422.4 L306.5,422.4 L307.6,422.4 L308.7,422.4 L309.8,422.4 L310.9,422.4 L312.0,422.4
		L313.0,422.4 L314.1,422.4 L315.2,422.4 L316.3,422.4 L317.4,422.4 L318.5,422.4 L319.6,422.4 L320.6,422.4
		L321.7,422.4 L322.8,422.4 L323.9,422.4 L325.0,422.4 L326.1,422.4 L327.2,422.4 L328.2,422.4 L329.3,422.4
		L330.4,422.4 L331.5,422.4 L332.6,422.4 L333.7,422.4 L334.8,422.4 L335.8,422.4 L336.9,422.4 L338.0,422.4
		L339.1,422.4 L340.2,422.4 L341.3,422.4 L342.4,422.4 L343.4,422.4 L344.5,422.4 L345.6,422.4 L346.7,422.4
		L347.8,422.4 L348.9,422.4 L350.0,422.4 L351.1,422.4 L352.1,422.4 L353.2,422.4 L354.3,422.4 L355.4,422.4
		L356.5,422.4 L357.6,422.4 L358.7,422.4 L359.7,422.4 L360.8,422.4 L361.9,422.4 L363.0,422.4 L364.1,422.4
		L365.2,422.4 L366.3,422.4 L367.3,422.4 L368.4,422.4 L369.5,422.4 L370.6,422.4 L371.7,422.4 L372.8,422.4
		L373.9,422.4 L374.9,422.4 L376.0,422.4 L377.1,422.4 L378.2,422.4 L379.3,422.4 L380.4,422.4 L381.5,422.4
		L382.6,422.4 L383.6,422.4 L384.7,422.4 L385.8,422.4 L386.9,422.4 L388.0,422.4 L389.1,422.4 L390.2,422.4
		L391.2,422.4 L392.3,422.4 L393.4,422.4 L394.5,422.4 L395.6,422.4 L396.7,422.4 L397.8,422.4 L398.8,422.4
		L399.9,422.4 L401.0,422.4 L402.1,422.4 L403.2,422.4 L404.3,422.4 L405.4,422.4 L406.4,422.4 L407.5,422.4
		L408.6,422.4 L409.7,422.4 L410.8,422.4 L411.9,422.4 L413.0,422.4 L414.1,422.4 L415.1,422.4 L416.2,422.4
		L417.3,422.4 L418.4,422.4 L419.5,422.4 L420.6,422.4 L421.7,422.4 L422.7,422.4 L423.8,422.4 L424.9,422.4
		L426.0,422.4 L427.1,422.4 L428.2,422.4 L429.3,422.4 L430.3,422.4 L431.4,422.4 L432.5,422.4 L433.6,422.4
		L434.7,422.4 L435.8,422.4 L436.9,422.4 L437.9,422.4 L439.0,422.4 L440.1,422.4 L441.2,422.4 L442.3,422.4
		L443.4,422.4 L444.5,422.4 L445.6,422.4 L446.6,422.4 L447.7,422.4 L448.8,422.4 L449.9,422.4 L451.0,422.4
		L452.1,422.4 L453.2,422.4 L454.2,422.4 L455.3,422.4 L456.4,422.4 L457.5,422.4 L458.6,422.4 L459.7,422.4
		L460.8,422.4 L461.8,422.4 L462.9,422.4 L464.0,422.4 L465.1,422.4 L466.2,422.4 L467.3,422.4 L468.4,422.4
		L469.4,422.4 L470.5,422.4 L471.6,422.4 L472.7,422.4 L473.8,422.4 L474.9,422.4 L476.0,422.4 L477.1,422.4
		L478.1,422.4 L479.2,422.4 L480.3,422.4 L481.4,422.4 L482.5,422.4 L483.6,422.4 L484.7,422.4 L485.7,422.4
		L486.8,422.4 L487.9,422.4 L489.0,422.4 L490.1,422.4 L491.2,422.4 L492.3,422.4 L493.3,422.4 L494.4,422.4
		L495.5,422.4 L496.6,422.4 L497.7,422.4 L498.8,422.4 L499.9,422.4 L500.9,422.4 L502.0,422.4 L503.1,422.4
		L504.2,422.4 L505.3,422.4 L506.4,422.4 L507.5,422.4 L508.6,422.4 L509.6,422.4 L510.7,422.4 L511.8,422.4
		L512.9,422.4 L514.0,422.4 L515.1,422.4 L516.2,422.4 L517.2,422.4 L518.3,422.4 L519.4,422.4 L520.5,422.4
		L521.6,422.4 L522.7,422.4 L523.8,422.4 L524.8,422.4 L525.9,422.4 L527.0,422.4 L528.1,422.4 L529.2,422.4
		L530.3,422.4 L531.4,422.4 L532.4,422.4 L533.5,422.4 L534.6,422.4 L535.7,422.4 L536.8,422.4 L537.9,422.4
		L539.0,422.4 L540.1,422.4 L541.1,422.4 L542.2,422.4 L543.3,422.4 L544.4,422.4 L545.5,422.4 L546.6,422.4
		L547.7,422.4 L548.7,422.4 L549.8,422.4 L550.9,422.4 L552.0,422.4 L553.1,422.4 L554.2,422.4 L555.3,422.4
		L556.3,422.4 L557.4,422.4 L558.5,422.4 L559.6,422.4 L560.7,422.4 L561.8,422.4 L562.9,422.4 L563.9,422.4
		L565.0,422.4 L566.1,422.4 L567.2,422.4 L568.3,422.4 L569.4,422.4 L570.5,422.4 L571.6,422.4 L572.6,422.4
		L573.7,422.4 L574.8,422.4 L575.9,422.4 L577.0,422.4 L578.1,422.4 L579.2,422.4 L580.2,422.4 L581.3,422.4
		L582.4,422.4 L583.5,422.4 L584.6,422.4 L585.7,422.4 L586.8,422.4 L587.8,422.4 L588.9,422.4 L590.0,422.4
		L591.1,422.4 L592.2,422.4 L593.3,422.4 L594.4,422.4 L595.4,422.4 L596.5,422.4 L597.6,422.4 L598.7,422.4
		L599.8,422.4 L600.9,422.4 L602.0,422.4 L603.1,422.4 L604.1,422.4 L605.2,422.4 L606.3,422.4 L607.4,422.4
		L608.5,422.4 L609.6,422.4 L610.7,422.4 L611.7,422.4 L612.8,422.4 L613.9,422.4  '/></g>
	</g>
	<g id="gnuplot_plot_7" ><title>W = 16</title>
<g fill="none" color="black" stroke="currentColor" stroke-width="1.00" stroke-linecap="butt" stroke-linejoin="miter">
	<g transform="translate(547.9,148.0)" stroke="none" fill="black" font-family="Arial" font-size="12.00"  text-anchor="end">
		<text><tspan font-family="Arial" >W = 16</tspan></text>
	</g>
</g>
<g fill="none" color="black" stroke="currentColor" stroke-width="1.00" stroke-linecap="butt" stroke-linejoin="miter">
	<path stroke='rgb(229,  30,  16)'  d='M556.2,144.1 L598.4,144.1 M71.9,20.1 L73.0,155.0 L74.1,18.1 L75.2,152.2 L76.2,20.2 L77.3,154.4
		L78.4,288.2 L79.5,422.4 L80.6,422.4 L81.7,422.4 L82.8,422.4 L83.8,422.4 L84.9,422.4 L86.0,422.4
		L87.1,422.4 L88.2,422.4 L89.3,422.4 L90.4,422.4 L91.5,422.4 L92.5,422.4 L93.6,422.4 L94.7,422.4
		L95.8,422.4 L96.9,422.4 L98.0,422.4 L99.1,422.4 L100.1,422.4 L101.2,422.4 L102.3,422.4 L103.4,422.4
		L104.5,422.4 L105.6,422.4 L106.7,422.4 L107.7,422.4 L108.8,422.4 L109.9,422.4 L111.0,422.4 L112.1,422.4
		L113.2,422.4 L114.3,422.4 L115.3,422.4 L116.4,422.4 L117.5,422.4 L118.6,422.4 L119.7,422.4 L120.8,422.4
		L121.9,422.4 L123.0,422.4 L124.0,422.4 L125.1,422.4 L126.2,422.4 L127.3,422.4 L128.4,422.4 L129.5,422.4
		L130.6,422.4 L131.6,422.4 L132.7,422.4 L133.8,422.4 L134.9,422.4 L136.0,422.4 L137.1,422.4 L138.2,422.4
		L139.2,422.4 L140.3,422.4 L141.4,422.4 L142.5,422.4 L143.6,422.4 L144.7,422.4 L145.8,422.4 L146.8,422.4
		L147.9,422.4 L149.0,422.4 L150.1,422.4 L151.2,422.4 L152.3,422.4 L153.4,422.4 L154.5,422.4 L155.5,422.4
		L156.6,422.4 L157.7,422.4 L158.8,422.4 L159.9,422.4 L161.0,422.4 L162.1,422.4 L163.1,422.4 L164.2,422.4
		L165.3,422.4 L166.4,422.4 L167.5,422.4 L168.6,422.4 L169.7,422.4 L170.7,422.4 L171.8,422.4 L172.9,422.4
		L174.0,422.4 L175.1,422.4 L176.2,422.4 L177.3,422.4 L178.3,422.4 L179.4,422.4 L180.5,422.4 L181.6,422.4
		L182.7,422.4 L183.8,422.4 L184.9,422.4 L186.0,422.4 L187.0,422.4 L188.1,422.4 L189.2,422.4 L190.3,422.4
		L191.4,422.4 L192.5,422.4 L193.6,422.4 L194.6,422.4 L195.7,422.4 L196.8,422.4 L197.9,422.4 L199.0,422.4
		L200.1,422.4 L201.2,422.4 L202.2,422.4 L203.3,422.4 L204.4,422.4 L205.5,422.4 L206.6,422.4 L207.7,422.4
		L208.8,422.4 L209.8,422.4 L210.9,422.4 L212.0,422.4 L213.1,422.4 L214.2,422.4 L215.3,422.4 L216.4,422.4
		L217.5,422.4 L218.5,422.4 L219.6,422.4 L220.7,422.4 L221.8,422.4 L222.9,422.4 L224.0,422.4 L225.1,422.4
		L226.1,422.4 L227.2,422.4 L228.3,422.4 L229.4,422.4 L230.5,422.4 L231.6,422.4 L232.7,422.4 L233.7,422.4
		L234.8,422.4 L235.9,422.4 L237.0,422.4 L238.1,422.4 L239.2,422.4 L240.3,422.4 L241.3,422.4 L242.4,422.4
		L243.5,422.4 L244.6,422.4 L245.7,422.4 L246.8,422.4 L247.9,422.4 L249.0,422.4 L250.0,422.4 L251.1,422.4
		L252.2,422.4 L253.3,422.4 L254.4,422.4 L255.5,422.4 L256.6,422.4 L257.6,422.4 L258.7,422.4 L259.8,422.4
		L260.9,422.4 L262.0,422.4 L263.1,422.4 L264.2,422.4 L265.2,422.4 L266.3,422.4 L267.4,422.4 L268.5,422.4
		L269.6,422.4 L270.7,422.4 L271.8,422.4 L272.8,422.4 L273.9,422.4 L275.0,422.4 L276.1,422.4 L277.2,422.4
		L278.3,422.4 L279.4,422.4 L280.5,422.4 L281.5,422.4 L282.6,422.4 L283.7,422.4 L284.8,422.4 L285.9,422.4
		L287.0,422.4 L288.1,422.4 L289.1,422.4 L290.2,422.4 L291.3,422.4 L292.4,422.4 L293.5,422.4 L294.6,422.4
		L295.7,422.4 L296.7,422.4 L297.8,422.4 L298.9,422.4 L300.0,422.4 L301.1,422.4 L302.2,422.4 L303.3,422.4
		L304.3,422.4 L305.4,422.4 L306.5,422.4 L307.6,422.4 L308.7,422.4 L309.8,422.4 L310.9,422.4 L312.0,422.4
		L313.0,422.4 L314.1,422.4 L315.2,422.4 L316.3,422.4 L317.4,422.4 L318.5,422.4 L319.6,422.4 L320.6,422.4
		L321.7,422.4 L322.8,422.4 L323.9,422.4 L325.0,422.4 L326.1,422.4 L327.2,422.4 L328.2,422.4 L329.3,422.4
		L330.4,422.4 L331.5,422.4 L332.6,422.4 L333.7,422.4 L334.8,422.4 L335.8,422.4 L336.9,422.4 L338.0,422.4
		L339.1,422.4 L340.2,422.4 L341.3,422.4 L342.4,422.4 L343.4,422.4 L344.5,422.4 L345.6,422.4 L346.7,422.4
		L347.8,422.4 L348.9,422.4 L350.0,422.4 L351.1,422.4 L352.1,422.4 L353.2,422.4 L354.3,422.4 L355.4,422.4
		L356.5,422.4 L357.6,422.4 L358.7,422.4 L359.7,422.4 L360.8,422.4 L361.9,422.4 L363.0,422.4 L364.1,422.4
		L365.2,422.4 L366.3,422.4 L367.3,422.4 L368.4,422.4 L369.5,422.4 L370.6,422.4 L371.7,422.4 L372.8,422.4
		L373.9,422.4 L374.9,422.4 L376.0,422.4 L377.1,422.4 L378.2,422.4 L379.3,422.4 L380.4,422.4 L381.5,422.4
		L382.6,422.4 L383.6,422.4 L384.7,422.4 L385.8,422.4 L386.9,422.4 L388.0,422.4 L389.1,422.4 L390.2,422.4
		L391.2,422.4 L392.3,422.4 L393.4,422.4 L394.5,422.4 L395.6,422.4 L396.7,422.4 L397.8,422.4 L398.8,422.4
		L399.9,422.4 L401.0,422.4 L402.1,422.4 L403.2,422.4 L404.3,422.4 L405.4,422.4 L406.4,422.4 L407.5,422.4
		L408.6,422.4 L409.7,422.4 L410.8,422.4 L411.9,422.4 L413.0,422.4 L414.1,422.4 L415.1,422.4 L416.2,422.4
		L417.3,422.4 L418.4,422.4 L419.5,422.4 L420.6,422.4 L421.7,422.4 L422.7,422.4 L423.8,422.4 L424.9,422.4
		L426.0,422.4 L427.1,422.4 L428.2,422.4 L429.3,422.4 L430.3,422.4 L431.4,422.4 L432.5,422.4 L433.6,422.4
		L434.7,422.4 L435.8,422.4 L436.9,422.4 L437.9,422.4 L439.0,422.4 L440.1,422.4 L441.2,422.4 L442.3,422.4
		L443.4,422.4 L444.5,422.4 L445.6,422.4 L446.6,422.4 L447.7,422.4 L448.8,422.4 L449.9,422.4 L451.0,422.4
		L452.1,422.4 L453.2,422.4 L454.2,422.4 L455.3,422.4 L456.4,422.4 L457.5,422.4 L458.6,422.4 L459.7,422.4
		L460.8,422.4 L461.8,422.4 L462.9,422.4 L464.0,422.4 L465.1,422.4 L466.2,422.4 L467.3,422.4 L468.4,422.4
		L469.4,422.4 L470.5,422.4 L471.6,422.4 L472.7,422.4 L473.8,422.4 L474.9,422.4 L476.0,422.4 L477.1,422.4
		L478.1,422.4 L479.2,422.4 L480.3,422.4 L481.4,422.4 L482.5,422.4 L483.6,422.4 L484.7,422.4 L485.7,422.4
		L486.8,422.4 L487.9,422.4 L489.0,422.4 L490.1,422.4 L491.2,422.4 L492.3,422.4 L493.3,422.4 L494.4,422.4
		L495.5,422.4 L496.6,422.4 L497.7,422.4 L498.8,422.4 L499.9,422.4 L500.9,422.4 L502.0,422.4 L503.1,422.4
		L504.2,422.4 L505.3,422.4 L506.4,422.4 L507.5,422.4 L508.6,422.4 L509.6,422.4 L510.7,422.4 L511.8,422.4
		L512.9,422.4 L514.0,422.4 L515.1,422.4 L516.2,422.4 L517.2,422.4 L518.3,422.4 L519.4,422.4 L520.5,422.4
		L521.6,422.4 L522.7,422.4 L523.8,422.4 L524.8,422.4 L525.9,422.4 L527.0,422.4 L528.1,422.4 L529.2,422.4
		L530.3,422.4 L531.4,422.4 L532.4,422.4 L533.5,422.4 L534.6,422.4 L535.7,422.4 L536.8,422.4 L537.9,422.4
		L539.0,422.4 L540.1,422.4 L541.1,422.4 L542.2,422.4 L543.3,422.4 L544.4,422.4 L545.5,422.4 L546.6,422.4
		L547.7,422.4 L548.7,422.4 L549.8,422.4 L550.9,422.4 L552.0,422.4 L553.1,422.4 L554.2,422.4 L555.3,422.4
		L556.3,422.4 L557.4,422.4 L558.5,422.4 L559.6,422.4 L560.7,422.4 L561.8,422.4 L562.9,422.4 L563.9,422.4
		L565.0,422.4 L566.1,422.4 L567.2,422.4 L568.3,422.4 L569.4,422.4 L570.5,422.4 L571.6,422.4 L572.6,422.4
		L573.7,422.4 L574.8,422.4 L575.9,422.4 L577.0,422.4 L578.1,422.4 L579.2,422.4 L580.2,422.4 L581.3,422.4
		L582.4,422.4 L583.5,422.4 L584.6,422.4 L585.7,422.4 L586.8,422.4 L587.8,422.4 L588.9,422.4 L590.0,422.4
		L591.1,422.4 L592.2,422.4 L593.3,422.4 L594.4,422.4 L595.4,422.4 L596.5,422.4 L597.6,422.4 L598.7,422.4
		L599.8,422.4 L600.9,422.4 L602.0,422.4 L603.1,422.4 L604.1,422.4 L605.2,422.4 L606.3,422.4 L607.4,422.4
		L608.5,422.4 L609.6,422.4 L610.7,422.4 L611.7,422.4 L612.8,422.4 L613.9,422.4  '/></g>
	</g>
<g fill="none" color="white" stroke="rgb(229,  30,  16)" stroke-width="2.00" stroke-linecap="butt" stroke-linejoin="miter">
</g>
<g fill="none" color="black" stroke="currentColor" stroke-width="2.00" stroke-linecap="butt" stroke-linejoin="miter">
</g>
<g fill="none" color="black" stroke="black" stroke-width="1.00" stroke-linecap="butt" stroke-linejoin="miter">
</g>
<g fill="none" color="black" stroke="currentColor" stroke-width="1.00" stroke-linecap="butt" stroke-linejoin="miter">
	<path stroke='black'  d='M71.9,18.1 L71.9,422.4 L615.0,422.4 L615.0,18.1 L71.9,18.1 Z  '/></g>
<g fill="none" color="black" stroke="currentColor" stroke-width="1.00" stroke-linecap="butt" stroke-linejoin="miter">
</g>
</g>
</svg>

