

================================================================
== Vivado HLS Report for 'Execute'
================================================================
* Date:           Sat Dec 18 13:51:05 2021

* Version:        2018.2 (Build 2258646 on Thu Jun 14 20:25:20 MDT 2018)
* Project:        hls_project_space_3_8
* Solution:       solution
* Product family: zynq
* Target device:  xc7z020clg484-1


================================================================
== Performance Estimates
================================================================
+ Timing (ns): 
    * Summary: 
    +--------+-------+----------+------------+
    |  Clock | Target| Estimated| Uncertainty|
    +--------+-------+----------+------------+
    |ap_clk  |  10.00|     8.460|        1.25|
    +--------+-------+----------+------------+

+ Latency (clock cycles): 
    * Summary: 
    +-----+-----+-----+-----+---------+
    |  Latency  |  Interval | Pipeline|
    | min | max | min | max |   Type  |
    +-----+-----+-----+-----+---------+
    |  109|  109|  109|  109|   none  |
    +-----+-----+-----+-----+---------+

    + Detail: 
        * Instance: 
        N/A

        * Loop: 
        +------------------------------+-----+-----+----------+-----------+-----------+------+----------+
        |                              |  Latency  | Iteration|  Initiation Interval  | Trip |          |
        |           Loop Name          | min | max |  Latency |  achieved |   target  | Count| Pipelined|
        +------------------------------+-----+-----+----------+-----------+-----------+------+----------+
        |- space_exact_execute_i       |  108|  108|        54|          -|          -|     2|    no    |
        | + space_exact_execute_j      |   52|   52|        26|          -|          -|     2|    no    |
        |  ++ space_exact_execute_e    |   24|   24|         8|          -|          -|     3|    no    |
        |   +++ space_exact_execute_r  |    6|    6|         2|          -|          -|     3|    no    |
        +------------------------------+-----+-----+----------+-----------+-----------+------+----------+



================================================================
== Utilization Estimates
================================================================
* Summary: 
+-----------------+---------+-------+--------+-------+
|       Name      | BRAM_18K| DSP48E|   FF   |  LUT  |
+-----------------+---------+-------+--------+-------+
|DSP              |        -|      -|       -|      -|
|Expression       |        -|      0|       0|    176|
|FIFO             |        -|      -|       -|      -|
|Instance         |        -|      -|       0|    130|
|Memory           |        -|      -|       -|      -|
|Multiplexer      |        -|      -|       -|     92|
|Register         |        -|      -|      53|      -|
+-----------------+---------+-------+--------+-------+
|Total            |        0|      0|      53|    398|
+-----------------+---------+-------+--------+-------+
|Available        |      280|    220|  106400|  53200|
+-----------------+---------+-------+--------+-------+
|Utilization (%)  |        0|      0|   ~0   |   ~0  |
+-----------------+---------+-------+--------+-------+

+ Detail: 
    * Instance: 
    +-------------------------+----------------------+---------+-------+---+----+
    |         Instance        |        Module        | BRAM_18K| DSP48E| FF| LUT|
    +-------------------------+----------------------+---------+-------+---+----+
    |space_top_accel_mbkb_U1  |space_top_accel_mbkb  |        0|      0|  0|  65|
    |space_top_accel_mcud_U2  |space_top_accel_mcud  |        0|      0|  0|  65|
    +-------------------------+----------------------+---------+-------+---+----+
    |Total                    |                      |        0|      0|  0| 130|
    +-------------------------+----------------------+---------+-------+---+----+

    * DSP48: 
    N/A

    * Memory: 
    N/A

    * FIFO: 
    N/A

    * Expression: 
    +---------------------+----------+-------+---+----+------------+------------+
    |    Variable Name    | Operation| DSP48E| FF| LUT| Bitwidth P0| Bitwidth P1|
    +---------------------+----------+-------+---+----+------------+------------+
    |p_Val2_1_fu_507_p2   |     *    |      0|  0|  41|           8|           8|
    |e_1_fu_390_p2        |     +    |      0|  0|  10|           2|           1|
    |i_1_fu_362_p2        |     +    |      0|  0|  10|           2|           1|
    |j_1_fu_378_p2        |     +    |      0|  0|  10|           2|           1|
    |r_1_fu_430_p2        |     +    |      0|  0|  10|           2|           1|
    |sum_V_fu_523_p2      |     +    |      0|  0|  15|           8|           8|
    |tmp_3_fu_445_p10     |     +    |      0|  0|  13|           4|           4|
    |tmp_6_t_fu_414_p2    |     +    |      0|  0|  10|           2|           2|
    |tmp_t_fu_460_p2      |     +    |      0|  0|  10|           2|           2|
    |tmp_5_fu_408_p2      |     -    |      0|  0|  13|           4|           4|
    |exitcond1_fu_356_p2  |   icmp   |      0|  0|   9|           2|           3|
    |exitcond2_fu_372_p2  |   icmp   |      0|  0|   9|           2|           3|
    |exitcond3_fu_384_p2  |   icmp   |      0|  0|   8|           2|           2|
    |exitcond_fu_424_p2   |   icmp   |      0|  0|   8|           2|           2|
    +---------------------+----------+-------+---+----+------------+------------+
    |Total                |          |      0|  0| 176|          44|          42|
    +---------------------+----------+-------+---+----+------------+------------+

    * Multiplexer: 
    +------------------+----+-----------+-----+-----------+
    |       Name       | LUT| Input Size| Bits| Total Bits|
    +------------------+----+-----------+-----+-----------+
    |ap_NS_fsm         |  38|          7|    1|          7|
    |e_reg_322         |   9|          2|    2|          4|
    |i_reg_282         |   9|          2|    2|          4|
    |j_reg_294         |   9|          2|    2|          4|
    |p_Val2_s_reg_333  |   9|          2|    8|         16|
    |r_reg_345         |   9|          2|    2|          4|
    |sum_2_reg_306     |   9|          2|    8|         16|
    +------------------+----+-----------+-----+-----------+
    |Total             |  92|         19|   25|         55|
    +------------------+----+-----------+-----+-----------+

    * Register: 
    +------------------+---+----+-----+-----------+
    |       Name       | FF| LUT| Bits| Const Bits|
    +------------------+---+----+-----+-----------+
    |ap_CS_fsm         |  6|   0|    6|          0|
    |e_1_reg_676       |  2|   0|    2|          0|
    |e_reg_322         |  2|   0|    2|          0|
    |i_1_reg_656       |  2|   0|    2|          0|
    |i_reg_282         |  2|   0|    2|          0|
    |j_1_reg_668       |  2|   0|    2|          0|
    |j_reg_294         |  2|   0|    2|          0|
    |p_Val2_2_reg_702  |  8|   0|    8|          0|
    |p_Val2_s_reg_333  |  8|   0|    8|          0|
    |r_1_reg_697       |  2|   0|    2|          0|
    |r_reg_345         |  2|   0|    2|          0|
    |sum_2_reg_306     |  8|   0|    8|          0|
    |tmp_10_reg_661    |  1|   0|    1|          0|
    |tmp_5_reg_681     |  4|   0|    4|          0|
    |tmp_6_t_reg_686   |  2|   0|    2|          0|
    +------------------+---+----+-----+-----------+
    |Total             | 53|   0|   53|          0|
    +------------------+---+----+-----+-----------+



================================================================
== Interface
================================================================
* Summary: 
+---------------------+-----+-----+------------+-------------------+--------------+
|      RTL Ports      | Dir | Bits|  Protocol  |   Source Object   |    C Type    |
+---------------------+-----+-----+------------+-------------------+--------------+
|ap_clk               |  in |    1| ap_ctrl_hs |      Execute      | return value |
|ap_rst               |  in |    1| ap_ctrl_hs |      Execute      | return value |
|ap_start             |  in |    1| ap_ctrl_hs |      Execute      | return value |
|ap_done              | out |    1| ap_ctrl_hs |      Execute      | return value |
|ap_idle              | out |    1| ap_ctrl_hs |      Execute      | return value |
|ap_ready             | out |    1| ap_ctrl_hs |      Execute      | return value |
|window_0_0_V_read    |  in |    8|   ap_none  | window_0_0_V_read |    scalar    |
|window_0_1_V_read    |  in |    8|   ap_none  | window_0_1_V_read |    scalar    |
|window_0_2_V_read    |  in |    8|   ap_none  | window_0_2_V_read |    scalar    |
|window_0_3_V_read    |  in |    8|   ap_none  | window_0_3_V_read |    scalar    |
|window_1_0_V_read    |  in |    8|   ap_none  | window_1_0_V_read |    scalar    |
|window_1_1_V_read    |  in |    8|   ap_none  | window_1_1_V_read |    scalar    |
|window_1_2_V_read    |  in |    8|   ap_none  | window_1_2_V_read |    scalar    |
|window_1_3_V_read    |  in |    8|   ap_none  | window_1_3_V_read |    scalar    |
|window_2_0_V_read    |  in |    8|   ap_none  | window_2_0_V_read |    scalar    |
|window_2_1_V_read    |  in |    8|   ap_none  | window_2_1_V_read |    scalar    |
|window_2_2_V_read    |  in |    8|   ap_none  | window_2_2_V_read |    scalar    |
|window_2_3_V_read    |  in |    8|   ap_none  | window_2_3_V_read |    scalar    |
|window_3_0_V_read    |  in |    8|   ap_none  | window_3_0_V_read |    scalar    |
|window_3_1_V_read    |  in |    8|   ap_none  | window_3_1_V_read |    scalar    |
|window_3_2_V_read    |  in |    8|   ap_none  | window_3_2_V_read |    scalar    |
|window_3_3_V_read    |  in |    8|   ap_none  | window_3_3_V_read |    scalar    |
|kernel_0_0_V_read    |  in |    8|   ap_none  | kernel_0_0_V_read |    scalar    |
|kernel_0_1_V_read    |  in |    8|   ap_none  | kernel_0_1_V_read |    scalar    |
|kernel_0_2_V_read    |  in |    8|   ap_none  | kernel_0_2_V_read |    scalar    |
|kernel_1_0_V_read    |  in |    8|   ap_none  | kernel_1_0_V_read |    scalar    |
|kernel_1_1_V_read    |  in |    8|   ap_none  | kernel_1_1_V_read |    scalar    |
|kernel_1_2_V_read    |  in |    8|   ap_none  | kernel_1_2_V_read |    scalar    |
|kernel_2_0_V_read    |  in |    8|   ap_none  | kernel_2_0_V_read |    scalar    |
|kernel_2_1_V_read    |  in |    8|   ap_none  | kernel_2_1_V_read |    scalar    |
|kernel_2_2_V_read    |  in |    8|   ap_none  | kernel_2_2_V_read |    scalar    |
|output_0_0_V         | out |    8|   ap_vld   |    output_0_0_V   |    pointer   |
|output_0_0_V_ap_vld  | out |    1|   ap_vld   |    output_0_0_V   |    pointer   |
|output_0_1_V         | out |    8|   ap_vld   |    output_0_1_V   |    pointer   |
|output_0_1_V_ap_vld  | out |    1|   ap_vld   |    output_0_1_V   |    pointer   |
|output_1_0_V         | out |    8|   ap_vld   |    output_1_0_V   |    pointer   |
|output_1_0_V_ap_vld  | out |    1|   ap_vld   |    output_1_0_V   |    pointer   |
|output_1_1_V         | out |    8|   ap_vld   |    output_1_1_V   |    pointer   |
|output_1_1_V_ap_vld  | out |    1|   ap_vld   |    output_1_1_V   |    pointer   |
+---------------------+-----+-----+------------+-------------------+--------------+

