<?xml version="1.0" encoding="utf-8"  standalone="no"?>
<svg 
 width="640" height="480"
 viewBox="0 0 640 480"
 xmlns="http://www.w3.org/2000/svg"
 xmlns:xlink="http://www.w3.org/1999/xlink"
>

<title>Gnuplot</title>
<desc>Produced by GNUPLOT 5.2 patchlevel 8 </desc>

<g id="gnuplot_canvas">

<rect x="0" y="0" width="640" height="480" fill="none"/>
<defs>

	<circle id='gpDot' r='0.5' stroke-width='0.5' stroke='currentColor'/>
	<path id='gpPt0' stroke-width='0.222' stroke='currentColor' d='M-1,0 h2 M0,-1 v2'/>
	<path id='gpPt1' stroke-width='0.222' stroke='currentColor' d='M-1,-1 L1,1 M1,-1 L-1,1'/>
	<path id='gpPt2' stroke-width='0.222' stroke='currentColor' d='M-1,0 L1,0 M0,-1 L0,1 M-1,-1 L1,1 M-1,1 L1,-1'/>
	<rect id='gpPt3' stroke-width='0.222' stroke='currentColor' x='-1' y='-1' width='2' height='2'/>
	<rect id='gpPt4' stroke-width='0.222' stroke='currentColor' fill='currentColor' x='-1' y='-1' width='2' height='2'/>
	<circle id='gpPt5' stroke-width='0.222' stroke='currentColor' cx='0' cy='0' r='1'/>
	<use xlink:href='#gpPt5' id='gpPt6' fill='currentColor' stroke='none'/>
	<path id='gpPt7' stroke-width='0.222' stroke='currentColor' d='M0,-1.33 L-1.33,0.67 L1.33,0.67 z'/>
	<use xlink:href='#gpPt7' id='gpPt8' fill='currentColor' stroke='none'/>
	<use xlink:href='#gpPt7' id='gpPt9' stroke='currentColor' transform='rotate(180)'/>
	<use xlink:href='#gpPt9' id='gpPt10' fill='currentColor' stroke='none'/>
	<use xlink:href='#gpPt3' id='gpPt11' stroke='currentColor' transform='rotate(45)'/>
	<use xlink:href='#gpPt11' id='gpPt12' fill='currentColor' stroke='none'/>
	<path id='gpPt13' stroke-width='0.222' stroke='currentColor' d='M0,1.330 L1.265,0.411 L0.782,-1.067 L-0.782,-1.076 L-1.265,0.411 z'/>
	<use xlink:href='#gpPt13' id='gpPt14' fill='currentColor' stroke='none'/>
	<filter id='textbox' filterUnits='objectBoundingBox' x='0' y='0' height='1' width='1'>
	  <feFlood flood-color='white' flood-opacity='1' result='bgnd'/>
	  <feComposite in='SourceGraphic' in2='bgnd' operator='atop'/>
	</filter>
	<filter id='greybox' filterUnits='objectBoundingBox' x='0' y='0' height='1' width='1'>
	  <feFlood flood-color='lightgrey' flood-opacity='1' result='grey'/>
	  <feComposite in='SourceGraphic' in2='grey' operator='atop'/>
	</filter>
</defs>
<g fill="none" color="white" stroke="currentColor" stroke-width="1.00" stroke-linecap="butt" stroke-linejoin="miter">
</g>
<g fill="none" color="black" stroke="currentColor" stroke-width="1.00" stroke-linecap="butt" stroke-linejoin="miter">
	<path stroke='black'  d='M71.9,422.4 L80.9,422.4 M615.0,422.4 L606.0,422.4  '/>	<g transform="translate(63.6,426.3)" stroke="none" fill="black" font-family="Arial" font-size="12.00"  text-anchor="end">
		<text><tspan font-family="Arial" > 0</tspan></text>
	</g>
</g>
<g fill="none" color="black" stroke="currentColor" stroke-width="1.00" stroke-linecap="butt" stroke-linejoin="miter">
	<path stroke='black'  d='M71.9,341.5 L80.9,341.5 M615.0,341.5 L606.0,341.5  '/>	<g transform="translate(63.6,345.4)" stroke="none" fill="black" font-family="Arial" font-size="12.00"  text-anchor="end">
		<text><tspan font-family="Arial" > 0.2</tspan></text>
	</g>
</g>
<g fill="none" color="black" stroke="currentColor" stroke-width="1.00" stroke-linecap="butt" stroke-linejoin="miter">
	<path stroke='black'  d='M71.9,260.7 L80.9,260.7 M615.0,260.7 L606.0,260.7  '/>	<g transform="translate(63.6,264.6)" stroke="none" fill="black" font-family="Arial" font-size="12.00"  text-anchor="end">
		<text><tspan font-family="Arial" > 0.4</tspan></text>
	</g>
</g>
<g fill="none" color="black" stroke="currentColor" stroke-width="1.00" stroke-linecap="butt" stroke-linejoin="miter">
	<path stroke='black'  d='M71.9,179.8 L80.9,179.8 M615.0,179.8 L606.0,179.8  '/>	<g transform="translate(63.6,183.7)" stroke="none" fill="black" font-family="Arial" font-size="12.00"  text-anchor="end">
		<text><tspan font-family="Arial" > 0.6</tspan></text>
	</g>
</g>
<g fill="none" color="black" stroke="currentColor" stroke-width="1.00" stroke-linecap="butt" stroke-linejoin="miter">
	<path stroke='black'  d='M71.9,99.0 L80.9,99.0 M615.0,99.0 L606.0,99.0  '/>	<g transform="translate(63.6,102.9)" stroke="none" fill="black" font-family="Arial" font-size="12.00"  text-anchor="end">
		<text><tspan font-family="Arial" > 0.8</tspan></text>
	</g>
</g>
<g fill="none" color="black" stroke="currentColor" stroke-width="1.00" stroke-linecap="butt" stroke-linejoin="miter">
	<path stroke='black'  d='M71.9,18.1 L80.9,18.1 M615.0,18.1 L606.0,18.1  '/>	<g transform="translate(63.6,22.0)" stroke="none" fill="black" font-family="Arial" font-size="12.00"  text-anchor="end">
		<text><tspan font-family="Arial" > 1</tspan></text>
	</g>
</g>
<g fill="none" color="black" stroke="currentColor" stroke-width="1.00" stroke-linecap="butt" stroke-linejoin="miter">
	<path stroke='black'  d='M71.9,422.4 L71.9,413.4 M71.9,18.1 L71.9,27.1  '/>	<g transform="translate(71.9,444.3)" stroke="none" fill="black" font-family="Arial" font-size="12.00"  text-anchor="middle">
		<text><tspan font-family="Arial" > 0</tspan></text>
	</g>
</g>
<g fill="none" color="black" stroke="currentColor" stroke-width="1.00" stroke-linecap="butt" stroke-linejoin="miter">
	<path stroke='black'  d='M162.4,422.4 L162.4,413.4 M162.4,18.1 L162.4,27.1  '/>	<g transform="translate(162.4,444.3)" stroke="none" fill="black" font-family="Arial" font-size="12.00"  text-anchor="middle">
		<text><tspan font-family="Arial" > 0.05</tspan></text>
	</g>
</g>
<g fill="none" color="black" stroke="currentColor" stroke-width="1.00" stroke-linecap="butt" stroke-linejoin="miter">
	<path stroke='black'  d='M252.9,422.4 L252.9,413.4 M252.9,18.1 L252.9,27.1  '/>	<g transform="translate(252.9,444.3)" stroke="none" fill="black" font-family="Arial" font-size="12.00"  text-anchor="middle">
		<text><tspan font-family="Arial" > 0.1</tspan></text>
	</g>
</g>
<g fill="none" color="black" stroke="currentColor" stroke-width="1.00" stroke-linecap="butt" stroke-linejoin="miter">
	<path stroke='black'  d='M343.5,422.4 L343.5,413.4 M343.5,18.1 L343.5,27.1  '/>	<g transform="translate(343.5,444.3)" stroke="none" fill="black" font-family="Arial" font-size="12.00"  text-anchor="middle">
		<text><tspan font-family="Arial" > 0.15</tspan></text>
	</g>
</g>
<g fill="none" color="black" stroke="currentColor" stroke-width="1.00" stroke-linecap="butt" stroke-linejoin="miter">
	<path stroke='black'  d='M434.0,422.4 L434.0,413.4 M434.0,18.1 L434.0,27.1  '/>	<g transform="translate(434.0,444.3)" stroke="none" fill="black" font-family="Arial" font-size="12.00"  text-anchor="middle">
		<text><tspan font-family="Arial" > 0.2</tspan></text>
	</g>
</g>
<g fill="none" color="black" stroke="currentColor" stroke-width="1.00" stroke-linecap="butt" stroke-linejoin="miter">
	<path stroke='black'  d='M524.5,422.4 L524.5,413.4 M524.5,18.1 L524.5,27.1  '/>	<g transform="translate(524.5,444.3)" stroke="none" fill="black" font-family="Arial" font-size="12.00"  text-anchor="middle">
		<text><tspan font-family="Arial" > 0.25</tspan></text>
	</g>
</g>
<g fill="none" color="black" stroke="currentColor" stroke-width="1.00" stroke-linecap="butt" stroke-linejoin="miter">
	<path stroke='black'  d='M615.0,422.4 L615.0,413.4 M615.0,18.1 L615.0,27.1  '/>	<g transform="translate(615.0,444.3)" stroke="none" fill="black" font-family="Arial" font-size="12.00"  text-anchor="middle">
		<text><tspan font-family="Arial" > 0.3</tspan></text>
	</g>
</g>
<g fill="none" color="black" stroke="currentColor" stroke-width="1.00" stroke-linecap="butt" stroke-linejoin="miter">
</g>
<g fill="none" color="black" stroke="currentColor" stroke-width="1.00" stroke-linecap="butt" stroke-linejoin="miter">
	<path stroke='black'  d='M71.9,18.1 L71.9,422.4 L615.0,422.4 L615.0,18.1 L71.9,18.1 Z  '/></g>
<g fill="none" color="black" stroke="currentColor" stroke-width="1.00" stroke-linecap="butt" stroke-linejoin="miter">
	<g transform="translate(19.0,220.3) rotate(270)" stroke="none" fill="black" font-family="Arial" font-size="12.00"  text-anchor="middle">
		<text><tspan font-family="Arial" >Scaled occurence (1/max)</tspan></text>
	</g>
</g>
<g fill="none" color="black" stroke="currentColor" stroke-width="1.00" stroke-linecap="butt" stroke-linejoin="miter">
	<g transform="translate(343.4,471.3)" stroke="none" fill="black" font-family="Arial" font-size="12.00"  text-anchor="middle">
		<text><tspan font-family="Arial" >Normalised Error (0 to 1)</tspan></text>
	</g>
</g>
<g fill="none" color="black" stroke="currentColor" stroke-width="1.00" stroke-linecap="butt" stroke-linejoin="miter">
</g>
	<g id="gnuplot_plot_1" ><title>W = 4</title>
<g fill="none" color="black" stroke="currentColor" stroke-width="1.00" stroke-linecap="butt" stroke-linejoin="miter">
	<g transform="translate(547.9,40.0)" stroke="none" fill="black" font-family="Arial" font-size="12.00"  text-anchor="end">
		<text><tspan font-family="Arial" >W = 4</tspan></text>
	</g>
</g>
<g fill="none" color="black" stroke="currentColor" stroke-width="1.00" stroke-linecap="butt" stroke-linejoin="miter">
	<path stroke='rgb(148,   0, 211)'  d='M556.2,36.1 L598.4,36.1 M71.9,99.3 L73.0,132.2 L74.1,94.8 L75.2,71.9 L76.2,126.7 L77.3,100.2
		L78.4,128.5 L79.5,117.6 L80.6,103.9 L81.7,124.0 L82.8,141.3 L83.8,146.8 L84.9,105.7 L86.0,95.7
		L87.1,81.1 L88.2,105.7 L89.3,108.5 L90.4,90.2 L91.5,128.5 L92.5,113.9 L93.6,126.7 L94.7,115.8
		L95.8,128.5 L96.9,110.3 L98.0,130.4 L99.1,94.8 L100.1,124.9 L101.2,106.6 L102.3,132.2 L103.4,154.1
		L104.5,142.2 L105.6,158.6 L106.7,141.3 L107.7,124.9 L108.8,134.0 L109.9,139.5 L111.0,161.4 L112.1,179.6
		L113.2,171.4 L114.3,170.5 L115.3,177.8 L116.4,154.1 L117.5,162.3 L118.6,179.6 L119.7,179.6 L120.8,163.2
		L121.9,151.3 L123.0,158.6 L124.0,179.6 L125.1,156.8 L126.2,185.1 L127.3,143.1 L128.4,176.0 L129.5,170.5
		L130.6,164.1 L131.6,166.9 L132.7,186.0 L133.8,156.8 L134.9,141.3 L136.0,162.3 L137.1,136.7 L138.2,174.2
		L139.2,171.4 L140.3,160.5 L141.4,169.6 L142.5,138.6 L143.6,145.9 L144.7,138.6 L145.8,134.9 L146.8,136.7
		L147.9,137.7 L149.0,135.8 L150.1,110.3 L151.2,140.4 L152.3,154.1 L153.4,121.2 L154.5,135.8 L155.5,111.2
		L156.6,127.6 L157.7,147.7 L158.8,129.4 L159.9,127.6 L161.0,151.3 L162.1,126.7 L163.1,116.7 L164.2,113.0
		L165.3,115.8 L166.4,156.8 L167.5,116.7 L168.6,139.5 L169.7,124.0 L170.7,114.8 L171.8,134.0 L172.9,124.0
		L174.0,146.8 L175.1,127.6 L176.2,138.6 L177.3,124.0 L178.3,126.7 L179.4,74.7 L180.5,112.1 L181.6,124.0
		L182.7,119.4 L183.8,128.5 L184.9,139.5 L186.0,155.0 L187.0,130.4 L188.1,134.9 L189.2,126.7 L190.3,122.1
		L191.4,109.4 L192.5,115.8 L193.6,142.2 L194.6,113.9 L195.7,132.2 L196.8,163.2 L197.9,152.3 L199.0,121.2
		L200.1,120.3 L201.2,120.3 L202.2,125.8 L203.3,101.2 L204.4,128.5 L205.5,137.7 L206.6,140.4 L207.7,142.2
		L208.8,152.3 L209.8,128.5 L210.9,91.1 L212.0,117.6 L213.1,101.2 L214.2,109.4 L215.3,89.3 L216.4,103.9
		L217.5,66.5 L218.5,113.9 L219.6,80.2 L220.7,86.5 L221.8,106.6 L222.9,94.8 L224.0,129.4 L225.1,107.5
		L226.1,100.2 L227.2,70.1 L228.3,96.6 L229.4,54.6 L230.5,78.3 L231.6,81.1 L232.7,49.1 L233.7,60.1
		L234.8,66.5 L235.9,42.7 L237.0,59.2 L238.1,56.4 L239.2,65.6 L240.3,29.1 L241.3,28.1 L242.4,60.1
		L243.5,44.6 L244.6,49.1 L245.7,30.0 L246.8,49.1 L247.9,44.6 L249.0,70.1 L250.0,64.6 L251.1,18.1
		L252.2,52.8 L253.3,55.5 L254.4,49.1 L255.5,54.6 L256.6,45.5 L257.6,45.5 L258.7,70.1 L259.8,27.2
		L260.9,49.1 L262.0,36.4 L263.1,46.4 L264.2,55.5 L265.2,49.1 L266.3,70.1 L267.4,95.7 L268.5,61.0
		L269.6,67.4 L270.7,103.9 L271.8,45.5 L272.8,90.2 L273.9,93.8 L275.0,92.9 L276.1,83.8 L277.2,95.7
		L278.3,103.0 L279.4,81.1 L280.5,81.1 L281.5,77.4 L282.6,120.3 L283.7,106.6 L284.8,86.5 L285.9,102.1
		L287.0,112.1 L288.1,124.0 L289.1,111.2 L290.2,111.2 L291.3,85.6 L292.4,117.6 L293.5,103.0 L294.6,82.0
		L295.7,71.9 L296.7,100.2 L297.8,108.5 L298.9,103.9 L300.0,124.0 L301.1,96.6 L302.2,134.0 L303.3,99.3
		L304.3,106.6 L305.4,100.2 L306.5,101.2 L307.6,91.1 L308.7,112.1 L309.8,138.6 L310.9,95.7 L312.0,99.3
		L313.0,74.7 L314.1,100.2 L315.2,97.5 L316.3,114.8 L317.4,111.2 L318.5,95.7 L319.6,85.6 L320.6,63.7
		L321.7,106.6 L322.8,88.4 L323.9,93.8 L325.0,98.4 L326.1,127.6 L327.2,100.2 L328.2,84.7 L329.3,76.5
		L330.4,128.5 L331.5,113.0 L332.6,94.8 L333.7,114.8 L334.8,115.8 L335.8,114.8 L336.9,144.0 L338.0,153.2
		L339.1,147.7 L340.2,151.3 L341.3,163.2 L342.4,165.0 L343.4,123.1 L344.5,146.8 L345.6,143.1 L346.7,171.4
		L347.8,148.6 L348.9,121.2 L350.0,163.2 L351.1,178.7 L352.1,133.1 L353.2,158.6 L354.3,140.4 L355.4,140.4
		L356.5,158.6 L357.6,162.3 L358.7,165.9 L359.7,153.2 L360.8,149.5 L361.9,145.9 L363.0,139.5 L364.1,141.3
		L365.2,174.2 L366.3,162.3 L367.3,163.2 L368.4,176.0 L369.5,137.7 L370.6,165.9 L371.7,181.5 L372.8,188.8
		L373.9,144.0 L374.9,166.9 L376.0,162.3 L377.1,170.5 L378.2,175.1 L379.3,141.3 L380.4,195.2 L381.5,177.8
		L382.6,166.9 L383.6,177.8 L384.7,118.5 L385.8,179.6 L386.9,166.9 L388.0,173.2 L389.1,182.4 L390.2,139.5
		L391.2,171.4 L392.3,160.5 L393.4,173.2 L394.5,149.5 L395.6,162.3 L396.7,153.2 L397.8,158.6 L398.8,153.2
		L399.9,168.7 L401.0,187.9 L402.1,167.8 L403.2,167.8 L404.3,169.6 L405.4,171.4 L406.4,165.9 L407.5,174.2
		L408.6,193.3 L409.7,185.1 L410.8,183.3 L411.9,194.2 L413.0,162.3 L414.1,175.1 L415.1,187.9 L416.2,169.6
		L417.3,166.9 L418.4,176.9 L419.5,178.7 L420.6,179.6 L421.7,188.8 L422.7,210.7 L423.8,183.3 L424.9,194.2
		L426.0,188.8 L427.1,181.5 L428.2,210.7 L429.3,200.6 L430.3,196.1 L431.4,176.0 L432.5,207.9 L433.6,186.9
		L434.7,218.9 L435.8,196.1 L436.9,179.6 L437.9,161.4 L439.0,206.1 L440.1,197.0 L441.2,197.9 L442.3,218.0
		L443.4,206.1 L444.5,206.1 L445.6,201.5 L446.6,195.2 L447.7,198.8 L448.8,189.7 L449.9,206.1 L451.0,210.7
		L452.1,191.5 L453.2,181.5 L454.2,205.2 L455.3,184.2 L456.4,208.8 L457.5,193.3 L458.6,197.9 L459.7,199.7
		L460.8,176.0 L461.8,185.1 L462.9,181.5 L464.0,181.5 L465.1,196.1 L466.2,179.6 L467.3,153.2 L468.4,197.9
		L469.4,156.8 L470.5,162.3 L471.6,174.2 L472.7,172.3 L473.8,155.9 L474.9,175.1 L476.0,192.4 L477.1,179.6
		L478.1,175.1 L479.2,166.9 L480.3,164.1 L481.4,158.6 L482.5,150.4 L483.6,161.4 L484.7,165.9 L485.7,152.3
		L486.8,171.4 L487.9,173.2 L489.0,121.2 L490.1,159.6 L491.2,162.3 L492.3,162.3 L493.3,151.3 L494.4,140.4
		L495.5,152.3 L496.6,149.5 L497.7,159.6 L498.8,157.7 L499.9,142.2 L500.9,154.1 L502.0,140.4 L503.1,135.8
		L504.2,152.3 L505.3,128.5 L506.4,140.4 L507.5,148.6 L508.6,150.4 L509.6,165.9 L510.7,169.6 L511.8,131.3
		L512.9,179.6 L514.0,160.5 L515.1,139.5 L516.2,130.4 L517.2,143.1 L518.3,130.4 L519.4,149.5 L520.5,154.1
		L521.6,126.7 L522.7,150.4 L523.8,132.2 L524.8,154.1 L525.9,175.1 L527.0,156.8 L528.1,173.2 L529.2,124.9
		L530.3,174.2 L531.4,169.6 L532.4,157.7 L533.5,146.8 L534.6,138.6 L535.7,121.2 L536.8,124.0 L537.9,163.2
		L539.0,142.2 L540.1,163.2 L541.1,109.4 L542.2,124.0 L543.3,126.7 L544.4,145.0 L545.5,138.6 L546.6,133.1
		L547.7,172.3 L548.7,157.7 L549.8,162.3 L550.9,156.8 L552.0,163.2 L553.1,151.3 L554.2,170.5 L555.3,155.9
		L556.3,176.0 L557.4,204.3 L558.5,157.7 L559.6,187.9 L560.7,173.2 L561.8,195.2 L562.9,199.7 L563.9,179.6
		L565.0,192.4 L566.1,187.9 L567.2,174.2 L568.3,200.6 L569.4,161.4 L570.5,182.4 L571.6,188.8 L572.6,173.2
		L573.7,169.6 L574.8,147.7 L575.9,187.9 L577.0,176.0 L578.1,199.7 L579.2,177.8 L580.2,150.4 L581.3,173.2
		L582.4,158.6 L583.5,150.4 L584.6,144.0 L585.7,170.5 L586.8,174.2 L587.8,143.1 L588.9,143.1 L590.0,159.6
		L591.1,136.7 L592.2,163.2 L593.3,149.5 L594.4,149.5 L595.4,163.2 L596.5,154.1 L597.6,143.1 L598.7,173.2
		L599.8,161.4 L600.9,145.9 L602.0,146.8 L603.1,136.7 L604.1,164.1 L605.2,89.3 L606.3,129.4 L607.4,77.4
		L608.5,122.1 L609.6,117.6 L610.7,90.2 L611.7,140.4 L612.8,103.9 L613.9,66.5  '/></g>
	</g>
	<g id="gnuplot_plot_2" ><title>W = 6</title>
<g fill="none" color="black" stroke="currentColor" stroke-width="1.00" stroke-linecap="butt" stroke-linejoin="miter">
	<g transform="translate(547.9,58.0)" stroke="none" fill="black" font-family="Arial" font-size="12.00"  text-anchor="end">
		<text><tspan font-family="Arial" >W = 6</tspan></text>
	</g>
</g>
<g fill="none" color="black" stroke="currentColor" stroke-width="1.00" stroke-linecap="butt" stroke-linejoin="miter">
	<path stroke='rgb(  0, 158, 115)'  d='M556.2,54.1 L598.4,54.1 M71.9,76.4 L73.0,103.7 L74.1,81.7 L75.2,62.2 L76.2,96.7 L77.3,85.2
		L78.4,59.6 L79.5,79.9 L80.6,93.1 L81.7,32.2 L82.8,91.4 L83.8,83.4 L84.9,88.7 L86.0,82.5
		L87.1,61.4 L88.2,22.5 L89.3,91.4 L90.4,44.6 L91.5,54.3 L92.5,25.2 L93.6,48.1 L94.7,63.1
		L95.8,78.1 L96.9,60.5 L98.0,55.2 L99.1,54.3 L100.1,71.1 L101.2,64.9 L102.3,25.2 L103.4,50.8
		L104.5,46.3 L105.6,77.2 L106.7,42.8 L107.7,33.1 L108.8,18.1 L109.9,55.2 L111.0,59.6 L112.1,78.1
		L113.2,64.0 L114.3,53.4 L115.3,74.6 L116.4,62.2 L117.5,68.4 L118.6,79.9 L119.7,48.1 L120.8,84.3
		L121.9,77.2 L123.0,87.0 L124.0,67.5 L125.1,98.4 L126.2,62.2 L127.3,78.1 L128.4,81.7 L129.5,84.3
		L130.6,100.2 L131.6,93.1 L132.7,65.8 L133.8,66.7 L134.9,81.7 L136.0,75.5 L137.1,72.8 L138.2,87.8
		L139.2,71.9 L140.3,72.8 L141.4,51.6 L142.5,58.7 L143.6,49.9 L144.7,94.9 L145.8,79.9 L146.8,39.3
		L147.9,56.9 L149.0,62.2 L150.1,88.7 L151.2,56.9 L152.3,57.8 L153.4,56.9 L154.5,94.0 L155.5,55.2
		L156.6,90.5 L157.7,69.3 L158.8,72.8 L159.9,57.8 L161.0,55.2 L162.1,67.5 L163.1,63.1 L164.2,61.4
		L165.3,73.7 L166.4,62.2 L167.5,64.9 L168.6,72.8 L169.7,52.5 L170.7,60.5 L171.8,91.4 L172.9,84.3
		L174.0,91.4 L175.1,61.4 L176.2,61.4 L177.3,55.2 L178.3,69.3 L179.4,39.3 L180.5,66.7 L181.6,59.6
		L182.7,69.3 L183.8,102.0 L184.9,83.4 L186.0,84.3 L187.0,56.1 L188.1,74.6 L189.2,69.3 L190.3,63.1
		L191.4,72.8 L192.5,89.6 L193.6,94.9 L194.6,86.1 L195.7,71.1 L196.8,75.5 L197.9,104.6 L199.0,63.1
		L200.1,64.9 L201.2,70.2 L202.2,63.1 L203.3,83.4 L204.4,64.9 L205.5,52.5 L206.6,67.5 L207.7,95.8
		L208.8,117.9 L209.8,73.7 L210.9,85.2 L212.0,79.9 L213.1,67.5 L214.2,62.2 L215.3,47.2 L216.4,111.7
		L217.5,66.7 L218.5,124.9 L219.6,117.0 L220.7,99.3 L221.8,90.5 L222.9,79.9 L224.0,139.0 L225.1,99.3
		L226.1,85.2 L227.2,101.1 L228.3,94.9 L229.4,122.3 L230.5,74.6 L231.6,91.4 L232.7,80.8 L233.7,86.1
		L234.8,85.2 L235.9,80.8 L237.0,94.0 L238.1,79.9 L239.2,91.4 L240.3,86.1 L241.3,54.3 L242.4,85.2
		L243.5,97.5 L244.6,81.7 L245.7,98.4 L246.8,67.5 L247.9,82.5 L249.0,94.9 L250.0,100.2 L251.1,73.7
		L252.2,71.1 L253.3,123.1 L254.4,68.4 L255.5,81.7 L256.6,79.9 L257.6,53.4 L258.7,79.9 L259.8,72.8
		L260.9,53.4 L262.0,70.2 L263.1,46.3 L264.2,90.5 L265.2,85.2 L266.3,68.4 L267.4,77.2 L268.5,69.3
		L269.6,67.5 L270.7,80.8 L271.8,66.7 L272.8,66.7 L273.9,49.9 L275.0,70.2 L276.1,85.2 L277.2,82.5
		L278.3,94.9 L279.4,64.0 L280.5,93.1 L281.5,78.1 L282.6,100.2 L283.7,91.4 L284.8,79.9 L285.9,104.6
		L287.0,101.1 L288.1,113.4 L289.1,100.2 L290.2,105.5 L291.3,83.4 L292.4,103.7 L293.5,101.1 L294.6,100.2
		L295.7,99.3 L296.7,78.1 L297.8,105.5 L298.9,65.8 L300.0,79.9 L301.1,85.2 L302.2,121.4 L303.3,77.2
		L304.3,99.3 L305.4,89.6 L306.5,114.3 L307.6,100.2 L308.7,109.9 L309.8,132.0 L310.9,84.3 L312.0,140.8
		L313.0,74.6 L314.1,83.4 L315.2,117.9 L316.3,96.7 L317.4,82.5 L318.5,95.8 L319.6,64.0 L320.6,79.0
		L321.7,86.1 L322.8,89.6 L323.9,92.3 L325.0,74.6 L326.1,71.9 L327.2,127.6 L328.2,67.5 L329.3,81.7
		L330.4,82.5 L331.5,102.0 L332.6,120.5 L333.7,93.1 L334.8,78.1 L335.8,118.7 L336.9,107.3 L338.0,122.3
		L339.1,163.8 L340.2,99.3 L341.3,97.5 L342.4,122.3 L343.4,137.3 L344.5,112.6 L345.6,131.1 L346.7,148.7
		L347.8,87.0 L348.9,120.5 L350.0,143.5 L351.1,132.0 L352.1,106.4 L353.2,128.4 L354.3,108.1 L355.4,129.3
		L356.5,118.7 L357.6,111.7 L358.7,95.8 L359.7,106.4 L360.8,91.4 L361.9,107.3 L363.0,90.5 L364.1,120.5
		L365.2,106.4 L366.3,107.3 L367.3,132.9 L368.4,130.2 L369.5,107.3 L370.6,126.7 L371.7,91.4 L372.8,117.9
		L373.9,95.8 L374.9,134.6 L376.0,146.1 L377.1,117.0 L378.2,117.9 L379.3,115.2 L380.4,110.8 L381.5,77.2
		L382.6,132.9 L383.6,106.4 L384.7,109.0 L385.8,124.9 L386.9,132.0 L388.0,98.4 L389.1,117.0 L390.2,132.0
		L391.2,134.6 L392.3,130.2 L393.4,133.7 L394.5,132.9 L395.6,126.7 L396.7,114.3 L397.8,147.9 L398.8,157.6
		L399.9,133.7 L401.0,106.4 L402.1,117.9 L403.2,117.9 L404.3,121.4 L405.4,115.2 L406.4,137.3 L407.5,130.2
		L408.6,146.1 L409.7,112.6 L410.8,84.3 L411.9,105.5 L413.0,152.3 L414.1,139.9 L415.1,111.7 L416.2,122.3
		L417.3,140.8 L418.4,132.9 L419.5,120.5 L420.6,133.7 L421.7,130.2 L422.7,122.3 L423.8,128.4 L424.9,130.2
		L426.0,135.5 L427.1,117.0 L428.2,130.2 L429.3,95.8 L430.3,130.2 L431.4,108.1 L432.5,154.9 L433.6,99.3
		L434.7,129.3 L435.8,148.7 L436.9,118.7 L437.9,111.7 L439.0,99.3 L440.1,104.6 L441.2,109.9 L442.3,96.7
		L443.4,131.1 L444.5,121.4 L445.6,99.3 L446.6,128.4 L447.7,139.0 L448.8,126.7 L449.9,137.3 L451.0,98.4
		L452.1,136.4 L453.2,153.2 L454.2,142.6 L455.3,154.9 L456.4,132.9 L457.5,121.4 L458.6,169.1 L459.7,109.9
		L460.8,139.0 L461.8,138.2 L462.9,104.6 L464.0,147.9 L465.1,140.8 L466.2,154.9 L467.3,154.9 L468.4,155.8
		L469.4,162.9 L470.5,130.2 L471.6,171.7 L472.7,148.7 L473.8,151.4 L474.9,160.2 L476.0,147.0 L477.1,144.3
		L478.1,118.7 L479.2,172.6 L480.3,157.6 L481.4,154.9 L482.5,127.6 L483.6,146.1 L484.7,147.9 L485.7,112.6
		L486.8,137.3 L487.9,161.1 L489.0,144.3 L490.1,140.8 L491.2,181.4 L492.3,121.4 L493.3,119.6 L494.4,144.3
		L495.5,122.3 L496.6,120.5 L497.7,114.3 L498.8,135.5 L499.9,127.6 L500.9,99.3 L502.0,120.5 L503.1,137.3
		L504.2,140.8 L505.3,181.4 L506.4,120.5 L507.5,132.9 L508.6,154.9 L509.6,154.0 L510.7,138.2 L511.8,155.8
		L512.9,148.7 L514.0,167.3 L515.1,182.3 L516.2,179.6 L517.2,164.6 L518.3,195.5 L519.4,190.2 L520.5,180.5
		L521.6,156.7 L522.7,162.0 L523.8,165.5 L524.8,160.2 L525.9,153.2 L527.0,162.9 L528.1,147.0 L529.2,161.1
		L530.3,131.1 L531.4,148.7 L532.4,157.6 L533.5,184.1 L534.6,149.6 L535.7,149.6 L536.8,183.2 L537.9,157.6
		L539.0,174.3 L540.1,156.7 L541.1,160.2 L542.2,147.9 L543.3,183.2 L544.4,183.2 L545.5,129.3 L546.6,139.9
		L547.7,145.2 L548.7,161.1 L549.8,154.9 L550.9,177.0 L552.0,168.2 L553.1,132.0 L554.2,177.9 L555.3,174.3
		L556.3,177.9 L557.4,154.0 L558.5,166.4 L559.6,169.1 L560.7,165.5 L561.8,155.8 L562.9,178.8 L563.9,183.2
		L565.0,168.2 L566.1,183.2 L567.2,180.5 L568.3,164.6 L569.4,178.8 L570.5,192.0 L571.6,188.5 L572.6,177.0
		L573.7,199.1 L574.8,192.0 L575.9,173.5 L577.0,167.3 L578.1,167.3 L579.2,180.5 L580.2,154.0 L581.3,194.7
		L582.4,180.5 L583.5,159.3 L584.6,172.6 L585.7,166.4 L586.8,210.5 L587.8,198.2 L588.9,173.5 L590.0,201.7
		L591.1,169.9 L592.2,195.5 L593.3,175.2 L594.4,147.9 L595.4,189.4 L596.5,163.8 L597.6,188.5 L598.7,194.7
		L599.8,173.5 L600.9,163.8 L602.0,178.8 L603.1,184.9 L604.1,169.1 L605.2,164.6 L606.3,205.2 L607.4,182.3
		L608.5,190.2 L609.6,199.1 L610.7,214.1 L611.7,214.1 L612.8,210.5 L613.9,197.3  '/></g>
	</g>
	<g id="gnuplot_plot_3" ><title>W = 8</title>
<g fill="none" color="black" stroke="currentColor" stroke-width="1.00" stroke-linecap="butt" stroke-linejoin="miter">
	<g transform="translate(547.9,76.0)" stroke="none" fill="black" font-family="Arial" font-size="12.00"  text-anchor="end">
		<text><tspan font-family="Arial" >W = 8</tspan></text>
	</g>
</g>
<g fill="none" color="black" stroke="currentColor" stroke-width="1.00" stroke-linecap="butt" stroke-linejoin="miter">
	<path stroke='rgb( 86, 180, 233)'  d='M556.2,72.1 L598.4,72.1 M71.9,21.1 L73.0,41.4 L74.1,55.9 L75.2,39.7 L76.2,38.4 L77.3,29.2
		L78.4,30.6 L79.5,18.1 L80.6,26.2 L81.7,38.7 L82.8,43.1 L83.8,42.1 L84.9,39.7 L86.0,46.5
		L87.1,50.9 L88.2,55.9 L89.3,39.4 L90.4,52.2 L91.5,37.4 L92.5,43.4 L93.6,24.5 L94.7,51.9
		L95.8,39.0 L96.9,39.4 L98.0,58.6 L99.1,49.2 L100.1,61.0 L101.2,56.6 L102.3,44.4 L103.4,27.6
		L104.5,36.7 L105.6,77.2 L106.7,47.5 L107.7,43.8 L108.8,60.3 L109.9,47.8 L111.0,60.0 L112.1,34.0
		L113.2,38.7 L114.3,51.5 L115.3,55.6 L116.4,74.8 L117.5,64.0 L118.6,70.5 L119.7,51.9 L120.8,57.3
		L121.9,72.8 L123.0,48.2 L124.0,62.3 L125.1,59.0 L126.2,75.5 L127.3,70.5 L128.4,78.6 L129.5,80.2
		L130.6,63.4 L131.6,76.5 L132.7,75.2 L133.8,90.0 L134.9,70.1 L136.0,65.0 L137.1,82.3 L138.2,72.1
		L139.2,76.9 L140.3,83.6 L141.4,86.0 L142.5,85.3 L143.6,95.8 L144.7,94.1 L145.8,93.4 L146.8,79.9
		L147.9,79.6 L149.0,86.3 L150.1,82.3 L151.2,100.9 L152.3,97.1 L153.4,86.3 L154.5,96.5 L155.5,92.7
		L156.6,72.5 L157.7,95.8 L158.8,91.4 L159.9,97.5 L161.0,107.3 L162.1,84.3 L163.1,82.6 L164.2,85.7
		L165.3,117.7 L166.4,118.8 L167.5,114.0 L168.6,88.7 L169.7,110.3 L170.7,106.6 L171.8,119.4 L172.9,111.7
		L174.0,118.8 L175.1,117.7 L176.2,129.2 L177.3,132.3 L178.3,118.8 L179.4,138.7 L180.5,134.6 L181.6,127.9
		L182.7,131.2 L183.8,149.5 L184.9,139.4 L186.0,126.5 L187.0,139.4 L188.1,151.5 L189.2,151.5 L190.3,147.5
		L191.4,141.7 L192.5,134.6 L193.6,160.0 L194.6,150.8 L195.7,146.1 L196.8,145.1 L197.9,149.2 L199.0,144.8
		L200.1,169.8 L201.2,157.9 L202.2,160.3 L203.3,152.2 L204.4,165.4 L205.5,151.2 L206.6,168.7 L207.7,157.6
		L208.8,161.0 L209.8,168.1 L210.9,169.1 L212.0,178.2 L213.1,171.8 L214.2,166.0 L215.3,180.2 L216.4,186.6
		L217.5,170.8 L218.5,177.2 L219.6,182.6 L220.7,190.0 L221.8,198.5 L222.9,211.3 L224.0,194.7 L225.1,199.8
		L226.1,188.3 L227.2,209.3 L228.3,190.4 L229.4,196.1 L230.5,193.7 L231.6,211.6 L232.7,209.9 L233.7,229.2
		L234.8,213.3 L235.9,198.8 L237.0,213.0 L238.1,214.0 L239.2,205.6 L240.3,212.0 L241.3,218.4 L242.4,216.7
		L243.5,217.4 L244.6,221.1 L245.7,233.3 L246.8,230.2 L247.9,236.0 L249.0,208.9 L250.0,229.5 L251.1,229.5
		L252.2,229.9 L253.3,236.3 L254.4,240.0 L255.5,240.0 L256.6,239.0 L257.6,245.4 L258.7,231.6 L259.8,232.2
		L260.9,239.0 L262.0,256.9 L263.1,239.3 L264.2,246.8 L265.2,254.5 L266.3,238.7 L267.4,256.9 L268.5,246.1
		L269.6,260.6 L270.7,251.2 L271.8,260.6 L272.8,252.8 L273.9,267.0 L275.0,256.2 L276.1,277.8 L277.2,281.6
		L278.3,280.9 L279.4,267.7 L280.5,261.3 L281.5,276.5 L282.6,267.7 L283.7,266.0 L284.8,283.9 L285.9,272.4
		L287.0,273.8 L288.1,284.3 L289.1,288.6 L290.2,275.8 L291.3,285.6 L292.4,291.3 L293.5,277.5 L294.6,300.8
		L295.7,291.3 L296.7,282.9 L297.8,297.4 L298.9,300.5 L300.0,296.8 L301.1,297.4 L302.2,285.6 L303.3,300.5
		L304.3,298.8 L305.4,296.8 L306.5,296.4 L307.6,295.4 L308.7,298.4 L309.8,309.9 L310.9,315.3 L312.0,301.1
		L313.0,307.9 L314.1,307.9 L315.2,308.2 L316.3,317.4 L317.4,308.9 L318.5,302.2 L319.6,316.3 L320.6,315.3
		L321.7,320.4 L322.8,319.4 L323.9,330.2 L325.0,319.7 L326.1,322.8 L327.2,320.4 L328.2,329.5 L329.3,323.8
		L330.4,323.4 L331.5,322.4 L332.6,322.4 L333.7,327.2 L334.8,329.2 L335.8,324.4 L336.9,330.5 L338.0,321.4
		L339.1,332.9 L340.2,329.2 L341.3,325.8 L342.4,325.1 L343.4,334.9 L344.5,323.1 L345.6,341.7 L346.7,330.9
		L347.8,331.2 L348.9,338.0 L350.0,342.0 L351.1,330.9 L352.1,330.9 L353.2,340.7 L354.3,341.0 L355.4,342.7
		L356.5,332.9 L357.6,342.0 L358.7,333.6 L359.7,339.0 L360.8,335.9 L361.9,342.7 L363.0,348.8 L364.1,341.3
		L365.2,346.4 L366.3,347.4 L367.3,346.1 L368.4,338.0 L369.5,346.1 L370.6,342.7 L371.7,346.4 L372.8,348.8
		L373.9,350.8 L374.9,339.0 L376.0,359.9 L377.1,359.2 L378.2,340.3 L379.3,352.1 L380.4,339.0 L381.5,352.5
		L382.6,361.9 L383.6,353.8 L384.7,350.5 L385.8,353.2 L386.9,353.5 L388.0,354.5 L389.1,352.1 L390.2,354.5
		L391.2,351.1 L392.3,354.8 L393.4,363.3 L394.5,361.3 L395.6,353.2 L396.7,352.8 L397.8,350.5 L398.8,351.8
		L399.9,356.2 L401.0,357.9 L402.1,359.6 L403.2,355.2 L404.3,358.6 L405.4,355.2 L406.4,357.5 L407.5,354.8
		L408.6,359.6 L409.7,356.2 L410.8,353.2 L411.9,359.6 L413.0,361.3 L414.1,363.3 L415.1,357.9 L416.2,367.3
		L417.3,359.2 L418.4,364.6 L419.5,356.9 L420.6,357.2 L421.7,360.3 L422.7,358.9 L423.8,357.2 L424.9,368.0
		L426.0,370.7 L427.1,371.4 L428.2,360.6 L429.3,359.6 L430.3,358.6 L431.4,357.5 L432.5,368.4 L433.6,360.6
		L434.7,363.0 L435.8,373.4 L436.9,370.0 L437.9,368.4 L439.0,366.0 L440.1,372.4 L441.2,365.3 L442.3,359.9
		L443.4,363.0 L444.5,366.7 L445.6,361.9 L446.6,364.6 L447.7,374.4 L448.8,375.5 L449.9,368.7 L451.0,370.4
		L452.1,365.7 L453.2,375.5 L454.2,370.4 L455.3,368.0 L456.4,368.0 L457.5,368.0 L458.6,370.4 L459.7,372.4
		L460.8,362.3 L461.8,366.0 L462.9,362.6 L464.0,371.4 L465.1,372.4 L466.2,369.4 L467.3,373.8 L468.4,370.4
		L469.4,376.1 L470.5,368.4 L471.6,374.4 L472.7,371.4 L473.8,368.4 L474.9,371.7 L476.0,371.1 L477.1,377.5
		L478.1,380.9 L479.2,363.6 L480.3,373.8 L481.4,373.8 L482.5,367.0 L483.6,377.1 L484.7,373.1 L485.7,368.7
		L486.8,375.5 L487.9,368.0 L489.0,379.2 L490.1,369.7 L491.2,370.7 L492.3,370.7 L493.3,377.8 L494.4,379.8
		L495.5,375.1 L496.6,374.4 L497.7,373.4 L498.8,366.7 L499.9,374.4 L500.9,372.1 L502.0,375.5 L503.1,376.1
		L504.2,376.8 L505.3,379.2 L506.4,378.2 L507.5,374.8 L508.6,375.1 L509.6,377.5 L510.7,377.8 L511.8,378.2
		L512.9,374.1 L514.0,380.2 L515.1,383.6 L516.2,377.8 L517.2,374.1 L518.3,376.8 L519.4,383.2 L520.5,377.1
		L521.6,373.4 L522.7,375.8 L523.8,375.8 L524.8,374.8 L525.9,373.4 L527.0,374.1 L528.1,381.2 L529.2,372.7
		L530.3,381.5 L531.4,377.8 L532.4,374.1 L533.5,383.2 L534.6,382.9 L535.7,377.5 L536.8,375.5 L537.9,373.1
		L539.0,386.9 L540.1,380.9 L541.1,389.3 L542.2,383.6 L543.3,378.5 L544.4,382.5 L545.5,382.9 L546.6,377.1
		L547.7,377.1 L548.7,380.5 L549.8,376.5 L550.9,382.2 L552.0,374.8 L553.1,379.2 L554.2,382.2 L555.3,379.5
		L556.3,381.9 L557.4,379.8 L558.5,374.1 L559.6,383.9 L560.7,380.2 L561.8,382.2 L562.9,378.5 L563.9,380.2
		L565.0,381.5 L566.1,389.6 L567.2,380.9 L568.3,381.2 L569.4,381.2 L570.5,383.6 L571.6,386.9 L572.6,379.2
		L573.7,381.2 L574.8,378.2 L575.9,386.6 L577.0,385.6 L578.1,382.5 L579.2,386.3 L580.2,383.9 L581.3,382.2
		L582.4,379.5 L583.5,378.8 L584.6,379.5 L585.7,381.2 L586.8,382.5 L587.8,385.2 L588.9,385.6 L590.0,384.6
		L591.1,383.6 L592.2,385.2 L593.3,383.2 L594.4,384.9 L595.4,384.6 L596.5,391.3 L597.6,379.5 L598.7,385.9
		L599.8,386.3 L600.9,375.5 L602.0,384.6 L603.1,385.6 L604.1,383.2 L605.2,380.5 L606.3,381.5 L607.4,390.0
		L608.5,381.2 L609.6,389.0 L610.7,384.9 L611.7,384.6 L612.8,387.9 L613.9,381.2  '/></g>
	</g>
	<g id="gnuplot_plot_4" ><title>W = 10</title>
<g fill="none" color="black" stroke="currentColor" stroke-width="1.00" stroke-linecap="butt" stroke-linejoin="miter">
	<g transform="translate(547.9,94.0)" stroke="none" fill="black" font-family="Arial" font-size="12.00"  text-anchor="end">
		<text><tspan font-family="Arial" >W = 10</tspan></text>
	</g>
</g>
<g fill="none" color="black" stroke="currentColor" stroke-width="1.00" stroke-linecap="butt" stroke-linejoin="miter">
	<path stroke='rgb(230, 159,   0)'  d='M556.2,90.1 L598.4,90.1 M71.9,32.2 L73.0,36.7 L74.1,55.5 L75.2,49.1 L76.2,28.4 L77.3,33.4
		L78.4,35.4 L79.5,52.5 L80.6,43.0 L81.7,41.7 L82.8,39.0 L83.8,36.7 L84.9,30.2 L86.0,35.9
		L87.1,31.2 L88.2,46.0 L89.3,38.0 L90.4,37.9 L91.5,42.0 L92.5,31.2 L93.6,38.5 L94.7,39.5
		L95.8,18.1 L96.9,43.0 L98.0,50.3 L99.1,23.9 L100.1,23.6 L101.2,37.9 L102.3,44.3 L103.4,27.6
		L104.5,41.3 L105.6,42.5 L106.7,28.2 L107.7,41.0 L108.8,40.5 L109.9,38.7 L111.0,37.2 L112.1,40.7
		L113.2,44.5 L114.3,49.5 L115.3,48.0 L116.4,42.2 L117.5,48.3 L118.6,55.6 L119.7,48.2 L120.8,48.0
		L121.9,54.3 L123.0,59.6 L124.0,64.1 L125.1,66.1 L126.2,78.2 L127.3,69.9 L128.4,68.7 L129.5,78.9
		L130.6,80.0 L131.6,89.2 L132.7,103.9 L133.8,99.1 L134.9,105.6 L136.0,115.6 L137.1,109.9 L138.2,119.2
		L139.2,125.5 L140.3,126.9 L141.4,124.5 L142.5,127.7 L143.6,149.3 L144.7,145.6 L145.8,153.4 L146.8,157.1
		L147.9,175.7 L149.0,156.4 L150.1,164.5 L151.2,176.8 L152.3,179.3 L153.4,190.1 L154.5,198.1 L155.5,191.8
		L156.6,205.9 L157.7,212.4 L158.8,225.3 L159.9,225.3 L161.0,218.2 L162.1,237.3 L163.1,245.7 L164.2,250.4
		L165.3,258.4 L166.4,247.7 L167.5,271.6 L168.6,254.4 L169.7,266.0 L170.7,274.6 L171.8,278.1 L172.9,280.9
		L174.0,279.8 L175.1,290.4 L176.2,302.2 L177.3,301.5 L178.3,297.0 L179.4,300.0 L180.5,298.4 L181.6,308.3
		L182.7,323.1 L183.8,317.3 L184.9,318.3 L186.0,323.4 L187.0,322.1 L188.1,326.1 L189.2,332.9 L190.3,330.1
		L191.4,339.2 L192.5,335.9 L193.6,337.9 L194.6,339.4 L195.7,347.4 L196.8,347.7 L197.9,343.5 L199.0,342.5
		L200.1,343.2 L201.2,356.5 L202.2,351.2 L203.3,348.7 L204.4,350.0 L205.5,348.7 L206.6,352.8 L207.7,360.0
		L208.8,356.5 L209.8,357.6 L210.9,358.8 L212.0,360.6 L213.1,353.7 L214.2,359.0 L215.3,363.1 L216.4,363.0
		L217.5,363.5 L218.5,362.5 L219.6,369.4 L220.7,367.6 L221.8,361.8 L222.9,365.3 L224.0,359.1 L225.1,365.8
		L226.1,364.1 L227.2,367.3 L228.3,367.6 L229.4,369.8 L230.5,370.9 L231.6,363.8 L232.7,367.1 L233.7,372.8
		L234.8,370.6 L235.9,368.3 L237.0,374.4 L238.1,371.8 L239.2,369.3 L240.3,376.4 L241.3,377.2 L242.4,377.1
		L243.5,375.7 L244.6,376.9 L245.7,372.1 L246.8,377.6 L247.9,375.6 L249.0,379.7 L250.0,375.4 L251.1,377.1
		L252.2,375.6 L253.3,376.7 L254.4,379.7 L255.5,378.2 L256.6,375.4 L257.6,381.4 L258.7,379.4 L259.8,382.4
		L260.9,378.2 L262.0,379.9 L263.1,381.9 L264.2,383.5 L265.2,381.7 L266.3,378.6 L267.4,385.7 L268.5,379.9
		L269.6,383.2 L270.7,381.2 L271.8,380.4 L272.8,387.7 L273.9,385.7 L275.0,386.0 L276.1,386.4 L277.2,381.9
		L278.3,385.7 L279.4,387.2 L280.5,387.4 L281.5,385.5 L282.6,389.2 L283.7,384.4 L284.8,385.7 L285.9,393.5
		L287.0,386.5 L288.1,388.5 L289.1,385.9 L290.2,390.4 L291.3,388.4 L292.4,386.0 L293.5,388.2 L294.6,390.5
		L295.7,387.7 L296.7,393.7 L297.8,391.4 L298.9,391.4 L300.0,386.2 L301.1,390.4 L302.2,386.7 L303.3,389.7
		L304.3,388.0 L305.4,394.8 L306.5,392.0 L307.6,389.0 L308.7,389.4 L309.8,387.4 L310.9,390.9 L312.0,390.5
		L313.0,395.5 L314.1,393.3 L315.2,389.7 L316.3,392.5 L317.4,392.2 L318.5,387.9 L319.6,395.7 L320.6,389.7
		L321.7,393.8 L322.8,391.8 L323.9,393.5 L325.0,394.0 L326.1,395.7 L327.2,394.8 L328.2,394.3 L329.3,393.7
		L330.4,394.3 L331.5,392.0 L332.6,391.4 L333.7,393.5 L334.8,396.2 L335.8,398.5 L336.9,395.8 L338.0,397.5
		L339.1,396.2 L340.2,398.0 L341.3,392.8 L342.4,396.7 L343.4,393.8 L344.5,399.8 L345.6,398.5 L346.7,397.2
		L347.8,398.8 L348.9,394.7 L350.0,398.2 L351.1,399.0 L352.1,398.5 L353.2,398.0 L354.3,400.0 L355.4,400.5
		L356.5,399.2 L357.6,401.6 L358.7,401.8 L359.7,399.3 L360.8,400.6 L361.9,399.2 L363.0,400.3 L364.1,399.0
		L365.2,402.3 L366.3,399.7 L367.3,400.8 L368.4,398.8 L369.5,400.3 L370.6,403.0 L371.7,399.2 L372.8,404.6
		L373.9,401.8 L374.9,402.8 L376.0,402.6 L377.1,399.5 L378.2,405.5 L379.3,398.8 L380.4,404.1 L381.5,400.8
		L382.6,399.8 L383.6,401.1 L384.7,403.8 L385.8,400.8 L386.9,403.6 L388.0,401.6 L389.1,404.0 L390.2,403.3
		L391.2,404.6 L392.3,400.6 L393.4,404.8 L394.5,405.8 L395.6,404.5 L396.7,404.0 L397.8,405.0 L398.8,403.8
		L399.9,405.5 L401.0,404.1 L402.1,401.0 L403.2,406.6 L404.3,406.5 L405.4,402.5 L406.4,404.3 L407.5,404.0
		L408.6,406.1 L409.7,405.1 L410.8,406.1 L411.9,405.3 L413.0,406.5 L414.1,407.6 L415.1,404.6 L416.2,406.1
		L417.3,405.1 L418.4,407.6 L419.5,406.3 L420.6,405.0 L421.7,401.8 L422.7,406.3 L423.8,406.1 L424.9,404.6
		L426.0,406.1 L427.1,406.8 L428.2,409.8 L429.3,404.8 L430.3,406.5 L431.4,407.6 L432.5,405.3 L433.6,406.3
		L434.7,410.1 L435.8,406.1 L436.9,409.4 L437.9,409.1 L439.0,406.8 L440.1,407.0 L441.2,405.3 L442.3,408.5
		L443.4,407.6 L444.5,406.5 L445.6,408.5 L446.6,409.0 L447.7,409.1 L448.8,405.8 L449.9,409.6 L451.0,406.6
		L452.1,409.9 L453.2,408.8 L454.2,408.1 L455.3,409.6 L456.4,413.1 L457.5,410.9 L458.6,410.3 L459.7,409.3
		L460.8,410.1 L461.8,407.3 L462.9,408.0 L464.0,407.0 L465.1,409.9 L466.2,409.3 L467.3,410.4 L468.4,411.4
		L469.4,407.1 L470.5,408.0 L471.6,410.1 L472.7,407.0 L473.8,408.8 L474.9,408.3 L476.0,409.4 L477.1,410.6
		L478.1,409.9 L479.2,410.4 L480.3,411.8 L481.4,410.9 L482.5,409.8 L483.6,413.9 L484.7,411.6 L485.7,408.6
		L486.8,412.6 L487.9,409.1 L489.0,411.4 L490.1,410.9 L491.2,410.8 L492.3,410.4 L493.3,409.0 L494.4,410.6
		L495.5,410.6 L496.6,410.3 L497.7,407.5 L498.8,411.1 L499.9,411.3 L500.9,411.9 L502.0,410.1 L503.1,410.8
		L504.2,409.4 L505.3,409.9 L506.4,410.9 L507.5,411.4 L508.6,410.1 L509.6,413.4 L510.7,409.3 L511.8,412.3
		L512.9,412.8 L514.0,411.6 L515.1,413.1 L516.2,411.3 L517.2,412.3 L518.3,410.9 L519.4,409.4 L520.5,413.6
		L521.6,412.8 L522.7,411.8 L523.8,411.6 L524.8,410.1 L525.9,412.8 L527.0,411.4 L528.1,411.6 L529.2,409.0
		L530.3,410.9 L531.4,413.8 L532.4,412.8 L533.5,412.8 L534.6,412.8 L535.7,410.8 L536.8,411.8 L537.9,409.6
		L539.0,413.4 L540.1,412.3 L541.1,411.6 L542.2,411.1 L543.3,411.3 L544.4,411.4 L545.5,410.3 L546.6,410.6
		L547.7,411.8 L548.7,412.9 L549.8,410.3 L550.9,414.1 L552.0,412.6 L553.1,411.3 L554.2,412.3 L555.3,414.8
		L556.3,409.9 L557.4,413.1 L558.5,413.3 L559.6,414.4 L560.7,414.4 L561.8,413.6 L562.9,411.3 L563.9,411.6
		L565.0,412.3 L566.1,412.8 L567.2,411.1 L568.3,413.4 L569.4,415.6 L570.5,411.9 L571.6,411.8 L572.6,413.4
		L573.7,412.3 L574.8,413.9 L575.9,413.1 L577.0,414.1 L578.1,413.3 L579.2,412.1 L580.2,411.1 L581.3,412.6
		L582.4,414.3 L583.5,410.9 L584.6,414.4 L585.7,412.4 L586.8,412.3 L587.8,415.6 L588.9,411.9 L590.0,412.6
		L591.1,413.6 L592.2,415.6 L593.3,415.3 L594.4,414.4 L595.4,413.1 L596.5,413.3 L597.6,413.1 L598.7,413.8
		L599.8,417.3 L600.9,414.6 L602.0,412.6 L603.1,415.1 L604.1,413.1 L605.2,414.6 L606.3,414.1 L607.4,413.9
		L608.5,412.6 L609.6,415.3 L610.7,414.3 L611.7,413.8 L612.8,415.4 L613.9,415.9  '/></g>
	</g>
	<g id="gnuplot_plot_5" ><title>W = 12</title>
<g fill="none" color="black" stroke="currentColor" stroke-width="1.00" stroke-linecap="butt" stroke-linejoin="miter">
	<g transform="translate(547.9,112.0)" stroke="none" fill="black" font-family="Arial" font-size="12.00"  text-anchor="end">
		<text><tspan font-family="Arial" >W = 12</tspan></text>
	</g>
</g>
<g fill="none" color="black" stroke="currentColor" stroke-width="1.00" stroke-linecap="butt" stroke-linejoin="miter">
	<path stroke='rgb(240, 228,  66)'  d='M556.2,108.1 L598.4,108.1 M71.9,18.1 L73.0,22.9 L74.1,23.6 L75.2,23.2 L76.2,29.4 L77.3,19.0
		L78.4,26.9 L79.5,26.1 L80.6,34.8 L81.7,37.7 L82.8,47.9 L83.8,63.1 L84.9,72.6 L86.0,86.8
		L87.1,108.7 L88.2,130.3 L89.3,151.7 L90.4,164.5 L91.5,188.9 L92.5,204.3 L93.6,223.3 L94.7,240.8
		L95.8,260.3 L96.9,274.8 L98.0,295.1 L99.1,301.4 L100.1,312.8 L101.2,321.6 L102.3,329.7 L103.4,337.9
		L104.5,340.6 L105.6,346.7 L106.7,354.5 L107.7,355.0 L108.8,364.2 L109.9,361.1 L111.0,366.5 L112.1,367.8
		L113.2,371.0 L114.3,372.3 L115.3,374.3 L116.4,376.0 L117.5,376.9 L118.6,378.1 L119.7,379.4 L120.8,382.2
		L121.9,383.0 L123.0,382.7 L124.0,387.2 L125.1,383.9 L126.2,386.9 L127.3,386.9 L128.4,388.7 L129.5,390.2
		L130.6,390.1 L131.6,389.9 L132.7,393.3 L133.8,389.7 L134.9,391.8 L136.0,394.5 L137.1,395.0 L138.2,395.4
		L139.2,396.9 L140.3,396.0 L141.4,397.1 L142.5,399.3 L143.6,397.5 L144.7,398.8 L145.8,400.2 L146.8,400.0
		L147.9,399.9 L149.0,399.9 L150.1,402.4 L151.2,402.6 L152.3,403.2 L153.4,403.8 L154.5,404.1 L155.5,405.0
		L156.6,405.2 L157.7,403.4 L158.8,405.7 L159.9,404.7 L161.0,406.4 L162.1,406.8 L163.1,407.8 L164.2,406.9
		L165.3,406.7 L166.4,407.6 L167.5,408.0 L168.6,408.7 L169.7,407.5 L170.7,409.6 L171.8,409.3 L172.9,409.9
		L174.0,409.7 L175.1,409.4 L176.2,411.6 L177.3,409.7 L178.3,410.6 L179.4,410.0 L180.5,411.6 L181.6,409.9
		L182.7,411.1 L183.8,411.4 L184.9,410.4 L186.0,410.5 L187.0,411.7 L188.1,411.8 L189.2,410.5 L190.3,411.3
		L191.4,411.9 L192.5,411.3 L193.6,412.3 L194.6,411.9 L195.7,412.3 L196.8,411.8 L197.9,413.6 L199.0,411.4
		L200.1,413.1 L201.2,413.2 L202.2,413.7 L203.3,414.3 L204.4,413.1 L205.5,413.1 L206.6,413.8 L207.7,412.4
		L208.8,412.8 L209.8,414.2 L210.9,414.5 L212.0,415.3 L213.1,415.4 L214.2,414.1 L215.3,414.0 L216.4,414.5
		L217.5,414.5 L218.5,414.8 L219.6,415.2 L220.7,414.8 L221.8,415.8 L222.9,415.1 L224.0,415.8 L225.1,415.3
		L226.1,415.7 L227.2,416.0 L228.3,416.3 L229.4,416.7 L230.5,416.5 L231.6,415.6 L232.7,416.2 L233.7,416.7
		L234.8,417.4 L235.9,416.2 L237.0,416.8 L238.1,417.2 L239.2,416.5 L240.3,416.3 L241.3,417.6 L242.4,416.5
		L243.5,417.2 L244.6,417.2 L245.7,418.0 L246.8,417.7 L247.9,417.4 L249.0,417.8 L250.0,418.1 L251.1,417.9
		L252.2,418.2 L253.3,417.5 L254.4,417.2 L255.5,418.7 L256.6,417.4 L257.6,417.7 L258.7,418.7 L259.8,418.1
		L260.9,418.7 L262.0,418.5 L263.1,418.2 L264.2,417.9 L265.2,419.6 L266.3,419.0 L267.4,418.7 L268.5,418.9
		L269.6,418.6 L270.7,418.3 L271.8,419.0 L272.8,419.2 L273.9,418.5 L275.0,418.9 L276.1,419.5 L277.2,419.2
		L278.3,418.8 L279.4,419.2 L280.5,419.2 L281.5,419.5 L282.6,418.8 L283.7,419.4 L284.8,419.7 L285.9,419.3
		L287.0,419.3 L288.1,419.9 L289.1,419.9 L290.2,420.2 L291.3,419.4 L292.4,419.3 L293.5,419.3 L294.6,419.6
		L295.7,419.6 L296.7,420.2 L297.8,420.2 L298.9,419.9 L300.0,420.5 L301.1,419.3 L302.2,419.8 L303.3,420.1
		L304.3,419.9 L305.4,419.9 L306.5,419.4 L307.6,420.1 L308.7,420.7 L309.8,420.7 L310.9,420.5 L312.0,420.9
		L313.0,421.0 L314.1,421.0 L315.2,420.9 L316.3,420.5 L317.4,420.6 L318.5,420.9 L319.6,421.2 L320.6,420.8
		L321.7,421.1 L322.8,420.5 L323.9,420.8 L325.0,421.2 L326.1,420.8 L327.2,421.3 L328.2,421.3 L329.3,420.9
		L330.4,421.0 L331.5,421.2 L332.6,421.5 L333.7,421.5 L334.8,421.6 L335.8,421.4 L336.9,421.5 L338.0,421.3
		L339.1,421.6 L340.2,421.5 L341.3,421.7 L342.4,421.6 L343.4,421.7 L344.5,421.8 L345.6,421.9 L346.7,421.8
		L347.8,422.0 L348.9,421.9 L350.0,421.8 L351.1,421.8 L352.1,422.0 L353.2,421.9 L354.3,421.9 L355.4,422.2
		L356.5,421.9 L357.6,422.1 L358.7,422.1 L359.7,422.2 L360.8,422.1 L361.9,422.3 L363.0,422.2 L364.1,422.3
		L365.2,422.2 L366.3,422.2 L367.3,422.4 L368.4,422.2 L369.5,422.3 L370.6,422.2 L371.7,422.4 L372.8,422.4
		L373.9,422.4 L374.9,422.4 L376.0,422.3 L377.1,422.4 L378.2,422.3 L379.3,422.4 L380.4,422.4 L381.5,422.4
		L382.6,422.4 L383.6,422.4 L384.7,422.4 L385.8,422.4 L386.9,422.4 L388.0,422.4 L389.1,422.3 L390.2,422.4
		L391.2,422.3 L392.3,422.4 L393.4,422.4 L394.5,422.4 L395.6,422.4 L396.7,422.4 L397.8,422.4 L398.8,422.4
		L399.9,422.4 L401.0,422.4 L402.1,422.4 L403.2,422.4 L404.3,422.4 L405.4,422.4 L406.4,422.4 L407.5,422.4
		L408.6,422.4 L409.7,422.4 L410.8,422.4 L411.9,422.4 L413.0,422.4 L414.1,422.4 L415.1,422.4 L416.2,422.4
		L417.3,422.4 L418.4,422.4 L419.5,422.4 L420.6,422.4 L421.7,422.4 L422.7,422.4 L423.8,422.4 L424.9,422.4
		L426.0,422.4 L427.1,422.4 L428.2,422.4 L429.3,422.4 L430.3,422.4 L431.4,422.4 L432.5,422.4 L433.6,422.4
		L434.7,422.4 L435.8,422.4 L436.9,422.4 L437.9,422.4 L439.0,422.4 L440.1,422.4 L441.2,422.4 L442.3,422.4
		L443.4,422.4 L444.5,422.4 L445.6,422.4 L446.6,422.4 L447.7,422.4 L448.8,422.4 L449.9,422.4 L451.0,422.4
		L452.1,422.4 L453.2,422.4 L454.2,422.4 L455.3,422.4 L456.4,422.4 L457.5,422.4 L458.6,422.4 L459.7,422.4
		L460.8,422.4 L461.8,422.4 L462.9,422.4 L464.0,422.4 L465.1,422.4 L466.2,422.4 L467.3,422.4 L468.4,422.4
		L469.4,422.4 L470.5,422.4 L471.6,422.4 L472.7,422.4 L473.8,422.4 L474.9,422.4 L476.0,422.4 L477.1,422.4
		L478.1,422.4 L479.2,422.4 L480.3,422.4 L481.4,422.4 L482.5,422.4 L483.6,422.4 L484.7,422.4 L485.7,422.4
		L486.8,422.4 L487.9,422.4 L489.0,422.4 L490.1,422.4 L491.2,422.4 L492.3,422.4 L493.3,422.4 L494.4,422.4
		L495.5,422.4 L496.6,422.4 L497.7,422.4 L498.8,422.4 L499.9,422.4 L500.9,422.4 L502.0,422.4 L503.1,422.4
		L504.2,422.4 L505.3,422.4 L506.4,422.4 L507.5,422.4 L508.6,422.4 L509.6,422.4 L510.7,422.4 L511.8,422.4
		L512.9,422.4 L514.0,422.4 L515.1,422.4 L516.2,422.4 L517.2,422.4 L518.3,422.4 L519.4,422.4 L520.5,422.4
		L521.6,422.4 L522.7,422.4 L523.8,422.4 L524.8,422.4 L525.9,422.4 L527.0,422.4 L528.1,422.4 L529.2,422.4
		L530.3,422.4 L531.4,422.4 L532.4,422.4 L533.5,422.4 L534.6,422.4 L535.7,422.4 L536.8,422.4 L537.9,422.4
		L539.0,422.4 L540.1,422.4 L541.1,422.4 L542.2,422.4 L543.3,422.4 L544.4,422.4 L545.5,422.4 L546.6,422.4
		L547.7,422.4 L548.7,422.4 L549.8,422.4 L550.9,422.4 L552.0,422.4 L553.1,422.4 L554.2,422.4 L555.3,422.4
		L556.3,422.4 L557.4,422.4 L558.5,422.4 L559.6,422.4 L560.7,422.4 L561.8,422.4 L562.9,422.4 L563.9,422.4
		L565.0,422.4 L566.1,422.4 L567.2,422.4 L568.3,422.4 L569.4,422.4 L570.5,422.4 L571.6,422.4 L572.6,422.4
		L573.7,422.4 L574.8,422.4 L575.9,422.4 L577.0,422.4 L578.1,422.4 L579.2,422.4 L580.2,422.4 L581.3,422.4
		L582.4,422.4 L583.5,422.4 L584.6,422.4 L585.7,422.4 L586.8,422.4 L587.8,422.4 L588.9,422.4 L590.0,422.4
		L591.1,422.4 L592.2,422.4 L593.3,422.4 L594.4,422.4 L595.4,422.4 L596.5,422.4 L597.6,422.4 L598.7,422.4
		L599.8,422.4 L600.9,422.4 L602.0,422.4 L603.1,422.4 L604.1,422.4 L605.2,422.4 L606.3,422.4 L607.4,422.4
		L608.5,422.4 L609.6,422.4 L610.7,422.4 L611.7,422.4 L612.8,422.4 L613.9,422.4  '/></g>
	</g>
	<g id="gnuplot_plot_6" ><title>W = 14</title>
<g fill="none" color="black" stroke="currentColor" stroke-width="1.00" stroke-linecap="butt" stroke-linejoin="miter">
	<g transform="translate(547.9,130.0)" stroke="none" fill="black" font-family="Arial" font-size="12.00"  text-anchor="end">
		<text><tspan font-family="Arial" >W = 14</tspan></text>
	</g>
</g>
<g fill="none" color="black" stroke="currentColor" stroke-width="1.00" stroke-linecap="butt" stroke-linejoin="miter">
	<path stroke='rgb(  0, 114, 178)'  d='M556.2,126.1 L598.4,126.1 M71.9,52.3 L73.0,52.7 L74.1,48.0 L75.2,44.6 L76.2,34.9 L77.3,22.2
		L78.4,18.1 L79.5,26.7 L80.6,48.2 L81.7,76.5 L82.8,114.9 L83.8,164.7 L84.9,199.9 L86.0,239.0
		L87.1,270.4 L88.2,293.0 L89.3,313.4 L90.4,330.6 L91.5,344.0 L92.5,357.3 L93.6,365.5 L94.7,369.1
		L95.8,374.8 L96.9,376.6 L98.0,380.0 L99.1,382.2 L100.1,384.4 L101.2,387.0 L102.3,390.4 L103.4,391.8
		L104.5,394.1 L105.6,395.6 L106.7,398.1 L107.7,399.6 L108.8,399.5 L109.9,401.6 L111.0,403.7 L112.1,405.6
		L113.2,405.0 L114.3,406.2 L115.3,405.5 L116.4,408.5 L117.5,408.4 L118.6,409.0 L119.7,408.0 L120.8,410.7
		L121.9,410.8 L123.0,412.0 L124.0,412.3 L125.1,411.9 L126.2,413.5 L127.3,413.2 L128.4,414.3 L129.5,413.5
		L130.6,415.5 L131.6,414.6 L132.7,415.0 L133.8,415.9 L134.9,416.3 L136.0,415.8 L137.1,416.0 L138.2,416.8
		L139.2,417.1 L140.3,417.7 L141.4,417.8 L142.5,418.5 L143.6,418.4 L144.7,418.7 L145.8,418.9 L146.8,419.5
		L147.9,419.7 L149.0,420.5 L150.1,420.7 L151.2,420.9 L152.3,421.2 L153.4,421.0 L154.5,421.6 L155.5,421.8
		L156.6,421.7 L157.7,421.9 L158.8,421.8 L159.9,422.0 L161.0,422.1 L162.1,422.3 L163.1,422.3 L164.2,422.3
		L165.3,422.3 L166.4,422.4 L167.5,422.4 L168.6,422.4 L169.7,422.4 L170.7,422.4 L171.8,422.4 L172.9,422.4
		L174.0,422.4 L175.1,422.4 L176.2,422.4 L177.3,422.4 L178.3,422.4 L179.4,422.4 L180.5,422.4 L181.6,422.4
		L182.7,422.4 L183.8,422.4 L184.9,422.4 L186.0,422.4 L187.0,422.4 L188.1,422.4 L189.2,422.4 L190.3,422.4
		L191.4,422.4 L192.5,422.4 L193.6,422.4 L194.6,422.4 L195.7,422.4 L196.8,422.4 L197.9,422.4 L199.0,422.4
		L200.1,422.4 L201.2,422.4 L202.2,422.4 L203.3,422.4 L204.4,422.4 L205.5,422.4 L206.6,422.4 L207.7,422.4
		L208.8,422.4 L209.8,422.4 L210.9,422.4 L212.0,422.4 L213.1,422.4 L214.2,422.4 L215.3,422.4 L216.4,422.4
		L217.5,422.4 L218.5,422.4 L219.6,422.4 L220.7,422.4 L221.8,422.4 L222.9,422.4 L224.0,422.4 L225.1,422.4
		L226.1,422.4 L227.2,422.4 L228.3,422.4 L229.4,422.4 L230.5,422.4 L231.6,422.4 L232.7,422.4 L233.7,422.4
		L234.8,422.4 L235.9,422.4 L237.0,422.4 L238.1,422.4 L239.2,422.4 L240.3,422.4 L241.3,422.4 L242.4,422.4
		L243.5,422.4 L244.6,422.4 L245.7,422.4 L246.8,422.4 L247.9,422.4 L249.0,422.4 L250.0,422.4 L251.1,422.4
		L252.2,422.4 L253.3,422.4 L254.4,422.4 L255.5,422.4 L256.6,422.4 L257.6,422.4 L258.7,422.4 L259.8,422.4
		L260.9,422.4 L262.0,422.4 L263.1,422.4 L264.2,422.4 L265.2,422.4 L266.3,422.4 L267.4,422.4 L268.5,422.4
		L269.6,422.4 L270.7,422.4 L271.8,422.4 L272.8,422.4 L273.9,422.4 L275.0,422.4 L276.1,422.4 L277.2,422.4
		L278.3,422.4 L279.4,422.4 L280.5,422.4 L281.5,422.4 L282.6,422.4 L283.7,422.4 L284.8,422.4 L285.9,422.4
		L287.0,422.4 L288.1,422.4 L289.1,422.4 L290.2,422.4 L291.3,422.4 L292.4,422.4 L293.5,422.4 L294.6,422.4
		L295.7,422.4 L296.7,422.4 L297.8,422.4 L298.9,422.4 L300.0,422.4 L301.1,422.4 L302.2,422.4 L303.3,422.4
		L304.3,422.4 L305.4,422.4 L306.5,422.4 L307.6,422.4 L308.7,422.4 L309.8,422.4 L310.9,422.4 L312.0,422.4
		L313.0,422.4 L314.1,422.4 L315.2,422.4 L316.3,422.4 L317.4,422.4 L318.5,422.4 L319.6,422.4 L320.6,422.4
		L321.7,422.4 L322.8,422.4 L323.9,422.4 L325.0,422.4 L326.1,422.4 L327.2,422.4 L328.2,422.4 L329.3,422.4
		L330.4,422.4 L331.5,422.4 L332.6,422.4 L333.7,422.4 L334.8,422.4 L335.8,422.4 L336.9,422.4 L338.0,422.4
		L339.1,422.4 L340.2,422.4 L341.3,422.4 L342.4,422.4 L343.4,422.4 L344.5,422.4 L345.6,422.4 L346.7,422.4
		L347.8,422.4 L348.9,422.4 L350.0,422.4 L351.1,422.4 L352.1,422.4 L353.2,422.4 L354.3,422.4 L355.4,422.4
		L356.5,422.4 L357.6,422.4 L358.7,422.4 L359.7,422.4 L360.8,422.4 L361.9,422.4 L363.0,422.4 L364.1,422.4
		L365.2,422.4 L366.3,422.4 L367.3,422.4 L368.4,422.4 L369.5,422.4 L370.6,422.4 L371.7,422.4 L372.8,422.4
		L373.9,422.4 L374.9,422.4 L376.0,422.4 L377.1,422.4 L378.2,422.4 L379.3,422.4 L380.4,422.4 L381.5,422.4
		L382.6,422.4 L383.6,422.4 L384.7,422.4 L385.8,422.4 L386.9,422.4 L388.0,422.4 L389.1,422.4 L390.2,422.4
		L391.2,422.4 L392.3,422.4 L393.4,422.4 L394.5,422.4 L395.6,422.4 L396.7,422.4 L397.8,422.4 L398.8,422.4
		L399.9,422.4 L401.0,422.4 L402.1,422.4 L403.2,422.4 L404.3,422.4 L405.4,422.4 L406.4,422.4 L407.5,422.4
		L408.6,422.4 L409.7,422.4 L410.8,422.4 L411.9,422.4 L413.0,422.4 L414.1,422.4 L415.1,422.4 L416.2,422.4
		L417.3,422.4 L418.4,422.4 L419.5,422.4 L420.6,422.4 L421.7,422.4 L422.7,422.4 L423.8,422.4 L424.9,422.4
		L426.0,422.4 L427.1,422.4 L428.2,422.4 L429.3,422.4 L430.3,422.4 L431.4,422.4 L432.5,422.4 L433.6,422.4
		L434.7,422.4 L435.8,422.4 L436.9,422.4 L437.9,422.4 L439.0,422.4 L440.1,422.4 L441.2,422.4 L442.3,422.4
		L443.4,422.4 L444.5,422.4 L445.6,422.4 L446.6,422.4 L447.7,422.4 L448.8,422.4 L449.9,422.4 L451.0,422.4
		L452.1,422.4 L453.2,422.4 L454.2,422.4 L455.3,422.4 L456.4,422.4 L457.5,422.4 L458.6,422.4 L459.7,422.4
		L460.8,422.4 L461.8,422.4 L462.9,422.4 L464.0,422.4 L465.1,422.4 L466.2,422.4 L467.3,422.4 L468.4,422.4
		L469.4,422.4 L470.5,422.4 L471.6,422.4 L472.7,422.4 L473.8,422.4 L474.9,422.4 L476.0,422.4 L477.1,422.4
		L478.1,422.4 L479.2,422.4 L480.3,422.4 L481.4,422.4 L482.5,422.4 L483.6,422.4 L484.7,422.4 L485.7,422.4
		L486.8,422.4 L487.9,422.4 L489.0,422.4 L490.1,422.4 L491.2,422.4 L492.3,422.4 L493.3,422.4 L494.4,422.4
		L495.5,422.4 L496.6,422.4 L497.7,422.4 L498.8,422.4 L499.9,422.4 L500.9,422.4 L502.0,422.4 L503.1,422.4
		L504.2,422.4 L505.3,422.4 L506.4,422.4 L507.5,422.4 L508.6,422.4 L509.6,422.4 L510.7,422.4 L511.8,422.4
		L512.9,422.4 L514.0,422.4 L515.1,422.4 L516.2,422.4 L517.2,422.4 L518.3,422.4 L519.4,422.4 L520.5,422.4
		L521.6,422.4 L522.7,422.4 L523.8,422.4 L524.8,422.4 L525.9,422.4 L527.0,422.4 L528.1,422.4 L529.2,422.4
		L530.3,422.4 L531.4,422.4 L532.4,422.4 L533.5,422.4 L534.6,422.4 L535.7,422.4 L536.8,422.4 L537.9,422.4
		L539.0,422.4 L540.1,422.4 L541.1,422.4 L542.2,422.4 L543.3,422.4 L544.4,422.4 L545.5,422.4 L546.6,422.4
		L547.7,422.4 L548.7,422.4 L549.8,422.4 L550.9,422.4 L552.0,422.4 L553.1,422.4 L554.2,422.4 L555.3,422.4
		L556.3,422.4 L557.4,422.4 L558.5,422.4 L559.6,422.4 L560.7,422.4 L561.8,422.4 L562.9,422.4 L563.9,422.4
		L565.0,422.4 L566.1,422.4 L567.2,422.4 L568.3,422.4 L569.4,422.4 L570.5,422.4 L571.6,422.4 L572.6,422.4
		L573.7,422.4 L574.8,422.4 L575.9,422.4 L577.0,422.4 L578.1,422.4 L579.2,422.4 L580.2,422.4 L581.3,422.4
		L582.4,422.4 L583.5,422.4 L584.6,422.4 L585.7,422.4 L586.8,422.4 L587.8,422.4 L588.9,422.4 L590.0,422.4
		L591.1,422.4 L592.2,422.4 L593.3,422.4 L594.4,422.4 L595.4,422.4 L596.5,422.4 L597.6,422.4 L598.7,422.4
		L599.8,422.4 L600.9,422.4 L602.0,422.4 L603.1,422.4 L604.1,422.4 L605.2,422.4 L606.3,422.4 L607.4,422.4
		L608.5,422.4 L609.6,422.4 L610.7,422.4 L611.7,422.4 L612.8,422.4 L613.9,422.4  '/></g>
	</g>
	<g id="gnuplot_plot_7" ><title>W = 16</title>
<g fill="none" color="black" stroke="currentColor" stroke-width="1.00" stroke-linecap="butt" stroke-linejoin="miter">
	<g transform="translate(547.9,148.0)" stroke="none" fill="black" font-family="Arial" font-size="12.00"  text-anchor="end">
		<text><tspan font-family="Arial" >W = 16</tspan></text>
	</g>
</g>
<g fill="none" color="black" stroke="currentColor" stroke-width="1.00" stroke-linecap="butt" stroke-linejoin="miter">
	<path stroke='rgb(229,  30,  16)'  d='M556.2,144.1 L598.4,144.1 M71.9,25.9 L73.0,32.9 L74.1,44.0 L75.2,51.5 L76.2,44.1 L77.3,24.4
		L78.4,18.1 L79.5,33.5 L80.6,61.8 L81.7,97.9 L82.8,144.2 L83.8,206.6 L84.9,262.0 L86.0,304.6
		L87.1,325.4 L88.2,340.8 L89.3,358.0 L90.4,378.5 L91.5,390.1 L92.5,400.9 L93.6,406.2 L94.7,410.6
		L95.8,415.4 L96.9,417.8 L98.0,420.2 L99.1,421.1 L100.1,421.8 L101.2,422.2 L102.3,422.4 L103.4,422.4
		L104.5,422.4 L105.6,422.4 L106.7,422.4 L107.7,422.4 L108.8,422.4 L109.9,422.4 L111.0,422.4 L112.1,422.4
		L113.2,422.4 L114.3,422.4 L115.3,422.4 L116.4,422.4 L117.5,422.4 L118.6,422.4 L119.7,422.4 L120.8,422.4
		L121.9,422.4 L123.0,422.4 L124.0,422.4 L125.1,422.4 L126.2,422.4 L127.3,422.4 L128.4,422.4 L129.5,422.4
		L130.6,422.4 L131.6,422.4 L132.7,422.4 L133.8,422.4 L134.9,422.4 L136.0,422.4 L137.1,422.4 L138.2,422.4
		L139.2,422.4 L140.3,422.4 L141.4,422.4 L142.5,422.4 L143.6,422.4 L144.7,422.4 L145.8,422.4 L146.8,422.4
		L147.9,422.4 L149.0,422.4 L150.1,422.4 L151.2,422.4 L152.3,422.4 L153.4,422.4 L154.5,422.4 L155.5,422.4
		L156.6,422.4 L157.7,422.4 L158.8,422.4 L159.9,422.4 L161.0,422.4 L162.1,422.4 L163.1,422.4 L164.2,422.4
		L165.3,422.4 L166.4,422.4 L167.5,422.4 L168.6,422.4 L169.7,422.4 L170.7,422.4 L171.8,422.4 L172.9,422.4
		L174.0,422.4 L175.1,422.4 L176.2,422.4 L177.3,422.4 L178.3,422.4 L179.4,422.4 L180.5,422.4 L181.6,422.4
		L182.7,422.4 L183.8,422.4 L184.9,422.4 L186.0,422.4 L187.0,422.4 L188.1,422.4 L189.2,422.4 L190.3,422.4
		L191.4,422.4 L192.5,422.4 L193.6,422.4 L194.6,422.4 L195.7,422.4 L196.8,422.4 L197.9,422.4 L199.0,422.4
		L200.1,422.4 L201.2,422.4 L202.2,422.4 L203.3,422.4 L204.4,422.4 L205.5,422.4 L206.6,422.4 L207.7,422.4
		L208.8,422.4 L209.8,422.4 L210.9,422.4 L212.0,422.4 L213.1,422.4 L214.2,422.4 L215.3,422.4 L216.4,422.4
		L217.5,422.4 L218.5,422.4 L219.6,422.4 L220.7,422.4 L221.8,422.4 L222.9,422.4 L224.0,422.4 L225.1,422.4
		L226.1,422.4 L227.2,422.4 L228.3,422.4 L229.4,422.4 L230.5,422.4 L231.6,422.4 L232.7,422.4 L233.7,422.4
		L234.8,422.4 L235.9,422.4 L237.0,422.4 L238.1,422.4 L239.2,422.4 L240.3,422.4 L241.3,422.4 L242.4,422.4
		L243.5,422.4 L244.6,422.4 L245.7,422.4 L246.8,422.4 L247.9,422.4 L249.0,422.4 L250.0,422.4 L251.1,422.4
		L252.2,422.4 L253.3,422.4 L254.4,422.4 L255.5,422.4 L256.6,422.4 L257.6,422.4 L258.7,422.4 L259.8,422.4
		L260.9,422.4 L262.0,422.4 L263.1,422.4 L264.2,422.4 L265.2,422.4 L266.3,422.4 L267.4,422.4 L268.5,422.4
		L269.6,422.4 L270.7,422.4 L271.8,422.4 L272.8,422.4 L273.9,422.4 L275.0,422.4 L276.1,422.4 L277.2,422.4
		L278.3,422.4 L279.4,422.4 L280.5,422.4 L281.5,422.4 L282.6,422.4 L283.7,422.4 L284.8,422.4 L285.9,422.4
		L287.0,422.4 L288.1,422.4 L289.1,422.4 L290.2,422.4 L291.3,422.4 L292.4,422.4 L293.5,422.4 L294.6,422.4
		L295.7,422.4 L296.7,422.4 L297.8,422.4 L298.9,422.4 L300.0,422.4 L301.1,422.4 L302.2,422.4 L303.3,422.4
		L304.3,422.4 L305.4,422.4 L306.5,422.4 L307.6,422.4 L308.7,422.4 L309.8,422.4 L310.9,422.4 L312.0,422.4
		L313.0,422.4 L314.1,422.4 L315.2,422.4 L316.3,422.4 L317.4,422.4 L318.5,422.4 L319.6,422.4 L320.6,422.4
		L321.7,422.4 L322.8,422.4 L323.9,422.4 L325.0,422.4 L326.1,422.4 L327.2,422.4 L328.2,422.4 L329.3,422.4
		L330.4,422.4 L331.5,422.4 L332.6,422.4 L333.7,422.4 L334.8,422.4 L335.8,422.4 L336.9,422.4 L338.0,422.4
		L339.1,422.4 L340.2,422.4 L341.3,422.4 L342.4,422.4 L343.4,422.4 L344.5,422.4 L345.6,422.4 L346.7,422.4
		L347.8,422.4 L348.9,422.4 L350.0,422.4 L351.1,422.4 L352.1,422.4 L353.2,422.4 L354.3,422.4 L355.4,422.4
		L356.5,422.4 L357.6,422.4 L358.7,422.4 L359.7,422.4 L360.8,422.4 L361.9,422.4 L363.0,422.4 L364.1,422.4
		L365.2,422.4 L366.3,422.4 L367.3,422.4 L368.4,422.4 L369.5,422.4 L370.6,422.4 L371.7,422.4 L372.8,422.4
		L373.9,422.4 L374.9,422.4 L376.0,422.4 L377.1,422.4 L378.2,422.4 L379.3,422.4 L380.4,422.4 L381.5,422.4
		L382.6,422.4 L383.6,422.4 L384.7,422.4 L385.8,422.4 L386.9,422.4 L388.0,422.4 L389.1,422.4 L390.2,422.4
		L391.2,422.4 L392.3,422.4 L393.4,422.4 L394.5,422.4 L395.6,422.4 L396.7,422.4 L397.8,422.4 L398.8,422.4
		L399.9,422.4 L401.0,422.4 L402.1,422.4 L403.2,422.4 L404.3,422.4 L405.4,422.4 L406.4,422.4 L407.5,422.4
		L408.6,422.4 L409.7,422.4 L410.8,422.4 L411.9,422.4 L413.0,422.4 L414.1,422.4 L415.1,422.4 L416.2,422.4
		L417.3,422.4 L418.4,422.4 L419.5,422.4 L420.6,422.4 L421.7,422.4 L422.7,422.4 L423.8,422.4 L424.9,422.4
		L426.0,422.4 L427.1,422.4 L428.2,422.4 L429.3,422.4 L430.3,422.4 L431.4,422.4 L432.5,422.4 L433.6,422.4
		L434.7,422.4 L435.8,422.4 L436.9,422.4 L437.9,422.4 L439.0,422.4 L440.1,422.4 L441.2,422.4 L442.3,422.4
		L443.4,422.4 L444.5,422.4 L445.6,422.4 L446.6,422.4 L447.7,422.4 L448.8,422.4 L449.9,422.4 L451.0,422.4
		L452.1,422.4 L453.2,422.4 L454.2,422.4 L455.3,422.4 L456.4,422.4 L457.5,422.4 L458.6,422.4 L459.7,422.4
		L460.8,422.4 L461.8,422.4 L462.9,422.4 L464.0,422.4 L465.1,422.4 L466.2,422.4 L467.3,422.4 L468.4,422.4
		L469.4,422.4 L470.5,422.4 L471.6,422.4 L472.7,422.4 L473.8,422.4 L474.9,422.4 L476.0,422.4 L477.1,422.4
		L478.1,422.4 L479.2,422.4 L480.3,422.4 L481.4,422.4 L482.5,422.4 L483.6,422.4 L484.7,422.4 L485.7,422.4
		L486.8,422.4 L487.9,422.4 L489.0,422.4 L490.1,422.4 L491.2,422.4 L492.3,422.4 L493.3,422.4 L494.4,422.4
		L495.5,422.4 L496.6,422.4 L497.7,422.4 L498.8,422.4 L499.9,422.4 L500.9,422.4 L502.0,422.4 L503.1,422.4
		L504.2,422.4 L505.3,422.4 L506.4,422.4 L507.5,422.4 L508.6,422.4 L509.6,422.4 L510.7,422.4 L511.8,422.4
		L512.9,422.4 L514.0,422.4 L515.1,422.4 L516.2,422.4 L517.2,422.4 L518.3,422.4 L519.4,422.4 L520.5,422.4
		L521.6,422.4 L522.7,422.4 L523.8,422.4 L524.8,422.4 L525.9,422.4 L527.0,422.4 L528.1,422.4 L529.2,422.4
		L530.3,422.4 L531.4,422.4 L532.4,422.4 L533.5,422.4 L534.6,422.4 L535.7,422.4 L536.8,422.4 L537.9,422.4
		L539.0,422.4 L540.1,422.4 L541.1,422.4 L542.2,422.4 L543.3,422.4 L544.4,422.4 L545.5,422.4 L546.6,422.4
		L547.7,422.4 L548.7,422.4 L549.8,422.4 L550.9,422.4 L552.0,422.4 L553.1,422.4 L554.2,422.4 L555.3,422.4
		L556.3,422.4 L557.4,422.4 L558.5,422.4 L559.6,422.4 L560.7,422.4 L561.8,422.4 L562.9,422.4 L563.9,422.4
		L565.0,422.4 L566.1,422.4 L567.2,422.4 L568.3,422.4 L569.4,422.4 L570.5,422.4 L571.6,422.4 L572.6,422.4
		L573.7,422.4 L574.8,422.4 L575.9,422.4 L577.0,422.4 L578.1,422.4 L579.2,422.4 L580.2,422.4 L581.3,422.4
		L582.4,422.4 L583.5,422.4 L584.6,422.4 L585.7,422.4 L586.8,422.4 L587.8,422.4 L588.9,422.4 L590.0,422.4
		L591.1,422.4 L592.2,422.4 L593.3,422.4 L594.4,422.4 L595.4,422.4 L596.5,422.4 L597.6,422.4 L598.7,422.4
		L599.8,422.4 L600.9,422.4 L602.0,422.4 L603.1,422.4 L604.1,422.4 L605.2,422.4 L606.3,422.4 L607.4,422.4
		L608.5,422.4 L609.6,422.4 L610.7,422.4 L611.7,422.4 L612.8,422.4 L613.9,422.4  '/></g>
	</g>
<g fill="none" color="white" stroke="rgb(229,  30,  16)" stroke-width="2.00" stroke-linecap="butt" stroke-linejoin="miter">
</g>
<g fill="none" color="black" stroke="currentColor" stroke-width="2.00" stroke-linecap="butt" stroke-linejoin="miter">
</g>
<g fill="none" color="black" stroke="black" stroke-width="1.00" stroke-linecap="butt" stroke-linejoin="miter">
</g>
<g fill="none" color="black" stroke="currentColor" stroke-width="1.00" stroke-linecap="butt" stroke-linejoin="miter">
	<path stroke='black'  d='M71.9,18.1 L71.9,422.4 L615.0,422.4 L615.0,18.1 L71.9,18.1 Z  '/></g>
<g fill="none" color="black" stroke="currentColor" stroke-width="1.00" stroke-linecap="butt" stroke-linejoin="miter">
</g>
</g>
</svg>

