ProductCode,Commodity,Phone,Name,Gender
PROD01,Food,313-123-1234,Jim,Male
PROD02,Food,313-123-1235,Jenny,Female
PROD03,Food,313-123-1236,Frank,Male
PROD04,Steel,313-123-1237,Wanda,Female
PROD05,Steel,313-123-1238,Mike,Male
PROD06,Steel,313-123-1239,Raj,Male
PROD07,Steel,313-123-1240,Sally,Female
