{
  "version": "1.0",
  "cmsComponentType": "EXPANSION_PANEL", //CMS custom component corresponding to MUI - ExpansionPanel, 这里是普通ExpansionPanel
  "key": "",
  "style": {},
  "cmsProps":{
    "defaultExpanded": true, //这里代表这个plan是否默认展开状态
    "iconProps": {// 这里设置label的图标名字
      "color":"",//颜色, 'action' | 'disabled' | 'error' | 'inherit' | 'primary' | 'secondary'
      "fontSize":"default",//大小, 'default' | 'inherit' | 'large' | 'small'
      "viewBox":"0 0 24 24",//图标显示区域
      "iconName":"",//图标名字
      "style":{}//这个具体设置图标的样式
    },
    "leftText": "", //左边的文字, 可以是正常的text, 或者是一个带#的数据mapping
    "leftTextStyle": {}, //左边的文字的样式
    "rightText": "", 
    "rightTextStyle": {}
  },
  "muiProps": {
    "IconButtonProps": {} //这里应该是可以改变icon的颜色, eg: "IconButtonProps": {color:"secondary"}
  },
  "items": [] //这里填充的是Expansion details里面的元素
}