{
  "version": "1.0",
  "cmsComponentType": "FILTER_SUB_CONTAINER", // 这里定义实现dashboard的里面report / activity两部分, 仅仅做一个包裹, 里面会添加CONTAINER_WITH_BTN
  "key": "",
  "style": {}, 
  "cmsProps": {
    "dataFuncKey":"",//这里代表的是当前dashboard固定的refresh方法的前缀名
    "dataUrl": "", //这里代表数据的前缀name, 然后会循环构建items里面添加的card, items里面的card需要设定一个type.
    "params": [ //这里是查询数据url的参数
      {
          "name": "",
          "value": ""
      }
    ],
    //下面几个字段设置排列的布局, 跟grid一样, https://material-ui.com/components/grid/#grid
    "direction": "",  //'row' | 'row-reverse' | 'column' | 'column-reverse'
    "justify": "", //'flex-start' | 'center' | 'flex-end' | 'space-between' | 'space-around' | 'space-evenly'
    "alignItems": "", //'flex-start' | 'center' | 'flex-end' | 'stretch' | 'baseline'
    "spacing": 0, //间隔 0 - 10
    "noDataPageid":""//这里设置如果没有数据显示那个json里面的
  },
  "muiProps": {
  },
  "items": []
}