{
  "version": "1.0",
  "cmsComponentType": "LINE_SEPARATOR",
  "isProtected": false,
  "style": [
    {
      "key": "width",
      "value": {
        "title": "width",
        "type": "string"
      }
    },
    {
      "key": "maxWidth",
      "value": {
        "title": "max width",
        "type": "string"
      }
    },
    {
      "key": "minWidth",
      "value": {
        "title": "min width",
        "type": "string"
      }
    },
    {
      "key": "height",
      "value": {
        "title": "height",
        "type": "string"
      }
    },
    {
      "key": "maxHeight",
      "value": {
        "title": "max height",
        "type": "string"
      }
    },
    {
      "key": "minHeight",
      "value": {
        "title": "min height",
        "type": "string"
      }
    },
    {
      "key": "backgroundColor",
      "value": {
        "title": "background color",
        "type": "colorPicker"
      }
    },
    {
      "key": "backgroundImage",
      "value": {
        "title": "background image",
        "type": "imagePicker"
      }
    },
    {
      "key": "backgroundSize",
      "value": {
        "title": "Background Size",
        "type": "dropdown",
        "options": [
          "auto",
          "length",
          "cover",
          "contain",
          "initial",
          "inherit"
        ]
      }
    },
    {
      "key": "backgroundRepeat",
      "value": {
        "title": "Background Repeat",
        "type": "dropdown",
        "options": [
          "repeat",
          "repeat-x",
          "repeat-y",
          "no-repeat",
          "space",
          "round",
          "initial",
          "inherit"
        ]
      }
    },
    {
      "key": "backgroundPosition",
      "value": {
        "title": "Background Position",
        "type": "dropdown",
        "options": [
          "left top",
          "left center",
          "left bottom",
          "right top",
          "right center",
          "right bottom",
          "center top",
          "center center",
          "center bootom",
          "initial",
          "inherit"
        ]
      }
    },
    {
      "key": "paddingTop",
      "value": {
        "title": "padding top",
        "type": "string"
      }
    },
    {
      "key": "paddingBottom",
      "value": {
        "title": "padding bottom",
        "type": "string"
      }
    },
    {
      "key": "paddingLeft",
      "value": {
        "title": "padding left",
        "type": "string"
      }
    },
    {
      "key": "paddingRight",
      "value": {
        "title": "padding right",
        "type": "string"
      }
    },
    {
      "key": "marginTop",
      "value": {
        "title": "margin top",
        "type": "string"
      }
    },
    {
      "key": "marginBottom",
      "value": {
        "title": "margin bottom",
        "type": "string"
      }
    },
    {
      "key": "marginLeft",
      "value": {
        "title": "margin left",
        "type": "string"
      }
    },
    {
      "key": "marginRight",
      "value": {
        "title": "margin right",
        "type": "string"
      }
    },
    {
      "key": "position",
      "value": {
        "title": "margin right",
        "type": "dropdown",
        "options": [
          "relative",
          "absolute",
          "fixed",
          "sticky"
        ]
      }
    },
    {
      "key": "top",
      "value": {
        "title": "top",
        "type": "string"
      }
    },
    {
      "key": "bottom",
      "value": {
        "title": "bottom",
        "type": "string"
      }
    },
    {
      "key": "left",
      "value": {
        "title": "left",
        "type": "string"
      }
    },
    {
      "key": "right",
      "value": {
        "title": "right",
        "type": "string"
      }
    },
    {
      "key": "display",
      "value": {
        "title": "display",
        "type": "dropdown",
        "options": [
          "block",
          "inline",
          "inline-block",
          "flex",
          "none"
        ]
      }
    },
    {
      "key": "zIndex",
      "value": {
        "title": "zIndex",
        "type": "number"
      }
    },
    {
      "key": "fontSize",
      "value": {
        "title": "font size",
        "type": "number"
      }
    },
    {
      "key": "color",
      "value": {
        "title": "color",
        "type": "colorPicker"
      }
    },
    {
      "key": "fontWeight",
      "value": {
        "title": "font weight",
        "type": "dropdown",
        "options": [
          "normal",
          "bold",
          "bolder",
          "light",
          "lighter",
          "100",
          "200",
          "300",
          "400",
          "500",
          "600",
          "700",
          "800",
          "900",
          "inherit"
        ]
      }
    },
    {
      "key": "lineHeight",
      "value": {
        "title": "line height",
        "type": "number"
      }
    },
    {
      "key": "borderTop",
      "value": {
        "title": "border top",
        "type": "string"
      }
    },
    {
      "key": "borderBottom",
      "value": {
        "title": "border bottom",
        "type": "string"
      }
    },
    {
      "key": "borderLeft",
      "value": {
        "title": "border left",
        "type": "string"
      }
    },
    {
      "key": "borderRight",
      "value": {
        "title": "border right",
        "type": "string"
      }
    },
    {
      "key": "borderRadius",
      "value": {
        "title": "border radius",
        "type": "string"
      }
    },
    {
      "key": "boxShadow",
      "value": {
        "title": "box shadow",
        "type": "string"
      }
    },
    {
      "key": "overflowX",
      "value": {
        "title": "overflow X",
        "type": "dropdown",
        "options": [
          "visible",
          "hidden",
          "scroll",
          "auto",
          "no-display",
          "no-content"
        ]
      }
    },
    {
      "key": "overflowY",
      "value": {
        "title": "overflow Y",
        "type": "dropdown",
        "options": [
          "visible",
          "hidden",
          "scroll",
          "auto",
          "no-display",
          "no-content"
        ]
      }
    }
  ],
  "cmsProps": [],
  "muiProps": [
    {
      "key": "orientation",
      "value": {
        "title": "Orientation",
        "type": "dropdown",
        "options": [
          "horizontal",
          "vertical"
        ]
      }
    }
  ],
  "displayImage": {
    "bucket": "cms-admin-cicd-component",
    "key": "Line Separator.svg"
  },
  "displayName": {
    "en": "Line Separator",
    "zh-hant": "分割线"
  },
  "system": {
    "createdBy": "admin",
    "updatedBy": "admin",
    "createdDate": "2020-03-12T06:51:07.465Z",
    "updatedDate": "2020-03-12T06:51:07.465Z"
  }
}