{
  "version": "1.0",
  "cmsComponentType": "TEXT_WITH_ICON", //CMS custom component corresponding to MUI - Typograhpy
  "key": "",  
  "style": {}, 
  "cmsProps": {  
    "value": "", //Text value to be displayed on Screen, eg: #fullname or #lookup('','')
    "visible": "", //这里代表这个组件是否显示, 如果""则一直显示; 如果是#data.enabledFlag, 则代表判断数据里面的enabledFlag字段, 为true则显示, false则隐藏
    "startIconProps": {// 这里设置TEXT的左边图标属性
      "color":"",//颜色, 'action' | 'disabled' | 'error' | 'inherit' | 'primary' | 'secondary'
      "fontSize":"default",//大小, 'default' | 'inherit' | 'large' | 'small'
      "viewBox":"0 0 24 24",//图标显示区域
      "iconName":"",//图标名字
      "style":{}//这个具体设置图标的样式
    }
  },
  "muiProps": {
    "align": "",
    "color": "",
    "display": "",
    "noWrap": false,
    "variant":""//代表Typograhpy的样式('h1' | 'h2' | 'h3' | 'h4' | 'h5' | 'h6' | 'subtitle1' | 'subtitle2' | 'body1' | 'body2' | 'caption' | 'button' | 'overline' | 'inherit'), 可以参考MUI - Typograhpy
  }
}