{
  "version": "1.0",
  "cmsComponentType": "TAB", //CMS custom component corresponding to MUI - TAB
  "key": "",  
  "style": {}, 
  "cmsProps": {
    "dataUrl": "",//TabPanel所需要的数据url
    "actionUrl": "",//TabPanel显示的json page id
    "visible": "", //这里代表这个tab是否显示, 如果""则一直显示; 如果是#data.enabledFlag, 则代表判断数据里面的enabledFlag字段, 为true则显示, false则隐藏
    "label": "", //这里是tab显示内容
    "iconProps": {// 这里设置label的图标名字
      "color":"",//颜色, 'action' | 'disabled' | 'error' | 'inherit' | 'primary' | 'secondary'
      "fontSize":"default",//大小, 'default' | 'inherit' | 'large' | 'small'
      "viewBox":"0 0 24 24",//图标显示区域
      "iconName":"",//图标名字
      "style":{}//这个具体设置图标的样式
    },
    "iconPosition":""//这里设置图标的位置, 默认是上方. "" | start | end
  },
  "muiProps": {
    "wrapped": false
  }
}