{
  "version": "1.0",
  "cmsComponentType": "UPLOAD_DOC", //CMS Custom Component without MUI correspondence
  "key": "",
  "style": {},
  "cmsProps":{
    "label": "Drag your file here", //上传提示信息
    "iconProps": {// 这里设置label的图标名字
      "color":"",//颜色, 'action' | 'disabled' | 'error' | 'inherit' | 'primary' | 'secondary'
      "fontSize":"default",//大小, 'default' | 'inherit' | 'large' | 'small'
      "viewBox":"0 0 24 24",//图标显示区域
      "iconName":"",//图标名字
      "style":{}//这个具体设置图标的样式
    },
    "accept": "image/jpg, image/png, .pdf",//这里代表允许上传的文件类型, 多个允许使用逗号隔开
    "multiple": true,//这里设置是否可以多选文件上传
    "maxSize": 3145728,//这里设置每个文件的大小, 单位是bytes
    "uploadedListUrl":"",//这里是拿到所有已经上传文件list的api
    "uploadedListParams": [ //拿上传文件list的参数
      {
        "name": "docType", //参数名
        "value": "clientProfile" //参数值, 这里可以是#xxxx
      }
    ],
    "uploadedSingleUrl":"",//这里是拿到每个上传文件缩略图的api, 这里主要是构造出一个url, 赋给image.src的
    "uploadedSingleParams": [ //拿单个文件的参数
      {
        "name": "docType", //参数名
        "value": "clientProfile" //参数值, 这里可以是#xxxx
      }
    ],
    "uploadUrl": "", //上传的url
    "uploadParams": [ //这个是上传的参数
      {
        "name": "docType", //参数名
        "value": "clientProfile" //参数值, 这里可以是#xxxx
      }
    ],
    "deleteUrl": "", //删除上传的url
    "deleteParams": [ //这个是删除上传需要的参数
      {
        "name": "docType", //参数名
        "value": "clientProfile" //参数值, 这里可以是#xxxx
      }
    ]
  },
  "muiProps": {
  }
}