{
  "version": "1.0",
  "cmsComponentType": "TEXT_LINK",
  "isProtected": false,
  "style": [
    {
      "key": "width",
      "value": {
        "title": "width",
        "type": "string"
      }
    },
    {
      "key": "maxWidth",
      "value": {
        "title": "max width",
        "type": "string"
      }
    },
    {
      "key": "minWidth",
      "value": {
        "title": "min width",
        "type": "string"
      }
    },
    {
      "key": "height",
      "value": {
        "title": "height",
        "type": "string"
      }
    },
    {
      "key": "maxHeight",
      "value": {
        "title": "max height",
        "type": "string"
      }
    },
    {
      "key": "minHeight",
      "value": {
        "title": "min height",
        "type": "string"
      }
    },
    {
      "key": "backgroundColor",
      "value": {
        "title": "background color",
        "type": "colorPicker"
      }
    },
    {
      "key": "backgroundImage",
      "value": {
        "title": "background image",
        "type": "imagePicker"
      }
    },
    {
      "key": "backgroundSize",
      "value": {
        "title": "Background Size",
        "type": "dropdown",
        "options": [
          "auto",
          "length",
          "cover",
          "contain",
          "initial",
          "inherit"
        ]
      }
    },
    {
      "key": "backgroundRepeat",
      "value": {
        "title": "Background Repeat",
        "type": "dropdown",
        "options": [
          "repeat",
          "repeat-x",
          "repeat-y",
          "no-repeat",
          "space",
          "round",
          "initial",
          "inherit"
        ]
      }
    },
    {
      "key": "backgroundPosition",
      "value": {
        "title": "Background Position",
        "type": "dropdown",
        "options": [
          "left top",
          "left center",
          "left bottom",
          "right top",
          "right center",
          "right bottom",
          "center top",
          "center center",
          "center bootom",
          "initial",
          "inherit"
        ]
      }
    },
    {
      "key": "paddingTop",
      "value": {
        "title": "padding top",
        "type": "string"
      }
    },
    {
      "key": "paddingBottom",
      "value": {
        "title": "padding bottom",
        "type": "string"
      }
    },
    {
      "key": "paddingLeft",
      "value": {
        "title": "padding left",
        "type": "string"
      }
    },
    {
      "key": "paddingRight",
      "value": {
        "title": "padding right",
        "type": "string"
      }
    },
    {
      "key": "marginTop",
      "value": {
        "title": "margin top",
        "type": "string"
      }
    },
    {
      "key": "marginBottom",
      "value": {
        "title": "margin bottom",
        "type": "string"
      }
    },
    {
      "key": "marginLeft",
      "value": {
        "title": "margin left",
        "type": "string"
      }
    },
    {
      "key": "marginRight",
      "value": {
        "title": "margin right",
        "type": "string"
      }
    },
    {
      "key": "position",
      "value": {
        "title": "margin right",
        "type": "dropdown",
        "options": [
          "relative",
          "absolute",
          "fixed",
          "sticky"
        ]
      }
    },
    {
      "key": "top",
      "value": {
        "title": "top",
        "type": "string"
      }
    },
    {
      "key": "bottom",
      "value": {
        "title": "bottom",
        "type": "string"
      }
    },
    {
      "key": "left",
      "value": {
        "title": "left",
        "type": "string"
      }
    },
    {
      "key": "right",
      "value": {
        "title": "right",
        "type": "string"
      }
    },
    {
      "key": "display",
      "value": {
        "title": "display",
        "type": "dropdown",
        "options": [
          "block",
          "inline",
          "inline-block",
          "flex",
          "none"
        ]
      }
    },
    {
      "key": "zIndex",
      "value": {
        "title": "zIndex",
        "type": "number"
      }
    },
    {
      "key": "fontSize",
      "value": {
        "title": "font size",
        "type": "number"
      }
    },
    {
      "key": "color",
      "value": {
        "title": "color",
        "type": "colorPicker"
      }
    },
    {
      "key": "fontWeight",
      "value": {
        "title": "font weight",
        "type": "dropdown",
        "options": [
          "normal",
          "bold",
          "bolder",
          "light",
          "lighter",
          "100",
          "200",
          "300",
          "400",
          "500",
          "600",
          "700",
          "800",
          "900",
          "inherit"
        ]
      }
    },
    {
      "key": "lineHeight",
      "value": {
        "title": "line height",
        "type": "number"
      }
    },
    {
      "key": "borderTop",
      "value": {
        "title": "border top",
        "type": "string"
      }
    },
    {
      "key": "borderBottom",
      "value": {
        "title": "border bottom",
        "type": "string"
      }
    },
    {
      "key": "borderLeft",
      "value": {
        "title": "border left",
        "type": "string"
      }
    },
    {
      "key": "borderRight",
      "value": {
        "title": "border right",
        "type": "string"
      }
    },
    {
      "key": "borderRadius",
      "value": {
        "title": "border radius",
        "type": "string"
      }
    },
    {
      "key": "boxShadow",
      "value": {
        "title": "box shadow",
        "type": "string"
      }
    }
  ],
  "cmsProps": [
    {
      "key": "eventType",
      "value": {
        "title": "Event Type",
        "type": "dropdown",
        "options": [
          "dialog",
          "dialogRedirect",
          "globalMessage",
          "systemRedirect",
          "tabRedirect",
          "api",
          "functions"
        ]
      }
    },
    {
      "key": "eventProps",
      "value": {
        "title": "event props",
        "type": "dynamicObject",
        "mappingKey": "eventType",
        "mapping": {
          "dialog": {
            "key": "dialog",
            "items": [
              {
                "key": "dialogId",
                "value": {
                  "title": "Dialog Id",
                  "type": "string"
                }
              },
              {
                "key": "url",
                "value": {
                  "title": "Page id",
                  "type": "object",
                  "items": [
                    {
                      "key": "phone",
                      "value": {
                        "title": "Page id for phone",
                        "type": "string"
                      }
                    },
                    {
                      "key": "tablet",
                      "value": {
                        "title": "Page id for tablet",
                        "type": "string"
                      }
                    },
                    {
                      "key": "pc",
                      "value": {
                        "title": "Page id for pc",
                        "type": "string"
                      }
                    }
                  ]
                }
              },
              {
                "key": "preHandle",
                "value": {
                  "title": "Action before open dialog",
                  "type": "object",
                  "items": [
                    {
                      "key": "api",
                      "value": {
                        "title": "Api url",
                        "type": "string"
                      }
                    },
                    {
                      "key": "type",
                      "value": {
                        "title": "request type",
                        "type": "string"
                      }
                    },
                    {
                      "key": "params",
                      "value": {
                        "title": "Params",
                        "type": "simpleArray",
                        "objectItems": [
                          {
                            "key": "name",
                            "value": {
                              "title": "parameter name",
                              "type": "string"
                            }
                          },
                          {
                            "key": "value",
                            "value": {
                              "title": "parameter value",
                              "type": "string"
                            }
                          }
                        ]
                      }
                    }
                  ]
                }
              },
              {
                "key": "fullScreen",
                "value": {
                  "title": "If full screen?",
                  "type": "boolean"
                }
              },
              {
                "key": "fullWidth",
                "value": {
                  "title": "If full width?",
                  "type": "boolean"
                }
              },
              {
                "key": "maxWidth",
                "value": {
                  "title": "Max width",
                  "type": "dropdown",
                  "options": [
                    "xs",
                    "sm",
                    "md",
                    "lg",
                    "xl"
                  ]
                }
              },
              {
                "key": "radioCardSelectedName",
                "value": {
                  "title": "radioCardSelectedName",
                  "type": "string"
                }
              }
            ]
          },
          "api": {
            "key": "api",
            "items": [
              {
                "key": "url",
                "value": {
                  "title": "url",
                  "type": "string"
                }
              },
              {
                "key": "requestType",
                "value": {
                  "title": "Request type",
                  "type": "string"
                }
              },
              {
                "key": "params",
                "value": {
                  "title": "Params",
                  "type": "simpleArray",
                  "objectItems": [
                    {
                      "key": "name",
                      "value": {
                        "title": "parameter name",
                        "type": "string"
                      }
                    },
                    {
                      "key": "value",
                      "value": {
                        "title": "parameter value",
                        "type": "string"
                      }
                    }
                  ]
                }
              },
              {
                "key": "callbackFunction",
                "value": {
                  "title": "callback functions",
                  "type": "array"
                }
              }
            ]
          },
          "globalMessage": {
            "key": "globalMessage",
            "items": [
              {
                "key": "status",
                "value": {
                  "title": "Status",
                  "type": "dropdown",
                  "options": [
                    "error",
                    "warning",
                    "success",
                    "info"
                  ]
                }
              },
              {
                "key": "title",
                "value": {
                  "title": "Title",
                  "type": "string"
                }
              },
              {
                "key": "content",
                "value": {
                  "title": "Content",
                  "type": "string"
                }
              },
              {
                "key": "showCancelBtn",
                "value": {
                  "title": "If show Cancel Button?",
                  "type": "boolean"
                }
              },
              {
                "key": "confirmBtnActions",
                "value": {
                  "title": "confirm actions",
                  "type": "arrayForObject",
                  "objectItems": {
                    "key": "",
                    "value": {
                      "title": "confirm actions for",
                      "type": "object",
                      "items": [
                        {
                          "key": "url",
                          "value": {
                            "title": "action Url",
                            "type": "string"
                          }
                        },
                        {
                          "key": "requestType",
                          "value": {
                            "title": "request type",
                            "type": "string"
                          }
                        },
                        {
                          "key": "params",
                          "value": {
                            "title": "Params",
                            "type": "simpleArray",
                            "objectItems": [
                              {
                                "key": "name",
                                "value": {
                                  "title": "parameter name",
                                  "type": "string"
                                }
                              },
                              {
                                "key": "value",
                                "value": {
                                  "title": "parameter value",
                                  "type": "string"
                                }
                              }
                            ]
                          }
                        },
                        {
                          "key": "callbackFunction",
                          "value": {
                            "title": "function name list",
                            "type": "array"
                          }
                        }
                      ]
                    }
                  }
                }
              }
            ]
          },
          "dialogRedirect": {
            "key": "dialogRedirect",
            "items": [
              {
                "key": "dialogId",
                "value": {
                  "title": "Dialog Id",
                  "type": "string"
                }
              },
              {
                "key": "url",
                "value": {
                  "title": "Page id",
                  "type": "object",
                  "items": [
                    {
                      "key": "phone",
                      "value": {
                        "title": "Page id for phone",
                        "type": "string"
                      }
                    },
                    {
                      "key": "tablet",
                      "value": {
                        "title": "Page id for tablet",
                        "type": "string"
                      }
                    },
                    {
                      "key": "pc",
                      "value": {
                        "title": "Page id for pc",
                        "type": "string"
                      }
                    }
                  ]
                }
              },
              {
                "key": "fullScreen",
                "value": {
                  "title": "If full screen?",
                  "type": "boolean"
                }
              },
              {
                "key": "fullWidth",
                "value": {
                  "title": "If full width?",
                  "type": "boolean"
                }
              },
              {
                "key": "maxWidth",
                "value": {
                  "title": "Max width",
                  "type": "dropdown",
                  "options": [
                    "xs",
                    "sm",
                    "md",
                    "lg",
                    "xl"
                  ]
                }
              }
            ]
          },
          "systemRedirect": {
            "key": "systemRedirect",
            "items": [
              {
                "key": "url",
                "value": {
                  "title": "Page id",
                  "type": "object",
                  "items": [
                    {
                      "key": "phone",
                      "value": {
                        "title": "Page id for phone",
                        "type": "string"
                      }
                    },
                    {
                      "key": "tablet",
                      "value": {
                        "title": "Page id for tablet",
                        "type": "string"
                      }
                    },
                    {
                      "key": "pc",
                      "value": {
                        "title": "Page id for pc",
                        "type": "string"
                      }
                    }
                  ]
                }
              },
              {
                "key": "preHandle",
                "value": {
                  "title": "Action before redirect",
                  "type": "object",
                  "items": [
                    {
                      "key": "api",
                      "value": {
                        "title": "Api url",
                        "type": "string"
                      }
                    },
                    {
                      "key": "type",
                      "value": {
                        "title": "request type",
                        "type": "string"
                      }
                    },
                    {
                      "key": "params",
                      "value": {
                        "title": "Params",
                        "type": "simpleArray",
                        "objectItems": [
                          {
                            "key": "name",
                            "value": {
                              "title": "parameter name",
                              "type": "string"
                            }
                          },
                          {
                            "key": "value",
                            "value": {
                              "title": "parameter value",
                              "type": "string"
                            }
                          }
                        ]
                      }
                    }
                  ]
                }
              }
            ]
          },
          "tabRedirect": {
            "key": "tabRedirect",
            "items": [
              {
                "key": "functionName",
                "value": {
                  "title": "Redirect function name",
                  "type": "string"
                }
              },
              {
                "key": "toTabIndex",
                "value": {
                  "title": "Redirect to",
                  "type": "number"
                }
              }
            ]
          },
          "functions": {
            "key": "functions",
            "items": [
              {
                "key": "functionNames",
                "value": {
                  "title": "function name list",
                  "type": "array"
                }
              }
            ]
          }
        }
      }
    },
    {
      "key": "displayText",
      "value": {
        "title": "Display Text",
        "type": "string"
      }
    },
    {
      "key": "visible",
      "value": {
        "title": "visible key",
        "type": "string"
      }
    },
    {
      "key": "disabled",
      "value": {
        "title": "disabled key",
        "type": "string"
      }
    },
    {
      "key": "iconProps",
      "value": {
        "title": "Icon Props",
        "type": "object",
        "items": [
          {
            "key": "iconName",
            "value": {
              "title": "icon name",
              "type": "iconPicker"
            }
          },
          {
            "key": "color",
            "value": {
              "title": "color",
              "type": "dropdown",
              "options": [
                "action",
                "disabled",
                "error",
                "inherit",
                "primary",
                "secondary"
              ]
            }
          },
          {
            "key": "fontSize",
            "value": {
              "title": "Icon Size",
              "type": "dropdown",
              "options": [
                "default",
                "inherit",
                "large",
                "small"
              ]
            }
          },
          {
            "key": "viewBox",
            "value": {
              "title": "svg view box setting",
              "type": "string"
            }
          },
          {
            "key": "style",
            "value": {
              "title": "svg style setting",
              "type": "object",
              "items": [
                {
                  "key": "width",
                  "value": {
                    "title": "width",
                    "type": "string"
                  }
                },
                {
                  "key": "maxWidth",
                  "value": {
                    "title": "max width",
                    "type": "string"
                  }
                },
                {
                  "key": "minWidth",
                  "value": {
                    "title": "min width",
                    "type": "string"
                  }
                },
                {
                  "key": "height",
                  "value": {
                    "title": "height",
                    "type": "string"
                  }
                },
                {
                  "key": "maxHeight",
                  "value": {
                    "title": "max height",
                    "type": "string"
                  }
                },
                {
                  "key": "minHeight",
                  "value": {
                    "title": "min height",
                    "type": "string"
                  }
                },
                {
                  "key": "backgroundColor",
                  "value": {
                    "title": "background color",
                    "type": "colorPicker"
                  }
                },
                {
                  "key": "backgroundImage",
                  "value": {
                    "title": "background image",
                    "type": "imagePicker"
                  }
                },
                {
                  "key": "backgroundSize",
                  "value": {
                    "title": "Background Size",
                    "type": "dropdown",
                    "options": [
                      "auto",
                      "length",
                      "cover",
                      "contain",
                      "initial",
                      "inherit"
                    ]
                  }
                },
                {
                  "key": "backgroundRepeat",
                  "value": {
                    "title": "Background Repeat",
                    "type": "dropdown",
                    "options": [
                      "repeat",
                      "repeat-x",
                      "repeat-y",
                      "no-repeat",
                      "space",
                      "round",
                      "initial",
                      "inherit"
                    ]
                  }
                },
                {
                  "key": "backgroundPosition",
                  "value": {
                    "title": "Background Position",
                    "type": "dropdown",
                    "options": [
                      "left top",
                      "left center",
                      "left bottom",
                      "right top",
                      "right center",
                      "right bottom",
                      "center top",
                      "center center",
                      "center bootom",
                      "initial",
                      "inherit"
                    ]
                  }
                },
                {
                  "key": "paddingTop",
                  "value": {
                    "title": "padding top",
                    "type": "string"
                  }
                },
                {
                  "key": "paddingBottom",
                  "value": {
                    "title": "padding bottom",
                    "type": "string"
                  }
                },
                {
                  "key": "paddingLeft",
                  "value": {
                    "title": "padding left",
                    "type": "string"
                  }
                },
                {
                  "key": "paddingRight",
                  "value": {
                    "title": "padding right",
                    "type": "string"
                  }
                },
                {
                  "key": "marginTop",
                  "value": {
                    "title": "margin top",
                    "type": "string"
                  }
                },
                {
                  "key": "marginBottom",
                  "value": {
                    "title": "margin bottom",
                    "type": "string"
                  }
                },
                {
                  "key": "marginLeft",
                  "value": {
                    "title": "margin left",
                    "type": "string"
                  }
                },
                {
                  "key": "marginRight",
                  "value": {
                    "title": "margin right",
                    "type": "string"
                  }
                },
                {
                  "key": "position",
                  "value": {
                    "title": "position",
                    "type": "dropdown",
                    "options": [
                      "relative",
                      "absolute",
                      "fixed",
                      "sticky"
                    ]
                  }
                },
                {
                  "key": "top",
                  "value": {
                    "title": "top",
                    "type": "string"
                  }
                },
                {
                  "key": "bottom",
                  "value": {
                    "title": "bottom",
                    "type": "string"
                  }
                },
                {
                  "key": "left",
                  "value": {
                    "title": "left",
                    "type": "string"
                  }
                },
                {
                  "key": "right",
                  "value": {
                    "title": "right",
                    "type": "string"
                  }
                },
                {
                  "key": "display",
                  "value": {
                    "title": "display",
                    "type": "dropdown",
                    "options": [
                      "block",
                      "inline",
                      "inline-block",
                      "flex",
                      "none"
                    ]
                  }
                },
                {
                  "key": "zIndex",
                  "value": {
                    "title": "zIndex",
                    "type": "number"
                  }
                },
                {
                  "key": "fontSize",
                  "value": {
                    "title": "font size",
                    "type": "number"
                  }
                },
                {
                  "key": "color",
                  "value": {
                    "title": "color",
                    "type": "colorPicker"
                  }
                },
                {
                  "key": "fontWeight",
                  "value": {
                    "title": "font weight",
                    "type": "dropdown",
                    "options": [
                      "normal",
                      "bold",
                      "bolder",
                      "light",
                      "lighter",
                      "100",
                      "200",
                      "300",
                      "400",
                      "500",
                      "600",
                      "700",
                      "800",
                      "900",
                      "inherit"
                    ]
                  }
                },
                {
                  "key": "lineHeight",
                  "value": {
                    "title": "line height",
                    "type": "number"
                  }
                },
                {
                  "key": "borderTop",
                  "value": {
                    "title": "border top",
                    "type": "string"
                  }
                },
                {
                  "key": "borderBottom",
                  "value": {
                    "title": "border bottom",
                    "type": "string"
                  }
                },
                {
                  "key": "borderLeft",
                  "value": {
                    "title": "border left",
                    "type": "string"
                  }
                },
                {
                  "key": "borderRight",
                  "value": {
                    "title": "border right",
                    "type": "string"
                  }
                },
                {
                  "key": "borderRadius",
                  "value": {
                    "title": "border radius",
                    "type": "string"
                  }
                },
                {
                  "key": "boxShadow",
                  "value": {
                    "title": "box shadow",
                    "type": "string"
                  }
                },
                {
                  "key": "overflowX",
                  "value": {
                    "title": "overflow X",
                    "type": "dropdown",
                    "options": [
                      "visible",
                      "hidden",
                      "scroll",
                      "auto",
                      "no-display",
                      "no-content"
                    ]
                  }
                },
                {
                  "key": "overflowY",
                  "value": {
                    "title": "overflow Y",
                    "type": "dropdown",
                    "options": [
                      "visible",
                      "hidden",
                      "scroll",
                      "auto",
                      "no-display",
                      "no-content"
                    ]
                  }
                }
              ]
            }
          }
        ]
      }
    },
    {
      "key": "tooltips",
      "value": {
        "title": "Tooltips Props",
        "type": "object",
        "items": [
          {
            "key": "value",
            "value": {
              "title": "value",
              "type": "string"
            }
          },
          {
            "key": "arrow",
            "value": {
              "title": "If show the arrow?",
              "type": "boolean"
            }
          },
          {
            "key": "placement",
            "value": {
              "title": "tooltips placement",
              "type": "dropdown",
              "options": [
                "bottom-end",
                "bottom-start",
                "bottom",
                "left-end",
                "left-start",
                "left",
                "right-end",
                "right-start",
                "right",
                "top-end",
                "top-start",
                "top"
              ]
            }
          }
        ]
      }
    }
  ],
  "muiProps": [
    {
      "key": "color",
      "value": {
        "title": "Color",
        "type": "dropdown",
        "options": [
          "default",
          "error",
          "inherit",
          "primary",
          "secondary",
          "textPrimary",
          "textSecondary"
        ]
      }
    },
    {
      "key": "underline",
      "value": {
        "title": "Underline",
        "type": "dropdown",
        "options": [
          "none",
          "hover",
          "always"
        ]
      }
    }
  ],
  "items": [],
  "displayName": {
    "en": "Text Link",
    "zh-hant": "超链接"
  },
  "displayImage": {
    "bucket": "cms-admin-cicd-component",
    "key": "Link.svg"
  },
  "system": {
    "createdBy": "admin",
    "updatedBy": "admin",
    "createdDate": "2020-03-12T06:51:07.465Z",
    "updatedDate": "2020-03-12T06:51:07.465Z"
  }
}