{
  "id": "applicationsAdd_checkout_summary_standard",
  "cmsComponentType": "BLANK",
  "key": "BLANK_1",
  "style": {
      "width": "100%",
      "height": "100%"
  },
  "cmsProps": {
      "dataUrl": "http://core-api-dp.eab.openshift/core-api/getDoc",
      "params": [
          {
              "name": "",
              "value": "#_id"
          }
      ]
  },
  "items": [
    {
      "cmsComponentType": "GRID_ROW",
      "key": "GRID_ROW_1",
      "style": {},
      "cmsProps": {},
      "muiProps": {
          "direction": "row",
          "justify": "center",
          "alignItems": "center",
          "spacing": 0
      },
      "items": [
          {
              "cmsComponentType": "GRID_COLUMN",
              "key": "GRID_COLUMN_1",
              "style": {},
              "cmsProps": {
                  "align": "left"
              },
              "muiProps": {
                  "xs": 10
              },
              "items": [
                {
                  "cmsComponentType": "GRID_ROW",
                  "key": "GRID_ROW_1",
                  "style": {},
                  "cmsProps": {},
                  "muiProps": {
                      "direction": "row",
                      "justify": "flex-start",
                      "alignItems": "center",
                      "spacing": 0
                  },
                  "items": [
                      {
                          "cmsComponentType": "GRID_COLUMN",
                          "key": "GRID_COLUMN_1",
                          "style": {},
                          "cmsProps": {
                              "align": "left"
                          },
                          "muiProps": {
                              "xs": 12
                          },
                          "items": [
                            {
                              "cmsComponentType": "LABEL",
                              "key": "LABEL_1",
                              "style": {},
                              "cmsProps": {
                                  "value": "Summary"
                              },
                              "muiProps": {
                                  "align": "inherit",
                                  "color": "initial",
                                  "display": "initial",
                                  "noWrap": false
                              }
                          }
                          ]
                      },
                      {
                          "cmsComponentType": "GRID_COLUMN",
                          "key": "GRID_COLUMN_1",
                          "style": {},
                          "cmsProps": {
                              "align": "left"
                          },
                          "muiProps": {
                              "xs": 12
                          },
                          "items": [
                            {
                              "cmsComponentType": "GRID_ROW",
                              "key": "GRID_ROW_1",
                              "style": {},
                              "cmsProps": {},
                              "muiProps": {
                                  "direction": "row",
                                  "justify": "center",
                                  "alignItems": "center",
                                  "spacing": 0
                              },
                              "items": [
                                  {
                                    "cmsComponentType": "GRID_COLUMN",
                                    "key": "GRID_COLUMN_1",
                                    "style": {},
                                    "cmsProps": {
                                        "align": "left"
                                    },
                                    "muiProps": {
                                        "xs": 10
                                    },
                                    "items": [
                                      {
                                        "cmsComponentType": "CARD",
                                        "key": "CARD_1",
                                        "style": {
                                            "marginBottom": "10px"
                                        },
                                        "cmsProps": {},
                                        "muiProps": {
                                            "raised": false
                                        },
                                        "items": [
                                          {
                                            "cmsComponentType": "GRID_ROW",
                                            "key": "GRID_ROW_1",
                                            "style": {},
                                            "cmsProps": {},
                                            "muiProps": {
                                                "direction": "row",
                                                "justify": "flex-start",
                                                "alignItems": "center",
                                                "spacing": 0
                                            },
                                            "items": [
                                                {
                                                  "cmsComponentType": "GRID_COLUMN",
                                                  "key": "GRID_COLUMN_1",
                                                  "style": {},
                                                  "cmsProps": {
                                                      "align": "left"
                                                  },
                                                  "muiProps": {
                                                      "xs": 6
                                                  },
                                                  "items": [
                                                    {
                                                        "cmsComponentType": "LABEL",
                                                        "key": "LABEL_1",
                                                        "style": {},
                                                        "cmsProps": {
                                                            "value": "Submission Number"
                                                        },
                                                        "muiProps": {
                                                            "align": "inherit",
                                                            "color": "initial",
                                                            "display": "initial",
                                                            "noWrap": false
                                                        }
                                                    }
                                                  ]
                                                },
                                                {
                                                  "cmsComponentType": "GRID_COLUMN",
                                                  "key": "GRID_COLUMN_1",
                                                  "style": {},
                                                  "cmsProps": {
                                                      "align": "right"
                                                  },
                                                  "muiProps": {
                                                      "xs": 6
                                                  },
                                                  "items": [
                                                    {
                                                        "cmsComponentType": "TEXT",
                                                        "key": "TEXT_7",
                                                        "style": {},
                                                        "cmsProps": {
                                                            "value": "#EAB.submissionNumber"
                                                        },
                                                        "muiProps": {
                                                            "align": "inherit",
                                                            "color": "initial",
                                                            "display": "initial",
                                                            "noWrap": false
                                                        }
                                                    }
                                                  ]
                                                }
                                              ]
                                          }
                                        ]
                                      },
                                      {
                                        "cmsComponentType": "CARD",
                                        "key": "CARD_1",
                                        "style": {
                                            "marginBottom": "10px"
                                        },
                                        "cmsProps": {},
                                        "muiProps": {
                                            "raised": false
                                        },
                                        "items": [
                                          {
                                            "cmsComponentType": "EXPANSION_PANEL",
                                            "key": "",
                                            "style": {},
                                            "cmsProps":{
                                              "iconName": "ExpandMore",
                                              "leftText": "Application Pack",
                                              "leftTextStyle": {},
                                              "rightText": "", 
                                              "rightTextStyle": {}
                                            },
                                            "muiProps": {
                                              "IconButtonProps": {}
                                            },
                                            "items": [
                                              {
                                                "cmsComponentType": "SEARCH_RESULT",
                                                "key": "SEARCH_RESULT_1",
                                                "style": {},
                                                "cmsProps": {
                                                    "align": "center",
                                                    "xs": 6,
                                                    "dataUrl": "searchResult",
                                                    "actionType": "dialog",
                                                    "actionUrl": "clientSummary_standard",
                                                    "fullScreen": true
                                                },
                                                "items": [
                                                  {
                                                    "cmsComponentType": "GRID_ROW",
                                                    "key": "GRID_ROW_1",
                                                    "style": {},
                                                    "cmsProps": {},
                                                    "muiProps": {
                                                        "direction": "row",
                                                        "justify": "flex-start",
                                                        "alignItems": "center",
                                                        "spacing": 1
                                                    },
                                                    "items": [
                                                      {
                                                          "cmsComponentType": "GRID_COLUMN",
                                                          "key": "GRID_COLUMN_1",
                                                          "style": {},
                                                          "cmsProps": {
                                                              "align": "center"
                                                          },
                                                          "muiProps": {
                                                              "xs": 12
                                                          },
                                                          "items": [
                                                            {
                                                              "cmsComponentType": "LINE_SEPARATOR",
                                                              "key": "LINE_SEPARATOR_1",
                                                              "style": {},
                                                              "cmsProps": {},
                                                              "muiProps": {
                                                                  "orientation": "horizontal"
                                                              }
                                                            }
                                                          ]
                                                      },
                                                        {
                                                            "cmsComponentType": "GRID_COLUMN",
                                                            "key": "GRID_COLUMN_1",
                                                            "style": {},
                                                            "cmsProps": {
                                                                "align": "left"
                                                            },
                                                            "muiProps": {
                                                                "xs": 6
                                                            },
                                                            "items": [
                                                              {
                                                                  "cmsComponentType": "TEXT",
                                                                  "key": "TEXT_7",
                                                                  "style": {},
                                                                  "cmsProps": {
                                                                      "value": "#CAFE.applicationDesc"
                                                                  },
                                                                  "muiProps": {
                                                                      "align": "inherit",
                                                                      "color": "initial",
                                                                      "display": "initial",
                                                                      "noWrap": false
                                                                  }
                                                              }
                                                            ]
                                                        },
                                                        {
                                                            "cmsComponentType": "GRID_COLUMN",
                                                            "key": "GRID_COLUMN_2",
                                                            "style": {},
                                                            "cmsProps": {
                                                                "align": "right"
                                                            },
                                                            "muiProps": {
                                                                "xs": 6
                                                            },
                                                            "items": [
                                                              {
                                                                "cmsComponentType": "ICON_BUTTON",
                                                                "key": "ICON_BUTTON_1",
                                                                "style": {},
                                                                "cmsProps": {
                                                                    "actionType": "",
                                                                    "actionUrl": "closeDialog",
                                                                    "iconName": "Close",
                                                                    "fullScreen": false
                                                                },
                                                                "muiProps": {
                                                                    "color": "default",
                                                                    "size": "medium"
                                                                }
                                                            }
                                                            ]
                                                        }
                                                    ]
                                                }
                                                ]
                                            }
                                            ]
                                          }
                                        ]
                                      },
                                      {
                                        "cmsComponentType": "CARD",
                                        "key": "CARD_1",
                                        "style": {
                                            "marginBottom": "10px"
                                        },
                                        "cmsProps": {},
                                        "muiProps": {
                                            "raised": false
                                        },
                                        "items": [
                                          {
                                            "cmsComponentType": "EXPANSION_PANEL",
                                            "key": "",
                                            "style": {},
                                            "cmsProps":{
                                              "iconName": "ExpandMore",
                                              "leftText": "Uploaded Docs",
                                              "leftTextStyle": {},
                                              "rightText": "", 
                                              "rightTextStyle": {}
                                            },
                                            "muiProps": {
                                              "IconButtonProps": {}
                                            },
                                            "items": [
                                              {
                                                "cmsComponentType": "GRID_ROW",
                                                "key": "GRID_ROW_1",
                                                "style": {},
                                                "cmsProps": {},
                                                "muiProps": {
                                                    "direction": "row",
                                                    "justify": "center",
                                                    "alignItems": "center",
                                                    "spacing": 0
                                                },
                                                "items": [
                                                    {
                                                      "cmsComponentType": "GRID_COLUMN",
                                                      "key": "GRID_COLUMN_1",
                                                      "style": {},
                                                      "cmsProps": {
                                                          "align": "left"
                                                      },
                                                      "muiProps": {
                                                          "xs": 12
                                                      },
                                                      "items": [
                                                        {
                                                          "cmsComponentType": "LABEL",
                                                          "key": "LABEL_1",
                                                          "style": {},
                                                          "cmsProps": {
                                                              "value": "Identitiy Card"
                                                          },
                                                          "muiProps": {
                                                              "align": "inherit",
                                                              "color": "initial",
                                                              "display": "initial",
                                                              "noWrap": false
                                                          }
                                                      },
                                                      {
                                                        "cmsComponentType": "LABEL",
                                                        "key": "LABEL_1",
                                                        "style": {},
                                                        "cmsProps": {
                                                            "value": "Uploaded"
                                                        },
                                                        "muiProps": {
                                                            "align": "inherit",
                                                            "color": "initial",
                                                            "display": "initial",
                                                            "noWrap": false
                                                        }
                                                    },
                                                    {
                                                      "cmsComponentType": "TEXT",
                                                      "key": "TEXT_7",
                                                      "style": {},
                                                      "cmsProps": {
                                                          "value": "#EAB.fileCnt"
                                                      },
                                                      "muiProps": {
                                                          "align": "inherit",
                                                          "color": "initial",
                                                          "display": "initial",
                                                          "noWrap": false
                                                      }
                                                  },
                                                    {
                                                      "cmsComponentType": "LABEL",
                                                      "key": "LABEL_1",
                                                      "style": {},
                                                      "cmsProps": {
                                                          "value": "files"
                                                      },
                                                      "muiProps": {
                                                          "align": "inherit",
                                                          "color": "initial",
                                                          "display": "initial",
                                                          "noWrap": false
                                                      }
                                                  }
                                                      ]
                                                    },
                                                    {
                                                      "cmsComponentType": "GRID_COLUMN",
                                                      "key": "GRID_COLUMN_1",
                                                      "style": {},
                                                      "cmsProps": {
                                                          "align": "left"
                                                      },
                                                      "muiProps": {
                                                          "xs": 12
                                                      },
                                                      "items": [
                                                        {
                                                          "cmsComponentType": "SEARCH_RESULT",
                                                          "key": "SEARCH_RESULT_1",
                                                          "style": {},
                                                          "cmsProps": {
                                                              "align": "center",
                                                              "xs": 6,
                                                              "dataUrl": "searchResult",
                                                              "actionType": "dialog",
                                                              "actionUrl": "clientSummary_standard",
                                                              "fullScreen": true
                                                          },
                                                          "items": [
                                                            {
                                                              "cmsComponentType": "GRID_ROW",
                                                              "key": "GRID_ROW_1",
                                                              "style": {},
                                                              "cmsProps": {},
                                                              "muiProps": {
                                                                  "direction": "row",
                                                                  "justify": "flex-start",
                                                                  "alignItems": "center",
                                                                  "spacing": 1
                                                              },
                                                              "items": [
                                                                {
                                                                    "cmsComponentType": "GRID_COLUMN",
                                                                    "key": "GRID_COLUMN_1",
                                                                    "style": {},
                                                                    "cmsProps": {
                                                                        "align": "center"
                                                                    },
                                                                    "muiProps": {
                                                                        "xs": 12
                                                                    },
                                                                    "items": [
                                                                      {
                                                                        "cmsComponentType": "LINE_SEPARATOR",
                                                                        "key": "LINE_SEPARATOR_1",
                                                                        "style": {},
                                                                        "cmsProps": {},
                                                                        "muiProps": {
                                                                            "orientation": "horizontal"
                                                                        }
                                                                      }
                                                                    ]
                                                                },
                                                                  {
                                                                      "cmsComponentType": "GRID_COLUMN",
                                                                      "key": "GRID_COLUMN_1",
                                                                      "style": {},
                                                                      "cmsProps": {
                                                                          "align": "left"
                                                                      },
                                                                      "muiProps": {
                                                                          "xs": 6
                                                                      },
                                                                      "items": [
                                                                        {
                                                                            "cmsComponentType": "TEXT",
                                                                            "key": "TEXT_7",
                                                                            "style": {},
                                                                            "cmsProps": {
                                                                                "value": "#CAFE.applicationDesc"
                                                                            },
                                                                            "muiProps": {
                                                                                "align": "inherit",
                                                                                "color": "initial",
                                                                                "display": "initial",
                                                                                "noWrap": false
                                                                            }
                                                                        }
                                                                      ]
                                                                  },
                                                                  {
                                                                      "cmsComponentType": "GRID_COLUMN",
                                                                      "key": "GRID_COLUMN_2",
                                                                      "style": {},
                                                                      "cmsProps": {
                                                                          "align": "right"
                                                                      },
                                                                      "muiProps": {
                                                                          "xs": 6
                                                                      },
                                                                      "items": [
                                                                        {
                                                                          "cmsComponentType": "ICON_BUTTON",
                                                                          "key": "ICON_BUTTON_1",
                                                                          "style": {},
                                                                          "cmsProps": {
                                                                              "actionType": "",
                                                                              "actionUrl": "closeDialog",
                                                                              "iconName": "Close",
                                                                              "fullScreen": false
                                                                          },
                                                                          "muiProps": {
                                                                              "color": "default",
                                                                              "size": "medium"
                                                                          }
                                                                      }
                                                                      ]
                                                                  }
                                                              ]
                                                          }
                                                          ]
                                                      }
                                                      ]
                                                    }
                                                  ]
                                                }
                                            ]
                                          }
                                        ]
                                      }
                                    ]
                                  }
                                ]
                              }
                          ]
                      },
                      {
                        "cmsComponentType": "GRID_COLUMN",
                        "key": "GRID_COLUMN_1",
                        "style": {},
                        "cmsProps": {
                            "align": "center"
                        },
                        "muiProps": {
                            "xs": 12
                        },
                        "items": [
                          {
                            "cmsComponentType": "BUTTON",
                            "key": "BUTTON_1",
                            "style": {},
                            "cmsProps": {
                                "actionType": "",
                                "actionUrl": "handleSearch",
                                "displayText": "Confirm",
                                "fullScreen": false
                            },
                            "muiProps": {
                                "color": "default",
                                "size": "medium"
                            }
                        }
                        ]
                    }
                  ]
                }
              ]
          }
      ]
    }
  ]
}