{
    "annualManageFee": "1.5",
    "releaseDate": "2020-01-20 07:16:40",
    "upd": "DANNY.YUEN  on 2020-01-20 15:16:42.0",
    "ref_no": "SADU",
    "launchDate": "2018-01-23 14:28:43.0",
    "assetClass": "equity_asia_pacific_ex_japan",
    "type": "fund",
    "version": 1,
    "isMixedAsset": "N",
    "riskRating": 5,
    "expDate": "2047-06-30 22:59:59",
    "compCode": "08",
    "effDate": "2017-07-01 00:00:00",
    "fundCode": "SADU",
    "ccy": "USD",
    "create": "alex.tang  on 2018-01-23 14:28:43.0",
    "paymentMethod": [
        "cash",
        "srs"
    ],
    "fundName": {
        "zh-Hant": "",
        "en": "Schroder Asian Dividend Maximiser Fund (USD)"
    },
    "status": "A"
}
