{
	"TYPE": "agent",
	"compCode": "AG",
	"agentCode": "211112",
	"role": "02",
	"name": "T8342833F SINGPOST",
	"profileId": "T8342833F",
	"channel": "SINGPOST",
	"createDate": "7/1/2017",
	"lastUpdateDate": "7/14/2017",
	"company": "AXA@Post",
	"tel": "99211112",
	"mobile": "66211112",
	"email": "saakshi.jham@axa.com.sg",
	"position": "Agent",
	"manager": "T8342833F SINGPOST(M)",
	"managerCode": "000001",
	"achievements": "AXA Signature, MDRT",
	"authorised": "M9A, M9, M5, HI, M8"
}