{
    "compCode"  : "08",
    "type"      : "material",
    "section"   : "Product Summary",
    "sectionId" : "prod",
    "name"      : "INSPIRE FlexiProtector PS Feb 2019",
    "id"        : "prod39_1",
    "effDate"   : "2017-05-22 14:10:34",
    "expDate"   : "2019-05-22 14:10:34",
    "releaseDate":"2019-02-19 09:11:59"   
}