{
    "allowBackdate": "N",
    "budgetRules": [
        "RP",
        "SP"
    ],
    "calcAgeMethod": "nearest",
    "compCode": "08",
    "covCode": "WUN",
    "covName": {
        "en": "Premium Waiver (CIUN)",
        "zh-Hant": "Premium Waiver (CIUN)"
    },
    "ctyGroup": [
        "*"
    ],
    "currencies": [
        {
            "ccy": [
                "AUD",
                "GBP",
                "USD",
                "SGD",
                "EUR"
            ],
            "country": "*"
        }
    ],
    "dealerGroup": [
        "AGENCY",
        "DIRECT",
        "SINGPOST",
        "BROKER",
        "FUSION",
        "SYNERGY"
    ],
    "effDate": "2016-08-23 16:00:00",
    "entryAge": [],
    "expDate": "2118-07-26 16:00:00",
    "formulas": {
        "calcQuotFunc": "function(quotation, planInfo, planDetails) { var baseProductCode = quotation.baseProductCode; if (baseProductCode === 'ESP') { planInfo.policyTerm = quotation.plans[0].premTerm + '_YR'; planInfo.premTerm = planInfo.policyTerm; if (quotation.plans[0].premium) { quotCalc.calcPlanPrem(quotation, planInfo, planDetails); } } else { var planDetail = planDetails[planInfo.covCode]; var planInfo = _.find(quotation.plans, p => p.covCode === planDetail.covCode); if (quotation.policyOptions.planType === 'renew' && planDetail.inputConfig && planDetail.inputConfig.policyTermList && planDetail.inputConfig.policyTermList[0]) { planInfo.policyTerm = planDetail.inputConfig.policyTermList[0].value; } planInfo.premTerm = planInfo.policyTerm; if (quotation.plans[0].premium) { quotCalc.calcPlanPrem(quotation, planInfo, planDetails); } }}",
        "getAnnualBenefit": "function (quotation, planInfo, year, extraPara) {var indexation = quotation.policyOptions.indexation === 'Y'; var annualBenefit = math.bignumber(0); _.each(extraPara.illustrations, (ills, covCode) => { var ill = ills[year - 1]; if (ill) { if (covCode === quotation.baseProductCode) { annualBenefit = math.add(annualBenefit, math.bignumber(indexation ? ills[0].yearPrem : ill.yearPrem)); } else if (covCode === 'SV') { annualBenefit = math.add(annualBenefit, math.bignumber(indexation ? ills[0].yearPrem : ill.yearPrem)); } else if (covCode !== planInfo.covCode) { annualBenefit = math.add(annualBenefit, math.bignumber(ill.yearPrem)); } } }); return annualBenefit;}",
        "getCommRates": "function (quotation, planInfo, planDetails) {var rateKey = 'RP_'; var polYrs = planInfo.policyTerm.endsWith('_YR') ? Number.parseInt(planInfo.policyTerm) : Number.parseInt(planInfo.policyTerm) - quotation.iAge; switch (quotation.dealerGroup) { case 'SYNERGY': rateKey += 'AGENCY'; break; case 'FUSION': rateKey += 'BROKER'; break; default: rateKey += quotation.dealerGroup; } var rateTable = planDetails[planInfo.covCode].rates.commRates[rateKey]; var commRates = []; if (rateTable) { var maxTerm = 0; _.each(rateTable, (rates, key) => { var rateTerm = Number(key); if (polYrs >= rateTerm && rateTerm > maxTerm) { commRates = [].concat(rates); maxTerm = rateTerm; } }); } if (commRates[commRates.length - 1]) { for (var i = commRates.length; i < 99; i++) { commRates.push(commRates[i - 1]); } } return commRates;}",
        "getESPPremRate": "function (quotation, planInfo, planDetail, age) { var roundUp = function (value, digit) { var scale = Math.pow(10, digit); if (digit === 0) { return Math.ceil(value); } else { return Math.ceil(number * scale) / scale; } }; var round = function (value, digit) { var scale = math.pow(10, digit); return math.divide(math.round(math.multiply(value, scale)), scale); }; var rateKey; if (planInfo.policyTerm.indexOf('YR') > -1) { rateKey = 'WU';} else { rateKey = 'WUN';}var maturityAge = quotation.pAge + Number.parseInt(planInfo.policyTerm); rateKey += '_' + quotation.pGender; rateKey += quotation.pSmoke === 'Y' ? 'S' : 'NS'; var rates = planDetail.rates.premRate[rateKey]; var netAnnualPremium = 0; var verticalKey; var horizontalKey; horizontalKey = age - 16; verticalKey = Number.parseInt(planInfo.policyTerm); if (planInfo.policyTerm.indexOf('YR') > -1) { netAnnualPremium = rates[verticalKey][horizontalKey];} else { netAnnualPremium = rates[maturityAge][horizontalKey];} return netAnnualPremium;}",
        "getPremRate": "function(quotation, planInfo, planDetail, age) {var roundUp = function (value, digit) { var scale = Math.pow(10, digit); if (digit === 0) { return Math.ceil(value); } else { return Math.ceil(number * scale) / scale; } }; var round = function(value, digit) { var scale = math.pow(10, digit); return math.divide(math.round(math.multiply(value, scale)), scale); }; var rateKey = quotation.policyOptions.planType === 'renew' ? 'FPR' : 'FPNR'; if (planInfo.policyTerm.indexOf('YR') > -1 || quotation.policyOptions.planType === 'renew') { rateKey = 'WU'; } else { rateKey = 'WUN'; } rateKey += '_' + quotation.iGender; rateKey += quotation.iSmoke === 'Y' ? 'S' : 'NS'; var rates = planDetail.rates.premRate[rateKey]; var maturityAge = (planInfo.policyTerm.indexOf('TA') > -1) ? Number.parseInt(planInfo.policyTerm) : quotation.iAge + Number.parseInt(planInfo.policyTerm); var Term_WU = maturityAge - quotation.iAge; var netAnnualPremium = 0; var verticalKey; var horizontalKey; if (planInfo.policyTerm.indexOf('YR') > -1 || quotation.policyOptions.planType === 'renew') { horizontalKey = age - 16; verticalKey = math.multiply(roundUp(math.divide(Term_WU, 5), 0), 5); netAnnualPremium = rates[verticalKey][horizontalKey]; } else { horizontalKey = age - 16; verticalKey = maturityAge; netAnnualPremium = rates[verticalKey][horizontalKey]; } var loadingKey = '1'; var substdClsMapping = planDetail.rates.substdCls[quotation.iResidence]; if (substdClsMapping) { loadingKey = substdClsMapping[quotation.iResidenceCity] || substdClsMapping.ALL || '1'; } var loadingFactor = planDetail.rates.premRate.WU_LOADING_FACTOR[loadingKey] || 1; return round(math.multiply(math.bignumber(netAnnualPremium) || 0, math.bignumber(loadingFactor)), 2);}",
        "illustrateFunc": "function (quotation, planInfo, planDetails, extraPara) { var roundDown = function (value, digit) { var scale = math.pow(10, digit); return math.divide(math.floor(math.multiply(value, scale)), scale); }; if (quotation.baseProductCode === 'ESP') { return []; } else { var planDetail = planDetails[planInfo.covCode]; var planType = quotation.policyOptions.planType; var indexation = quotation.policyOptions.indexation === 'Y'; var polYrs = planInfo.policyTerm.endsWith('_YR') ? Number.parseInt(planInfo.policyTerm) : Number.parseInt(planInfo.policyTerm) - quotation.iAge; var premYrs; if (planInfo.premTerm === 'SP') { premYrs = 1; } else if (planInfo.premTerm.endsWith('_YR')) { premYrs = Number.parseInt(planInfo.premTerm); } else { premYrs = Number.parseInt(planInfo.premTerm) - quotation.iAge; } var sumInsured = planInfo.sumInsured; var illYrs; if (planType === 'renew') { var maxRenewalAge = Math.min(99 - polYrs, 75); illYrs = (Math.floor((maxRenewalAge - quotation.iAge) / polYrs) + 1) * polYrs; } else { illYrs = polYrs; } var bpPolYrs = quotation.plans[0].policyTerm.endsWith('_YR') ? Number.parseInt(quotation.plans[0].policyTerm) : Number.parseInt(quotation.plans[0].policyTerm) - quotation.iAge; var premRateFirstYr = math.bignumber(runFunc(planDetail.formulas.getPremRate, quotation, planInfo, planDetail, quotation.iAge)); var sumProduct = math.bignumber(0); var yearPrems = [0]; for (var i = 1; i <= illYrs; i++) { var age = quotation.iAge + i - 1; var yearPrem; if (i === 1) { yearPrem = math.bignumber(planInfo.yearPrem); } else { yearPrem = math.bignumber(0); if (planType === 'renew') { if ((i - 1) % bpPolYrs < polYrs) { var rateAge = Math.floor((i - 1) / bpPolYrs) * bpPolYrs + quotation.iAge; var premRate = math.bignumber(runFunc(planDetail.formulas.getPremRate, quotation, planInfo, planDetail, rateAge)); var annualBenefit = roundDown(runFunc(planDetail.formulas.getAnnualBenefit, quotation, planInfo, i, extraPara), 1); yearPrem = roundDown(math.divide(roundDown(math.multiply(premRate, annualBenefit), 2), 100), 2); } } else if (i <= polYrs) { var annualBenefit = roundDown(runFunc(planDetail.formulas.getAnnualBenefit, quotation, planInfo, i, extraPara), 1); var premRate = math.bignumber(runFunc(planDetail.formulas.getPremRate, quotation, planInfo, planDetail, age)); var totIndexPrem = math.bignumber(0); if (extraPara.illustrations[quotation.baseProductCode][i - 1]) { totIndexPrem = math.add(totIndexPrem, math.bignumber(extraPara.illustrations[quotation.baseProductCode][i - 1].indexPrem)); } if (extraPara.illustrations.SV && extraPara.illustrations.SV[i - 1]) { totIndexPrem = math.add(totIndexPrem, math.bignumber(extraPara.illustrations.SV[i - 1].indexPrem)); } sumProduct = math.add(sumProduct, math.multiply(premRate, totIndexPrem)); yearPrem = roundDown(math.divide(roundDown(math.multiply(premRateFirstYr, annualBenefit), 2), 100), 2); yearPrem = math.add(yearPrem, math.divide(sumProduct, 100)); } } yearPrems.push(yearPrem); } var commRates = runFunc(planDetail.formulas.getCommRates, quotation, planInfo, planDetails); var totComms = [0]; for (var i = 1; i <= illYrs; i++) { var commRate = commRates[(i - 1) % polYrs]; if (commRate) { totComms[i] = math.multiply(yearPrems[i], commRate); } } var illustration = []; var illLength = Math.max(totComms.length, yearPrems.length) - 1; for (var i = 0; i < illLength; i++) { illustration.push({ yearPrem: yearPrems[i + 1] ? math.number(yearPrems[i + 1]) : 0, totComm: totComms[i + 1] ? math.number(totComms[i + 1]) : 0 }); } return illustration; }}",
        "polTermsFunc": "function (planDetail, quotation) {var policyTermList = []; var longestPayYear = 0; if (quotation && quotation.plans && quotation.plans.length > 0 && quotation.policyOptions.planType === 'renew') { for (var v in quotation.plans) { var premTerm = quotation.plans[v].premTerm; var covCode = quotation.plans[v].covCode; var policyTermValueAndType = (premTerm) ? premTerm.split('_') : []; if (policyTermValueAndType[0] && policyTermValueAndType[1] && policyTermValueAndType[1] === 'YR' && Number.parseInt(premTerm) > longestPayYear && covCode !== 'WUN') { longestPayYear = Number.parseInt(premTerm); } else if (policyTermValueAndType[0] && policyTermValueAndType[1] && policyTermValueAndType[1] === 'TA' && (Number.parseInt(premTerm) - quotation.iAge) > longestPayYear && covCode !== 'WUN') { longestPayYear = Number.parseInt(premTerm) - quotation.iAge; } } var values = [5, 10, 15, 20, 25, 30]; if (longestPayYear >= 30) { policyTermList.push({ value: 30 + '_YR', title: '30 Years', default: true }); } else if (longestPayYear !== 0) { for (var v in values) { var value = values[v]; var testValue = value - longestPayYear; if ( testValue < 5 && testValue >=0 ) { policyTermList.push({ value: value + '_YR', title: value + ' Years', default: true }); } } } } else if (quotation && quotation.plans && quotation.plans.length > 0 && quotation.policyOptions.planType === 'toAge') { var lpVals = {}; var taSelected = false; _.each(quotation.plans, (plan) => { if (plan.covCode !== planDetail.covCode && plan.premTerm) { var premTerm = plan.premTerm; if (premTerm.indexOf('YR') > -1) { lpVals[premTerm] = Number.parseInt(premTerm); } else if (premTerm.indexOf('TA') > -1) { taSelected = true; } } }); _.each(lpVals, (val) => { policyTermList.push({ value: val + '_YR', title: val + ' Years' }); }); if (taSelected) { policyTermList.push({ value: '50_TA', title: 'To Age 50' }); } } return policyTermList.sort((a, b) => a.value > b.value);}",
        "premFunc": "function(quotation, planInfo, planDetail) { var roundDown = function (value, digit) { var scale = math.pow(10, digit); return math.divide(math.floor(math.multiply(value, scale)), scale); }; var roundUp = function (value, digit) { var scale = Math.pow(10, digit); if (digit === 0) { return Math.ceil(value); } else { return Math.ceil(number * scale) / scale; } }; var numberTrunc = function (value = 0, digit) { value = value.toString(); if (value.indexOf('.') === -1) { return math.bignumber(Number.parseInt(value)); } else { value = value.substr(0, value.indexOf('.') + digit + 1); return math.bignumber(Number.parseFloat(value)); } }; var round = function (value, digit) { var scale = math.pow(10, digit); return math.divide(math.round(math.multiply(value, scale)), scale); }; var premium = null; if (quotation.baseProductCode === 'ESP') { premium = math.number(numberTrunc(math.divide(math.multiply(math.bignumber(runFunc(planDetail.formulas.getESPPremRate, quotation, planInfo, planDetail, quotation.pAge)), math.add(math.bignumber(_.get(quotation, 'plans[0].yearPrem', 0)), math.bignumber(_.get(quotation, 'plans[1].yearPrem', 0)))), 100), 2)); var modalFactor = 1; for (var p in planDetail.payModes) { if (planDetail.payModes[p].mode === quotation.paymentMode) { modalFactor = planDetail.payModes[p].factor; } } premium = (modalFactor === 1) ? premium : roundDown(math.multiply(premium, modalFactor), 2); } else if (planInfo.premTerm && planInfo.policyTerm && quotation.plans[0] && quotation.plans[0].premium) { var covCodeArr = ['TPX', 'TPPX', 'DIS', 'CRX', 'DCB', 'CIP', 'AP', 'SV', 'ECIP','MPCR']; var AB_WU = math.bignumber(0); for (var v in quotation.plans) { if (covCodeArr.indexOf(quotation.plans[v].covCode) > -1) { AB_WU = math.add(AB_WU, math.bignumber(quotation.plans[v].yearPrem)); } } var naP = math.bignumber(runFunc(planDetail.formulas.getPremRate, quotation, planInfo, planDetail, quotation.iAge)); premium = math.bignumber(round(roundDown(math.divide(roundDown(math.multiply(naP, roundDown(AB_WU, 1)), 2), 100), 2), 2)); var modalFactor = 1; for (var p in planDetail.payModes) { if (planDetail.payModes[p].mode === quotation.paymentMode) { modalFactor = planDetail.payModes[p].factor; } } premium = (modalFactor === 1) ? premium : roundDown(math.multiply(premium, modalFactor), 2); } else { premium = 0; } return math.number(premium);}",
        "premTermsFunc": "",
        "prepareClassConfig": "",
        "prepareSAPremConfig": "",
        "prepareTermConfig": "function (planDetail, quotation, planDetails) { var baseProductCode = quotation.baseProductCode; if (baseProductCode === 'ESP') { let basicDetail = planDetails[quotation.baseProductCode]; let polTermList = []; let premTermList = basicDetail.inputConfig.premTermList; for (var index = 5; index <= 10; index++) { polTermList.push({ value: index + '_YR', title: index + ' Years', default: true }); polTermList.push({ value: index + '_TA', title: index + ' Years', default: true }); } planDetail.inputConfig.canEditPolicyTerm = false; planDetail.inputConfig.policyTermList = polTermList; planDetail.inputConfig.canEditPremTerm = false; planDetail.inputConfig.premTermList = polTermList; if (basicDetail && basicDetail.policyTerm) { planDetail.policyTerm = basicDetail.policyTerm; } else { planDetail.policyTerm = null; } if (basicDetail && basicDetail.premTerm) { planDetail.premTerm = basicDetail.premTerm; } else { planDetail.premTerm = null; } } else { let polTermList = quotDriver.runFunc(planDetail.formulas.polTermsFunc, planDetail, quotation); if (polTermList && polTermList.length) { for (let p in polTermList) { if (polTermList[p].default) { planDetail.inputConfig.defaultPolicyTerm = polTermList[p].value; break; } } } planDetail.inputConfig.canEditPolicyTerm = quotation.policyOptions.planType === 'toAge'; planDetail.inputConfig.policyTermList = polTermList; let premTermList = [...polTermList]; if (premTermList && premTermList.length) { for (let p in premTermList) { if (premTermList[p].default) { planDetail.inputConfig.premTerm = premTermList[p].value; break; } } } planDetail.inputConfig.canEditPremTerm = false; planDetail.inputConfig.premTermList = premTermList; let planInfo = _.find(quotation.plans, p => p.covCode === planDetail.covCode); if (polTermList.length === 1) { planInfo.policyTerm = polTermList[0].value; } else if (planInfo && !polTermList.find((opt) => opt.value === planInfo.policyTerm)) { planInfo.policyTerm = null; } if (premTermList.length === 1) { planInfo.premTerm = premTermList[0].value; } else if (planInfo && !premTermList.find((opt) => opt.value === planInfo.premTerm)) { planInfo.premTerm = null; } }}",
        "saFunc": "",
        "validAfterCalcFunc": "function(quotation, planInfo, planDetail) { /**WUN validAfterCalcFunc*/ var paddingZeroStr = function (number) { if (number < 10 && number >= 0) { return '0' + number; } else if (number < 0) { return '00'; } else { return number; } }; var defaultArr = ['ESP']; if (defaultArr.indexOf(quotation.baseProductCode) > -1 && quotation && quotation.plans && quotation.plans.length && quotation.plans[0].policyTerm) { if (planInfo.policyTerm) { var planType = quotation.policyOptions.planType; if (planInfo.policyTerm.indexOf('TA') > -1) { planInfo.planCode = 'WU' + paddingZeroStr(Number.parseInt(planInfo.policyTerm) + quotation.iAge); } else { planInfo.planCode = paddingZeroStr(Number.parseInt(planInfo.policyTerm)) + 'WUN'; } } if (!quotation.plans[0].premium) { planInfo.premium = planInfo.yearPrem = planInfo.halfYearPrem = planInfo.quarterPrem = planInfo.monthPrem = quotation.plans[0].premium; } if (planInfo.premium) { planInfo.policyTermYr = Number.parseInt(planInfo.policyTerm); if (planInfo.premTerm === 'SP') { planInfo.premTermYr = 1; } else { planInfo.premTermYr = Number.parseInt(planInfo.premTerm); } } } else if (quotation && quotation.plans && quotation.plans.length && quotation.plans[0].policyTerm) { if (planInfo.policyTerm) { var planType = quotation.policyOptions.planType; var policyTermValue = paddingZeroStr(Number.parseInt(planInfo.policyTerm)); if (quotation.policyOptions.planType === 'renew') { planInfo.planCode = policyTermValue + 'WU'; } else if (planInfo.policyTerm.indexOf('TA') > -1) { planInfo.planCode = 'WU' + policyTermValue; } else { planInfo.planCode = policyTermValue + 'WUN'; } if (planInfo.premium) { planInfo.policyTermYr = planInfo.policyTerm.endsWith('_YR') ? Number.parseInt(planInfo.policyTerm) : Number.parseInt(planInfo.policyTerm) - quotation.iAge; if (planInfo.premTerm === 'SP') { planInfo.premTermYr = 1; } else if (planInfo.premTerm.endsWith('_YR')) { planInfo.premTermYr = Number.parseInt(planInfo.premTerm); } else { planInfo.premTermYr = Number.parseInt(planInfo.premTerm) - quotation.iAge; } } } } var crxSa = 0; var ecipSa = 0; var mpcrSa = 0; for (var p in quotation.plans) { var plan = quotation.plans[p]; if (plan.covCode === 'CRX' && plan.sumInsured) { crxSa = plan.sumInsured; } if (plan.covCode === 'ECIP' && plan.sumInsured) { ecipSa = plan.sumInsured; } if (plan.covCode === 'MPCR' && plan.sumInsured) { mpcrSa = plan.sumInsured; } } if (crxSa + ecipSa === quotation.plans[0].sumInsured) { quotDriver.context.addError({ covCode: planInfo.covCode, msg: 'Premium Waiver (CIUN) is not allowed if the Total Sum Assured of Advance CI Payout and/or Early CI Payout is the same as your Basic Plan\\'s Sum Assured.' }); }}",
        "validBeforeCalcFunc": "",
        "validQuotFunc": "",
        "willValidQuotFunc": ""
    },
    "genderInd": "*",
    "payModes": [
        {
            "covMonth": 12,
            "default": "Y",
            "factor": 1,
            "mode": "A",
            "operator": "M"
        },
        {
            "covMonth": 6,
            "default": "N",
            "factor": 0.51,
            "mode": "S",
            "operator": "M"
        },
        {
            "covMonth": 3,
            "default": "N",
            "factor": 0.26,
            "mode": "Q",
            "operator": "M"
        },
        {
            "covMonth": 1,
            "default": "N",
            "factor": 0.0875,
            "mode": "M",
            "operator": "M"
        },
        {
            "covMonth": 0,
            "default": "",
            "factor": 1,
            "mode": "L",
            "operator": "M"
        }
    ],
    "planInd": "R",
    "polMatSameAsPremMat": "N",
    "polMaturities": [],
    "polTermInd": "Y",
    "polTermRule": "na",
    "policyMatSameAsBasic": "N",
    "premMatSameAsBasic": "N",
    "premMatSameAsPolMat": "N",
    "premMaturities": [],
    "premTermInd": "N",
    "premTermRule": "na",
    "premType": "L",
    "prodFeature": {},
    "prod_summary": 1461760,
    "productCategory": "protectionOnly",
    "productLine": "CIT",
    "rates": {
        "commRates": {
            "RP_AGENCY": {
                "5": [
                    0.8763,
                    0.4497,
                    0.0836,
                    0.0334,
                    0.0334,
                    0,
                    0
                ],
                "6": [
                    0.8763,
                    0.4497,
                    0.0836,
                    0.0334,
                    0.0334,
                    0.0334,
                    0
                ],
                "10": [
                    1.1685,
                    0.6553,
                    0.0836,
                    0.0334,
                    0.0334,
                    0.0334,
                    0
                ],
                "15": [
                    1.3145,
                    0.708,
                    0.0836,
                    0.0334,
                    0.0334,
                    0.0334,
                    0
                ],
                "20": [
                    1.3145,
                    0.708,
                    0.0836,
                    0.0334,
                    0.0334,
                    0.0334,
                    0
                ],
                "25": [
                    1.3145,
                    0.708,
                    0.0836,
                    0.0334,
                    0.0334,
                    0.0334,
                    0
                ]
            },
            "RP_BROKER": {
                "5": [
                    0.823,
                    0.2879,
                    0.0609,
                    0.0332,
                    0.0332,
                    0,
                    0
                ],
                "6": [
                    0.8463,
                    0.2879,
                    0.0609,
                    0.0332,
                    0.0332,
                    0.0332,
                    0
                ],
                "10": [
                    1.0209,
                    0.3322,
                    0.1661,
                    0.0442,
                    0.0442,
                    0.0387,
                    0
                ],
                "15": [
                    1.0559,
                    0.3543,
                    0.1661,
                    0.0553,
                    0.0553,
                    0.0498,
                    0
                ],
                "20": [
                    1.0559,
                    0.3543,
                    0.1661,
                    0.0553,
                    0.0553,
                    0.0498,
                    0
                ],
                "25": [
                    1.0559,
                    0.3543,
                    0.1661,
                    0.0553,
                    0.0553,
                    0.0498,
                    0
                ]
            },
            "RP_DIRECT": {
                "5": [
                    0.231,
                    0.0387,
                    0.0258,
                    0.0129,
                    0.0129,
                    0,
                    0
                ],
                "6": [
                    0.2717,
                    0.0645,
                    0.0258,
                    0.0258,
                    0.0258,
                    0.0258,
                    0
                ],
                "10": [
                    0.326,
                    0.1032,
                    0.0387,
                    0.0258,
                    0.0258,
                    0.0258,
                    0
                ],
                "15": [
                    0.4346,
                    0.1549,
                    0.0645,
                    0.0387,
                    0.0387,
                    0.0387,
                    0
                ],
                "20": [
                    0.4346,
                    0.1549,
                    0.0645,
                    0.0387,
                    0.0387,
                    0.0387,
                    0
                ],
                "25": [
                    0.4346,
                    0.1549,
                    0.0645,
                    0.0387,
                    0.0387,
                    0.0387,
                    0
                ]
            },
            "RP_SINGPOST": {
                "5": [
                    0.4588,
                    0.0447,
                    0.0196,
                    0.0196,
                    0.0196,
                    0,
                    0
                ],
                "6": [
                    0.4588,
                    0.0447,
                    0.0196,
                    0.0196,
                    0.0196,
                    0.0196,
                    0
                ],
                "10": [
                    0.5687,
                    0.1172,
                    0.0324,
                    0.0239,
                    0.0239,
                    0.0239,
                    0
                ],
                "15": [
                    0.7303,
                    0.1513,
                    0.0537,
                    0.0366,
                    0.0366,
                    0.0366,
                    0
                ],
                "20": [
                    0.7303,
                    0.1513,
                    0.0537,
                    0.0366,
                    0.0366,
                    0.0366,
                    0
                ],
                "25": [
                    0.7303,
                    0.1513,
                    0.0537,
                    0.0366,
                    0.0366,
                    0.0366,
                    0
                ]
            }
        },
        "premRate": {
            "WUN_FNS": {
                "50": [
                    1.51,
                    1.56,
                    1.97,
                    2.02,
                    2.08,
                    2.27,
                    2.42,
                    2.56,
                    2.69,
                    2.81,
                    3.01,
                    3.17,
                    3.29,
                    3.37,
                    3.42,
                    3.62,
                    3.77,
                    3.88,
                    3.93,
                    3.96,
                    4.01,
                    4.06,
                    4.11,
                    4.15,
                    4.2,
                    4.28,
                    4.35,
                    4.44,
                    4.51,
                    4.59
                ]
            },
            "WUN_FS": {
                "50": [
                    2.37,
                    2.45,
                    2.88,
                    2.95,
                    3.03,
                    3.29,
                    3.52,
                    3.73,
                    3.92,
                    4.08,
                    4.37,
                    4.61,
                    4.78,
                    4.89,
                    4.95,
                    5.24,
                    5.44,
                    5.58,
                    5.63,
                    5.66,
                    5.72,
                    5.77,
                    5.82,
                    5.86,
                    5.91,
                    5.99,
                    6.06,
                    6.15,
                    6.22,
                    6.3
                ]
            },
            "WUN_MNS": {
                "50": [
                    1.04,
                    1.09,
                    1.5,
                    1.54,
                    1.59,
                    1.74,
                    1.85,
                    1.97,
                    2.07,
                    2.16,
                    2.33,
                    2.47,
                    2.57,
                    2.64,
                    2.68,
                    2.89,
                    3.05,
                    3.17,
                    3.23,
                    3.26,
                    3.43,
                    3.54,
                    3.59,
                    3.63,
                    3.68,
                    3.76,
                    3.83,
                    3.92,
                    3.99,
                    4.07
                ]
            },
            "WUN_MS": {
                "50": [
                    1.64,
                    1.72,
                    2.14,
                    2.2,
                    2.25,
                    2.47,
                    2.64,
                    2.81,
                    2.96,
                    3.08,
                    3.33,
                    3.52,
                    3.67,
                    3.76,
                    3.8,
                    4.11,
                    4.33,
                    4.49,
                    4.57,
                    4.6,
                    4.82,
                    4.96,
                    5.01,
                    5.05,
                    5.1,
                    5.18,
                    5.25,
                    5.34,
                    5.41,
                    5.49
                ]
            },
            "WU_FNS": {
                "5": [
                    0.14,
                    0.18,
                    0.46,
                    0.49,
                    0.54,
                    0.66,
                    0.76,
                    0.86,
                    0.96,
                    1.06,
                    1.15,
                    1.25,
                    1.33,
                    1.43,
                    1.53,
                    1.62,
                    1.72,
                    1.84,
                    1.94,
                    2.05,
                    2.2,
                    2.4,
                    2.58,
                    2.8,
                    3.06,
                    3.37,
                    3.68,
                    4.01,
                    4.37,
                    4.74,
                    4.74,
                    4.78,
                    4.85,
                    4.93,
                    5.04,
                    5.48,
                    6.05,
                    6.69,
                    7.32,
                    8.01,
                    8.7,
                    9.61,
                    10.58,
                    11.58,
                    12.65,
                    18.36,
                    21.16,
                    27.37,
                    35.4,
                    48.79,
                    59.23,
                    76.6,
                    99.08,
                    128.15,
                    165.75,
                    214.39,
                    277.29,
                    358.65,
                    463.89,
                    613.89
                ],
                "10": [
                    0.34,
                    0.38,
                    0.67,
                    0.73,
                    0.8,
                    0.91,
                    1.01,
                    1.11,
                    1.23,
                    1.34,
                    1.44,
                    1.54,
                    1.66,
                    1.76,
                    1.87,
                    2.02,
                    2.22,
                    2.39,
                    2.61,
                    2.86,
                    3.13,
                    3.4,
                    3.7,
                    4.02,
                    4.35,
                    4.75,
                    5.18,
                    5.67,
                    6.14,
                    6.66,
                    6.78,
                    7.03,
                    7.34,
                    7.65,
                    8.01,
                    8.7,
                    9.61,
                    10.58,
                    11.58,
                    12.65,
                    13.72,
                    15.04,
                    16.51,
                    18.04,
                    19.65,
                    26.38,
                    30.25,
                    37.54,
                    46.58,
                    57.8,
                    71.71,
                    88.98,
                    110.41,
                    137,
                    169.99,
                    210.93,
                    261.73,
                    324.75,
                    402.96,
                    501.96
                ],
                "15": [
                    0.58,
                    0.63,
                    0.95,
                    1.03,
                    1.1,
                    1.2,
                    1.31,
                    1.44,
                    1.55,
                    1.67,
                    1.8,
                    1.99,
                    2.19,
                    2.39,
                    2.6,
                    2.88,
                    3.18,
                    3.48,
                    3.8,
                    4.11,
                    4.47,
                    4.89,
                    5.34,
                    5.78,
                    6.27,
                    6.79,
                    7.43,
                    8.16,
                    8.86,
                    9.63,
                    10,
                    10.59,
                    11.23,
                    11.91,
                    12.65,
                    13.72,
                    15.04,
                    16.51,
                    18.04,
                    19.65,
                    21.33,
                    23.1,
                    25.31,
                    27.73,
                    30.17,
                    38.38,
                    43.87,
                    52.9,
                    63.79,
                    76.92,
                    92.75,
                    111.85,
                    134.87,
                    162.63,
                    196.11,
                    236.48,
                    285.16,
                    343.86,
                    414.65,
                    504.65
                ],
                "20": [
                    0.85,
                    0.91,
                    1.29,
                    1.38,
                    1.49,
                    1.6,
                    1.7,
                    1.85,
                    2.01,
                    2.19,
                    2.46,
                    2.73,
                    3.01,
                    3.28,
                    3.55,
                    3.98,
                    4.4,
                    4.83,
                    5.24,
                    5.65,
                    6.27,
                    6.89,
                    7.5,
                    8.11,
                    8.76,
                    9.67,
                    10.6,
                    11.56,
                    12.52,
                    13.55,
                    14.47,
                    15.49,
                    16.51,
                    17.57,
                    18.7,
                    20.59,
                    22.63,
                    24.68,
                    26.87,
                    29.11,
                    31.91,
                    35.05,
                    38.29,
                    41.77,
                    45.35,
                    57.43,
                    65.32,
                    78.39,
                    94.08,
                    112.91,
                    135.51,
                    162.64,
                    195.19,
                    234.26,
                    281.14,
                    337.41,
                    404.94,
                    485.99,
                    583.26,
                    703.26
                ],
                "25": [
                    1.2,
                    1.26,
                    1.66,
                    1.76,
                    1.86,
                    2.07,
                    2.28,
                    2.49,
                    2.71,
                    2.92,
                    3.29,
                    3.66,
                    4.04,
                    4.4,
                    4.78,
                    5.38,
                    5.95,
                    6.55,
                    7.13,
                    7.71,
                    8.56,
                    9.42,
                    10.26,
                    11.1,
                    11.96,
                    13.31,
                    14.65,
                    16.02,
                    17.36,
                    18.71,
                    20.31,
                    21.89,
                    23.46,
                    25.04,
                    26.61,
                    29.62,
                    32.62,
                    35.64,
                    38.64,
                    41.65,
                    46.46,
                    51.27,
                    56.08,
                    60.89,
                    65.7,
                    73.14,
                    79.52,
                    87.48,
                    96.25,
                    105.89,
                    125.96,
                    140.39,
                    156.48,
                    174.41,
                    290.17,
                    355.11,
                    429.48,
                    514.9,
                    603.26,
                    0
                ],
                "30": [
                    1.42,
                    1.5,
                    1.95,
                    2.05,
                    2.16,
                    2.42,
                    2.66,
                    2.91,
                    3.15,
                    3.4,
                    3.84,
                    4.28,
                    4.72,
                    5.15,
                    5.59,
                    6.29,
                    6.97,
                    7.67,
                    8.36,
                    9.03,
                    10.07,
                    11.11,
                    12.13,
                    13.16,
                    14.2,
                    15.74,
                    17.27,
                    18.81,
                    20.34,
                    21.87,
                    23.83,
                    25.79,
                    27.74,
                    29.7,
                    31.65,
                    35.24,
                    38.83,
                    42.43,
                    46.02,
                    49.61,
                    55.38,
                    61.14,
                    66.91,
                    72.67,
                    78.44,
                    91.04,
                    101.49,
                    115.44,
                    131.3,
                    149.35,
                    191.83,
                    222.67,
                    258.46,
                    308.46,
                    0,
                    0,
                    0,
                    0,
                    0,
                    0
                ]
            },
            "WU_FS": {
                "5": [
                    0.21,
                    0.27,
                    0.58,
                    0.63,
                    0.7,
                    0.83,
                    0.97,
                    1.1,
                    1.23,
                    1.36,
                    1.47,
                    1.61,
                    1.72,
                    1.85,
                    1.97,
                    2.1,
                    2.25,
                    2.39,
                    2.55,
                    2.69,
                    2.9,
                    3.17,
                    3.45,
                    3.76,
                    4.13,
                    4.57,
                    5.02,
                    5.48,
                    5.99,
                    6.53,
                    6.75,
                    7.01,
                    7.32,
                    7.65,
                    8.03,
                    8.77,
                    9.71,
                    10.72,
                    11.77,
                    12.87,
                    14,
                    15.4,
                    16.95,
                    18.54,
                    20.24,
                    27.86,
                    33.05,
                    42.23,
                    53.96,
                    71.95,
                    88.1,
                    112.57,
                    143.84,
                    183.8,
                    234.85,
                    300.09,
                    383.45,
                    489.97,
                    626.08,
                    806.08
                ],
                "10": [
                    0.51,
                    0.59,
                    0.91,
                    1,
                    1.1,
                    1.23,
                    1.37,
                    1.5,
                    1.65,
                    1.78,
                    1.92,
                    2.07,
                    2.21,
                    2.37,
                    2.51,
                    2.72,
                    2.99,
                    3.26,
                    3.57,
                    3.93,
                    4.33,
                    4.74,
                    5.17,
                    5.64,
                    6.14,
                    6.76,
                    7.41,
                    8.14,
                    8.86,
                    9.65,
                    10.07,
                    10.69,
                    11.37,
                    12.1,
                    12.87,
                    14,
                    15.4,
                    16.95,
                    18.54,
                    20.24,
                    22,
                    24.06,
                    26.51,
                    29.06,
                    31.76,
                    41.03,
                    47.97,
                    58.96,
                    72.46,
                    89.05,
                    109.44,
                    134.5,
                    165.3,
                    203.15,
                    249.67,
                    306.84,
                    377.1,
                    463.45,
                    569.57,
                    699.57
                ],
                "15": [
                    0.9,
                    0.99,
                    1.34,
                    1.45,
                    1.54,
                    1.68,
                    1.84,
                    1.99,
                    2.16,
                    2.31,
                    2.49,
                    2.77,
                    3.06,
                    3.36,
                    3.66,
                    4.06,
                    4.51,
                    4.95,
                    5.42,
                    5.89,
                    6.47,
                    7.12,
                    7.81,
                    8.5,
                    9.26,
                    10.07,
                    11.09,
                    12.19,
                    13.31,
                    14.49,
                    15.3,
                    16.38,
                    17.6,
                    18.87,
                    20.24,
                    22,
                    24.06,
                    26.51,
                    29.06,
                    31.76,
                    34.55,
                    37.64,
                    41.4,
                    45.51,
                    49.69,
                    62.27,
                    70.7,
                    84.34,
                    100.61,
                    120.01,
                    143.15,
                    170.76,
                    203.69,
                    242.98,
                    289.84,
                    345.74,
                    412.41,
                    491.95,
                    586.83,
                    706.83
                ],
                "20": [
                    1.33,
                    1.44,
                    1.84,
                    1.99,
                    2.13,
                    2.28,
                    2.41,
                    2.62,
                    2.86,
                    3.12,
                    3.52,
                    3.92,
                    4.34,
                    4.75,
                    5.16,
                    5.81,
                    6.44,
                    7.08,
                    7.72,
                    8.34,
                    9.32,
                    10.31,
                    11.29,
                    12.27,
                    13.26,
                    14.72,
                    16.17,
                    17.65,
                    19.12,
                    20.71,
                    22.43,
                    24.29,
                    26.14,
                    28.07,
                    30.12,
                    33.27,
                    36.7,
                    40.11,
                    43.79,
                    47.54,
                    52.4,
                    57.86,
                    63.42,
                    69.48,
                    75.65,
                    92.86,
                    106.73,
                    126.78,
                    150.59,
                    178.87,
                    212.46,
                    252.37,
                    299.76,
                    356.06,
                    422.93,
                    502.36,
                    596.71,
                    708.77,
                    841.89,
                    1001.89
                ],
                "25": [
                    1.88,
                    1.97,
                    2.42,
                    2.54,
                    2.68,
                    2.99,
                    3.3,
                    3.63,
                    3.94,
                    4.26,
                    4.82,
                    5.39,
                    5.95,
                    6.52,
                    7.09,
                    7.98,
                    8.87,
                    9.76,
                    10.65,
                    11.53,
                    12.89,
                    14.26,
                    15.62,
                    16.97,
                    18.33,
                    20.43,
                    22.52,
                    24.62,
                    26.72,
                    28.82,
                    31.69,
                    34.55,
                    37.41,
                    40.27,
                    43.13,
                    48.25,
                    53.36,
                    58.47,
                    63.59,
                    68.7,
                    77.2,
                    85.69,
                    94.19,
                    102.68,
                    111.17,
                    126.66,
                    133.48,
                    146.27,
                    160.27,
                    175.62,
                    211.76,
                    235.76,
                    262.49,
                    292.26,
                    470.09,
                    555.72,
                    643.26,
                    744.59,
                    861.89,
                    0
                ],
                "30": [
                    2.23,
                    2.35,
                    2.85,
                    2.99,
                    3.16,
                    3.54,
                    3.9,
                    4.28,
                    4.66,
                    5.03,
                    5.69,
                    6.36,
                    7.03,
                    7.69,
                    8.36,
                    9.45,
                    10.53,
                    11.62,
                    12.7,
                    13.77,
                    15.34,
                    16.92,
                    18.5,
                    20.07,
                    21.65,
                    24.12,
                    26.56,
                    29.03,
                    31.49,
                    33.95,
                    37.4,
                    40.85,
                    44.29,
                    47.75,
                    51.19,
                    57.27,
                    63.35,
                    69.43,
                    75.51,
                    81.59,
                    91.6,
                    101.62,
                    111.64,
                    121.65,
                    131.68,
                    156.32,
                    167.61,
                    189.1,
                    213.35,
                    240.71,
                    298.75,
                    342.46,
                    392.57,
                    492.57,
                    0,
                    0,
                    0,
                    0,
                    0,
                    0
                ]
            },
            "WU_LOADING_FACTOR": {
                "1": 1,
                "1A": 1.18,
                "1B": 1.36,
                "1C": 1.54,
                "1D": 1.71,
                "1E": 1.89,
                "1F": 2.07,
                "1G": 2.25,
                "1H": 2.43
            },
            "WU_MNS": {
                "5": [
                    0.11,
                    0.13,
                    0.4,
                    0.42,
                    0.46,
                    0.55,
                    0.64,
                    0.72,
                    0.81,
                    0.9,
                    0.97,
                    1.05,
                    1.11,
                    1.19,
                    1.27,
                    1.35,
                    1.43,
                    1.52,
                    1.6,
                    1.7,
                    1.83,
                    1.99,
                    2.13,
                    2.34,
                    2.56,
                    2.81,
                    3.09,
                    3.4,
                    3.79,
                    4.19,
                    4.21,
                    4.25,
                    4.3,
                    4.5,
                    4.75,
                    5.32,
                    5.97,
                    6.63,
                    7.43,
                    8.38,
                    9.39,
                    10.44,
                    11.55,
                    12.77,
                    14.05,
                    20.23,
                    23.66,
                    30.7,
                    39.84,
                    54.7,
                    67.09,
                    87.06,
                    112.97,
                    146.6,
                    190.24,
                    246.86,
                    320.34,
                    415.7,
                    539.43,
                    709.43
                ],
                "10": [
                    0.23,
                    0.26,
                    0.53,
                    0.58,
                    0.64,
                    0.73,
                    0.81,
                    0.89,
                    0.99,
                    1.08,
                    1.17,
                    1.25,
                    1.34,
                    1.42,
                    1.52,
                    1.65,
                    1.81,
                    1.94,
                    2.15,
                    2.36,
                    2.57,
                    2.81,
                    3.09,
                    3.44,
                    3.8,
                    4.22,
                    4.65,
                    5.12,
                    5.71,
                    6.37,
                    6.62,
                    6.95,
                    7.28,
                    7.76,
                    8.38,
                    9.39,
                    10.44,
                    11.55,
                    12.77,
                    14.05,
                    15.49,
                    17.09,
                    18.87,
                    20.65,
                    22.6,
                    29.12,
                    34.99,
                    43.54,
                    54.18,
                    67.42,
                    83.89,
                    104.39,
                    129.9,
                    161.63,
                    201.13,
                    250.27,
                    311.42,
                    387.51,
                    482.19,
                    602.19
                ],
                "15": [
                    0.4,
                    0.43,
                    0.73,
                    0.79,
                    0.84,
                    0.93,
                    1.02,
                    1.12,
                    1.21,
                    1.32,
                    1.44,
                    1.59,
                    1.74,
                    1.91,
                    2.06,
                    2.3,
                    2.57,
                    2.83,
                    3.1,
                    3.37,
                    3.82,
                    4.29,
                    4.75,
                    5.21,
                    5.71,
                    6.49,
                    7.28,
                    8.09,
                    8.88,
                    9.76,
                    10.52,
                    11.36,
                    12.2,
                    13.1,
                    14.05,
                    15.49,
                    17.09,
                    18.87,
                    20.65,
                    22.6,
                    24.54,
                    26.65,
                    29.2,
                    31.93,
                    34.79,
                    45.06,
                    50.86,
                    61.49,
                    74.34,
                    89.88,
                    108.68,
                    131.4,
                    158.86,
                    192.08,
                    232.23,
                    280.78,
                    339.48,
                    410.45,
                    496.25,
                    596.25
                ],
                "20": [
                    0.58,
                    0.62,
                    0.97,
                    1.04,
                    1.14,
                    1.21,
                    1.3,
                    1.44,
                    1.56,
                    1.7,
                    1.92,
                    2.12,
                    2.35,
                    2.56,
                    2.78,
                    3.16,
                    3.55,
                    3.94,
                    4.32,
                    4.7,
                    5.39,
                    6.09,
                    6.78,
                    7.46,
                    8.15,
                    9.34,
                    10.52,
                    11.71,
                    12.88,
                    14.07,
                    15.49,
                    16.9,
                    18.3,
                    19.7,
                    21.11,
                    23.55,
                    25.99,
                    28.42,
                    31,
                    33.67,
                    36.9,
                    40.49,
                    44.38,
                    48.39,
                    52.7,
                    67.18,
                    75.74,
                    90.8,
                    108.85,
                    130.49,
                    156.43,
                    187.53,
                    224.82,
                    269.51,
                    323.09,
                    387.33,
                    464.34,
                    556.65,
                    667.33,
                    797.33
                ],
                "25": [
                    0.81,
                    0.85,
                    1.25,
                    1.33,
                    1.42,
                    1.58,
                    1.74,
                    1.92,
                    2.07,
                    2.24,
                    2.54,
                    2.83,
                    3.14,
                    3.44,
                    3.73,
                    4.28,
                    4.83,
                    5.38,
                    5.93,
                    6.45,
                    7.46,
                    8.45,
                    9.45,
                    10.43,
                    11.44,
                    13.06,
                    14.67,
                    16.32,
                    17.93,
                    19.55,
                    21.72,
                    23.88,
                    26.03,
                    28.19,
                    30.35,
                    33.99,
                    37.63,
                    41.28,
                    44.92,
                    48.56,
                    54.25,
                    59.93,
                    65.63,
                    71.31,
                    77,
                    87.76,
                    93.51,
                    103.05,
                    113.56,
                    125.15,
                    156.01,
                    175.5,
                    197.42,
                    222.07,
                    377.83,
                    468.83,
                    552.51,
                    651.12,
                    767.33,
                    0
                ],
                "30": [
                    0.97,
                    1.03,
                    1.46,
                    1.55,
                    1.65,
                    1.86,
                    2.03,
                    2.23,
                    2.43,
                    2.63,
                    2.98,
                    3.34,
                    3.7,
                    4.06,
                    4.41,
                    5.07,
                    5.72,
                    6.38,
                    7.03,
                    7.67,
                    8.81,
                    9.95,
                    11.09,
                    12.24,
                    13.38,
                    15.32,
                    17.26,
                    19.2,
                    21.14,
                    23.08,
                    25.69,
                    28.3,
                    30.9,
                    33.51,
                    36.11,
                    40.47,
                    44.84,
                    49.2,
                    53.56,
                    57.93,
                    64.82,
                    71.72,
                    78.61,
                    85.5,
                    92.4,
                    112.32,
                    123.43,
                    142.65,
                    164.87,
                    190.55,
                    245.43,
                    288.83,
                    339.9,
                    399.9,
                    0,
                    0,
                    0,
                    0,
                    0,
                    0
                ]
            },
            "WU_MS": {
                "5": [
                    0.15,
                    0.19,
                    0.47,
                    0.5,
                    0.55,
                    0.67,
                    0.78,
                    0.88,
                    0.98,
                    1.09,
                    1.18,
                    1.29,
                    1.37,
                    1.48,
                    1.57,
                    1.67,
                    1.79,
                    1.9,
                    2.01,
                    2.14,
                    2.32,
                    2.53,
                    2.75,
                    3.04,
                    3.35,
                    3.72,
                    4.11,
                    4.54,
                    5.1,
                    5.68,
                    5.9,
                    6.15,
                    6.48,
                    7.02,
                    7.62,
                    8.6,
                    9.65,
                    10.75,
                    12.11,
                    13.66,
                    15.3,
                    17.03,
                    18.84,
                    20.84,
                    22.96,
                    35.92,
                    41.65,
                    56.1,
                    75.57,
                    104.78,
                    113.89,
                    133.61,
                    189.39,
                    246.55,
                    320.96,
                    417.82,
                    470.1,
                    604.59,
                    777.56,
                    999.56
                ],
                "10": [
                    0.35,
                    0.4,
                    0.69,
                    0.75,
                    0.83,
                    0.94,
                    1.05,
                    1.15,
                    1.28,
                    1.38,
                    1.49,
                    1.61,
                    1.72,
                    1.83,
                    1.96,
                    2.14,
                    2.35,
                    2.56,
                    2.85,
                    3.15,
                    3.48,
                    3.83,
                    4.23,
                    4.75,
                    5.29,
                    5.91,
                    6.55,
                    7.3,
                    8.23,
                    9.24,
                    9.9,
                    10.63,
                    11.4,
                    12.44,
                    13.66,
                    15.3,
                    17.03,
                    18.84,
                    20.84,
                    22.96,
                    25.45,
                    28.15,
                    31.15,
                    34.22,
                    37.53,
                    49.02,
                    56.43,
                    69.2,
                    84.86,
                    104.06,
                    150.07,
                    189.07,
                    248.59,
                    314.86,
                    398.8,
                    505.12,
                    600.1,
                    756.03,
                    952.49,
                    1202.49
                ],
                "15": [
                    0.61,
                    0.67,
                    0.99,
                    1.08,
                    1.14,
                    1.25,
                    1.38,
                    1.5,
                    1.62,
                    1.75,
                    1.92,
                    2.13,
                    2.36,
                    2.59,
                    2.82,
                    3.17,
                    3.57,
                    3.96,
                    4.36,
                    4.78,
                    5.44,
                    6.15,
                    6.87,
                    7.57,
                    8.36,
                    9.58,
                    10.87,
                    12.18,
                    13.47,
                    14.84,
                    16.35,
                    17.92,
                    19.49,
                    21.17,
                    22.93,
                    25.4,
                    28.15,
                    31.15,
                    34.22,
                    37.53,
                    40.9,
                    44.75,
                    49.21,
                    54.16,
                    59.17,
                    73.39,
                    83.73,
                    99.61,
                    118.49,
                    140.96,
                    197.21,
                    241.03,
                    319.83,
                    394.93,
                    487.66,
                    602.17,
                    657.3,
                    803.35,
                    981.84,
                    1201.84
                ],
                "20": [
                    0.9,
                    0.98,
                    1.35,
                    1.45,
                    1.57,
                    1.67,
                    1.81,
                    1.98,
                    2.17,
                    2.37,
                    2.68,
                    2.99,
                    3.31,
                    3.63,
                    3.95,
                    4.55,
                    5.13,
                    5.73,
                    6.32,
                    6.89,
                    7.98,
                    9.08,
                    10.17,
                    11.26,
                    12.35,
                    14.25,
                    16.13,
                    18.04,
                    19.93,
                    21.82,
                    24.38,
                    26.94,
                    29.48,
                    32.04,
                    34.59,
                    38.87,
                    43.17,
                    47.45,
                    51.91,
                    56.64,
                    62.61,
                    69.18,
                    76.16,
                    83.55,
                    91.33,
                    112.44,
                    128.75,
                    152.87,
                    181.51,
                    215.51,
                    279.77,
                    337.16,
                    406.32,
                    489.67,
                    590.11,
                    711.15,
                    857.03,
                    1032.83,
                    1244.68,
                    1494.68
                ],
                "25": [
                    1.27,
                    1.34,
                    1.77,
                    1.87,
                    2,
                    2.24,
                    2.48,
                    2.73,
                    2.97,
                    3.21,
                    3.65,
                    4.11,
                    4.56,
                    5.01,
                    5.47,
                    6.33,
                    7.18,
                    8.04,
                    8.88,
                    9.72,
                    11.26,
                    12.81,
                    14.35,
                    15.88,
                    17.42,
                    20.11,
                    22.77,
                    25.46,
                    28.13,
                    30.81,
                    34.7,
                    38.6,
                    42.49,
                    46.38,
                    50.27,
                    56.75,
                    63.24,
                    69.72,
                    76.2,
                    82.69,
                    93.36,
                    104.03,
                    114.7,
                    125.37,
                    136.05,
                    152.31,
                    165,
                    181.71,
                    200.11,
                    220.37,
                    256.98,
                    285.71,
                    317.66,
                    353.17,
                    630.14,
                    798.9,
                    938.39,
                    1102.23,
                    1294.68,
                    0
                ],
                "30": [
                    1.52,
                    1.62,
                    2.08,
                    2.21,
                    2.34,
                    2.64,
                    2.93,
                    3.23,
                    3.52,
                    3.81,
                    4.37,
                    4.91,
                    5.46,
                    6.01,
                    6.56,
                    7.56,
                    8.55,
                    9.55,
                    10.55,
                    11.53,
                    13.37,
                    15.19,
                    17.03,
                    18.85,
                    20.69,
                    23.84,
                    26.98,
                    30.15,
                    33.29,
                    36.44,
                    41.08,
                    45.72,
                    50.36,
                    54.99,
                    59.63,
                    67.31,
                    74.98,
                    82.66,
                    90.33,
                    98.01,
                    110.62,
                    123.24,
                    135.85,
                    148.47,
                    161.08,
                    187.11,
                    202.39,
                    226.86,
                    254.3,
                    285.05,
                    365.25,
                    418.65,
                    479.85,
                    549.85,
                    0,
                    0,
                    0,
                    0,
                    0,
                    0
                ]
            }
        },
        "substdCls": {
            "R134": {
                "ALL": "1B"
            },
            "R51": {
                "ALL": 1
            },
            "R52": {
                "ALL": "1B"
            },
            "R53": {
                "T110": 1
            },
            "R54": {
                "ALL": "1B",
                "T120": "1B"
            }
        }
    },
    "releaseDate": "2019-11-11 07:19:01",
    "remarks": {
        "en": "Premium Waiver (CIUN)",
        "zh-Hant": "Premium Waiver (CIUN)"
    },
    "saInput": [
        {
            "ccy": "AUD",
            "decimal": 2,
            "factor": 0
        },
        {
            "ccy": "GBP",
            "decimal": 2,
            "factor": 0
        },
        {
            "ccy": "USD",
            "decimal": 2,
            "factor": 0
        },
        {
            "ccy": "SGD",
            "decimal": 2,
            "factor": 0
        },
        {
            "ccy": "EUR",
            "decimal": 2,
            "factor": 0
        }
    ],
    "saInputInd": "N",
    "saPostfix": {},
    "saRule": "na",
    "saScale": "",
    "saViewInd": "N",
    "smokeInd": "*",
    "status": "A",
    "type": "product",
    "version": 6,
    "wholeLifeInd": "N"
}