{
    "apiVersion": "v1",
    "kind": "Service",
    "metadata": {
        "annotations": {
            "openshift.io/generated-by": "OpenShiftWebConsole"
        },
        "creationTimestamp": "2017-07-25T13:44:13Z",
        "labels": {
            "app": "ease-api"
        },
        "name": "ease-api",
        "namespace": "axasgsit",
        "resourceVersion": "3452027",
        "selfLink": "/api/v1/namespaces/axasgsit/services/ease-api",
        "uid": "586f8258-713f-11e7-bc05-00155dde16b4"
    },
    "spec": {
        "clusterIP": "172.30.168.150",
        "ports": [
            {
                "name": "8080-tcp",
                "port": 8080,
                "protocol": "TCP",
                "targetPort": 8080
            },
            {
                "name": "8443-tcp",
                "port": 8443,
                "protocol": "TCP",
                "targetPort": 8443
            },
            {
                "name": "8778-tcp",
                "port": 8778,
                "protocol": "TCP",
                "targetPort": 8778
            }
        ],
        "selector": {
            "deploymentconfig": "ease-api"
        },
        "sessionAffinity": "None",
        "type": "ClusterIP"
    },
    "status": {
        "loadBalancer": {}
    }
}
