{
  "total_rows": 1,
  "rows": [{
    "id": "102-2182297",
    "key": [
      "finalStage",
      1505909344709,
      "1505908029738"
    ],
    "value": {
      "_id": "102-2182297",
      "_rev": "3-5a01aeb057e164c863338d8985cc1f8b",
      "accept": {
        "approvalCaseHasIndividual": false,
        "approvalCaseHasIsCrossBorder": false,
        "approveComment": "",
        "jointFieldWorkCase": "N"
      },
      "agentCode": "087195",
      "agentEmail": "suyii.tang@axaplanner.com.sg",
      "agentId": "087195",
      "agentMobile": "+6592319148",
      "agentName": "TANG SU YII",
      "agentProfileId": "S9078469B",
      "applicationId": "NB001472-00079",
      "approvalCaseHasIndividual": false,
      "approvalCaseId": "102-2182297",
      "approvalStatus": "A",
      "approveRejectDate": "2019-07-24T04:10:59.706Z",
      "approveRejectManagerEmail": "sean.ptc@axaplanner.com.sg",
      "approveRejectManagerId": "083194",
      "approveRejectManagerMobile": "+6591686687",
      "approveRejectManagerName": "PENG TENGCONG",
      "comment": [],
      "compCode": "01",
      "customerICNo": "S8778451G",
      "customerICType": "nric",
      "customerId": "CP001472-00002",
      "customerName": "Ting Ying Chang",
      "dealerGroup": "AGENCY",
      "directorEmail": "isaac.teo@axaplanner.com.sg",
      "directorId": "080598",
      "directorMobile": "+6591097533",
      "directorName": "ISAAC TEO WHEE HWA",
      "isFACase": false,
      "isProxyApproved": false,
      "isShield": false,
      "jfwFileName": [],
      "lastEditedBy": "083194",
      "lastEditedDate": "2019-07-24T04:10:59.706Z",
      "lifeAssuredName": "Ting Ying Chang",
      "lstChgDate": 1563941459728,
      "managerEmail": "sean.ptc@axaplanner.com.sg",
      "managerId": "083194",
      "managerMobile": "+6591686687",
      "managerName": "PENG TENGCONG",
      "multiLangProductName": {
        "en": "AXA Life Treasure",
        "zh-Hant": "LMP"
      },
      "onHoldReason": "",
      "organizationName": "ISAAC TEO WHEE HWA",
      "orginalManagerId": "083194",
      "policyId": "102-2182297",
      "productName": "AXA Life Treasure",
      "proposalNumber": "102-2182297",
      "proposerName": "Ting Ying Chang",
      "quotationId": "QU001472-00202",
      "readOnly": false,
      "submisssionFlag": true,
      "submittedDate": "2019-07-23T16:24:21.399Z",
      "type": "approval"
    }

  }],
  "Collator": {}
}
