{
  "fromTime": "2020-01-08 00:00:00",
  "toTime": "2020-01-08 23:59:59",
  "scheduleCron": "0 22 * 1-12 *",
  "jobDetailsDocId":"GeneralInvalidationJob",
  "impactedListDocId":"InvalidationImpactedList",
  "messages":[
    {
      "combinationId": "invalidateProductsAndFundsCombine",
      "messageId": "invalidateMessage_Release22CR244",
      "message": "The following funds are now closed. Any existing cases that are not fully signed are no longer valid.<br/><br/>• Franklin Select U.S. Equity Fund (USD)<br/>• Fullerton Dynamic Strategies Fund - Balanced (SGD)<br/>• Goldman Sachs Global Strat Income Bond (SGD Hedged)<br/>• Legg Mason Martin Currie Southeast Asia Trust (SGD)",
      "messageGroup": "invalidateMsg",
      "messageGroupPriority": "1"
    }
  ],
  "jobs":[
    {
      "id": "inflightJobRelease22CR244",
      "ruleIds":["invalidateProducts","invalidateFunds"],
      "rulesParamsMapping":{
        "invalidateProducts":{
          "functId": "invalidateProductsRule",
          "productCodes":["PUL","AWTR","AWICA"],
          "partiallySignedOnly": true
        },
        "invalidateFunds":{
          "functId": "invalidateProductsByFundRule",
          "fundCodes":["LSEA", "GSIB","FUSD","FDSB"],
          "partiallySignedOnly": true
        }
      },
      "rulesCombinations":[
        {
          "combinationId": "invalidateProductsAndFundsCombine",
          "ruleIdsLookUp":["invalidateProducts","invalidateFunds"],
          "lookUpFormula": "#1 && #2",
          "expirePolicy": false
        }
      ]
    }
  ]
}

