{
  "keys": ["productName", "proposalNumber", "proposerName", "supervisorName", "approvalDate", "adviserName", "approvalRemarksText", "agentName"],
  "email": {
    "subject": "New proposalNumber, productName by agentName for FA Firm approval",
    "template": "Dear adviserName,<br /><br />The case proposalNumber for proposerName has been approved by supervisorName on approvalDate and submitted to your FA firm for approval. <br /><br /><b>Approval Remarks: </b><br/>approvalRemarksText<br /><br />AXA Insurance Pte Ltd<p><img src='cid:part1.1234.56789' height='70' width='75'></p>"
  }
}
