{
    "type": "layout",
  	"formId":"approvePageTemplate",
    "items": [
        {
            "type": "CARDCONTAINER",
            "items": [
                {
                    "type": "TEXTAREA",
                    "id": "approveComment",
                    "maxLength": 5000,
                    "placeholder": "Please provide your comment"
                }
            ]
        },
        {
            "type": "CARDCONTAINER",
            "items": [
                {
                    "type": "HBOX",
                    "items": [
                        {
                            "type": "BLOCK",
                            "title": "Selected Client",
                            "tips":{
                                "title":"It is recommended to check with the client on following areas:<br/><ol><li>Does the client understand the representative’s explanation & recommendations on why this policy is suitable?</li><li>Is client aware of Free Look Period?</li><li>Is the client aware of the risk/Limitation involved on the policy purchased?</li><li>Any other questions related to the policy taken up by the client.</li><li>Are you aware that you can be accompanied by a trusted individual when the Representative explains the policy to you? (if there is no Trusted Individual involved)</li></ol>",
                                "icon":"help"
                                },
                            "items": [
                                {
                                    "id": "checkedWithClient",
                                    "type": "checkbox",
                                    "title": "I have checked with the selected client on his/her understanding of the plans recommended by the Financial Consultant.",
                                    "mandatory": true
                                },
                                {
                                    "type": "HBOX",
                                    "items": [
                                        {
                                            "id": "callDate",
                                            "title": {
                                                "en": "Call Date"
                                            },
                                            "type": "datePicker",
                                            "subType": "date",
                                            "min": 100,
                                            "max": 0,
                                            "condition": "existing"
                                        },
                                        {
                                            "id": "contactPerson",
                                            "type": "text",
                                            "max": 50,
                                            "placeholder": {
                                                "en": "Please Specify:"
                                            },
                                            "title": {
                                                "en": "Name of the person contacted"
                                            }
                                        },
                                        {
                                            "type": "HBOX",
                                            "title": {
                                                "en": "Mobile No."
                                            },
                                            "shadow": true,
                                            "key": "mobileNoSection",
                                            "items": [
                                                {
                                                    "id": "mobileCountryCode",
                                                    "type": "picker",
                                                    "subType": "limit",
                                                    "placeholder": {
                                                        "en": "Country code of Mobile"
                                                    },
                                                    "value": "+65",
                                                    "options": "countryTelCode"
                                                },
                                                {
                                                    "id": "mobileNo",
                                                    "placeholder": {
                                                        "en": "Mobile No."
                                                    },
                                                    "type": "text",
                                                    "subType": "number"
                                                }
                                            ]
                                        }
                                    ],
                                    "trigger": {
                                        "id": "checkedWithClient",
                                        "type": "showIfEqual",
                                        "value": "Y"
                                    }
                                },
                                {
                                    "type": "TEXTAREA",
                                    "id": "otherComment",
                                    "maxLength": 1000,
                                    "placeholder": "Any other comments",
                                     "trigger": {
                                        "id": "checkedWithClient",
                                        "type": "showIfEqual",
                                        "value": "Y"
                                    }
                                }
                            ]
                        }
                    ]
                }
            ],
            "trigger":  {
                            "id": "approvalCaseHasIndividual",
                            "type": "showIfEqualBoolean",
                            "value": true
                        }
        },
        {
            "type": "CARDCONTAINER",
            "items": [
                {
                    "type": "BLOCK",
                    "title": "Joint Field Work (JFW)",
                    "items": [
                        {
                            "id": "jointFieldWorkCase",
                            "type": "QRADIOGROUP",
                            "title": "Is this a Joint Field Work (JFW) case ?",
                            "horizontal": true,
                            "options": [
                                {
                                    "value": "Y",
                                    "title": "Yes"
                                },
                                {
                                    "value": "N",
                                    "title": "No"
                                }
                            ],
                            "mandatory": true
                        },
                        {
                            "type": "textOnly",
                            "subType": "titleOnly",
                            "id": "cbQuestion",
                            "title": "Please select the purpose of Joint Field Work",
                            "trigger": {
                                "id": "jointFieldWorkCase",
                                "type": "showIfEqual",
                                "value": "Y"
                            }
                        },
                        {
                            "id": "jointFieldWorkCBGroup",
                            "type": "checkboxGroup",
                            "mode": "P",
                            "mandatory": true,
                            "options": [
                                {
                                    "title": "New Rep requirement",
                                    "value": "New Rep requirement"
                                },
                                {
                                    "title": "BSC Grade E rep",
                                    "value": "BSC Grade E rep"
                                },
                                {
                                    "title": "Close Supervision",
                                    "value": "Close Supervision"
                                },
                                {
                                    "title": "Other Development Needs",
                                    "value": "Other Development Needs"
                                }
                            ],
                            "trigger": {
                                "id": "jointFieldWorkCase",
                                "type": "showIfEqual",
                                "value": "Y"
                            }
                        },
                        {
                            "id": "jfwFile",
                            "type": "FILEUPLOAD",
                            "title": "Please upload the JFW manual form",
                            "subTitle": "system accept pdf, png and jpeg, Total maximum file size is 5 MB.",
                            "subTitleStyle": {
                                "lineHeight": "3em"
                            },
                            "maxSize": 5,
                            "trigger": {
                                "id": "jointFieldWorkCase",
                                "type": "showIfEqual",
                                "value": "Y"
                            },
                            "mandatory": true
                        }
                    ]
                }
            ]
        },
        {
          "type": "CARDCONTAINER",
          "items": [
              {
                  "type": "BLOCK",
                  "title": "Certificate of Endorsement (COE)",
                  "items": [
                      {
                          "type": "textOnly",
                          "subType": "titleOnly",
                          "id": "coeQuestion",
                          "title": "This is a cross-border case and hence requires a Certificate of Endorsement to be uploaded."
                      },
                      {
                          "id": "coeFile",
                          "type": "FILEUPLOAD",
                          "title": "Please Upload a COE signed by FSM and FSD to proceed",
                          "subTitle": "system accept pdf, png and jpeg, Total maximum file size is 5 MB.",
                          "subTitleStyle": {
                              "lineHeight": "3em"
                          },
                          "maxSize": 5,
                          "mandatory": true
                      },
                      {
                        "type": "PARAGRAPH",
                        "id": "coeWarning",
                        "paragraphType": "warningWithNote",
                        "align": "left",
                        "content": "<p>This field is required</p>",
                        "detailSeq": 1,
                        "trigger": {
                          "id": "coeFile",
                          "type": "showIfNoFile"
                        }
                      }
                  ]
              }
          ],
          "trigger": {
            "id": "approvalCaseHasIsCrossBorder",
            "type": "showIfEqualBoolean",
            "value":true
          }
        }
    ]
}
