{
    "annualManageFee": "1.25",
    "releaseDate": "2019-05-08 07:16:40",
    "upd": "DANNY.YUEN  on 2019-05-08 06:01:31.0",
    "ref_no": "JGIS",
    "launchDate": "2018-01-23 14:28:42.0",
    "assetClass": "mixed_assets_global",
    "type": "fund",
    "version": 1,
    "isMixedAsset": "Y",
    "riskRating": 3,
    "expDate": "2047-06-30 23:59:59",
    "compCode": "08",
    "effDate": "2017-07-01 00:00:00",
    "fundCode": "JGIS",
    "ccy": "SGD Hedged",
    "create": "alex.tang  on 2018-01-23 14:28:42.0",
    "paymentMethod": [
        "cash",
        "srs"
    ],
    "fundName": {
        "zh-Hant": "",
        "en": "JPM Global Income Fund (SGD Hedged)"
    },
    "status": "A"
}