{
    "compCode"  : "08",
    "type"      : "material",
    "section"   : "Product Summary",
    "sectionId" : "prod",
    "name"      : "AXA Flexi Protector PS Apr 2020",
    "id"        : "prod79_1",
    "effDate"   : "2020-03-27 00:00:00",
    "expDate"   : "2118-05-22 14:19:47"  
}
