
{
    "compCode"  : "08",
    "type"      : "material",
    "section"   : "General Provision",
    "sectionId" : "gprov",
    "name"      : "Living Term Benefit CID SP Nov 2017",
    "id"        : "genprov62_1",
    "effDate"   : "2017-05-22 14:10:34",
    "expDate"   : "2020-02-22 14:19:47"  
}