{
  "items": [
    {
      "productCode": ["SAV", "BAA", "TPX", "TPPX", "LMP", "ESP", "RHP","RHP2","HIM","HER", "LITE", "NPE", "ESC", "ART2","MPC","CSP"],
      "attKeys": [
        {
          "id": "bi"
        },
        {
          "id": "prodSummary",
          "title": "Product Summary of the accepted plan(s)"
        }
      ]
    },
    {
      "productCode": ["IND", "AWT", "PUL", "AWTR", "AWICP", "AWICA","FX2"],
      "attKeys": [
        {
          "id": "bi"
        },
        {
          "id": "prodSummary",
          "title": "Product Summary of the accepted plan(s)"
        },
        {
          "id": "phs",
          "title": "Product Highlight Sheet"
        },
        {
          "id": "fib",
          "title": "Fund Information Booklet"
        }
      ]
    },
    {
      "productCode": ["FPX", "FSX"],
      "attKeys": [
        {
          "id": "bi"
        },
        {
          "id": "FPXProdSummary",
          "title": "Product Summary of the accepted plan(s)"
        },
        {
          "id": "phs",
          "title": "Product Highlight Sheet"
        },
        {
          "id": "fib",
          "title": "Fund Information Booklet"
        }
      ]
    },
    {
      "productCode": ["ASIM"],
      "attKeys": [
        {
          "id": "shield_product_summary",
          "title": "Product Summary of the accepted plan(s)"
        }
      ]
    }
  ]
}
