{
    "allowBackdate": "N",
    "benlim": [],
    "budgetRules": [
        "RP"
    ],
    "compCode": "08",
    "covCode": "LTT",
    "covName": {
        "en": "Level Term Benefit",
        "zh-Hant": " "
    },
    "ctyGroup": [
        "*"
    ],
    "currencies": [
        {
            "ccy": [
                "SGD"
            ],
            "country": "*"
        }
    ],
    "dealerGroup": [
        "AGENCY",
        "DIRECT",
        "BROKER",
        "SINGPOST",
        "FUSION",
        "SYNERGY"
    ],
    "effDate": "2017-12-15 16:00:00",
    "entryAge": [
        {
            "country": "*",
            "imaxAge": 60,
            "imaxAgeUnit": "nearestAge",
            "iminAge": 1,
            "iminAgeUnit": "month",
            "omaxAge": 70,
            "omaxAgeUnit": "nearestAge",
            "ominAge": 18,
            "ominAgeUnit": "year",
            "sameAsOwner": "N"
        }
    ],
    "expDate": "2118-07-26 16:00:00",
    "formulas": {
        "calcQuotFunc": "function (quotation, planInfo, planDetails) {}",
        "illustrateFunc": "",
        "polTermsFunc": "function (planDetail, quotation) {return [{ value: \"yrs\" + (85 - quotation.iAge), title: (85 - quotation.iAge)+\" Years\", default: true}];}",
        "premFunc": "",
        "premTermsFunc": "function (planDetail, quotation) {return [{ value: \"yrs\" + (85 - quotation.iAge), title: (85 - quotation.iAge)+\" Years\"}];}",
        "prepareClassConfig": "",
        "prepareSAPremConfig": "function (planDetail, quotation, planDetails) {quotDriver.prepareAmountConfig(planDetail, quotation, planDetails);planDetail.inputConfig.canEditSumAssured = true; planDetail.inputConfig.canViewSumAssured = true; planDetail.inputConfig.canViewPremium = false; var basicSaMax = _.get(quotation, 'plans[0].sumInsured', 9) * 10;planDetail.inputConfig.benlim = { min: 10000, max: basicSaMax > 10000 ? math.min(basicSaMax, 2000000) : 2000000};planDetail.inputConfig.saInput = { factor: 100};return planDetail;}",
        "prepareTermConfig": "",
        "saFunc": "",
        "validAfterCalcFunc": "function (quotation, planInfo, planDetail) {quotValid.validatePlanAfterCalc(quotation, planInfo, planDetail);planInfo.planCode = 'LTTT';planInfo.premTerm = planInfo.policyTerm;planInfo.premTermDesc = planInfo.polTermDesc;if(planInfo.policyTerm){ planInfo.policyTermYr = math.number(planInfo.policyTerm.substring(3, planInfo.policyTerm.length)); planInfo.premTermYr = math.number(planInfo.policyTermYr);}}",
        "validBeforeCalcFunc": "",
        "validQuotFunc": "",
        "willValidQuotFunc": ""
    },
    "genderInd": "*",
    "isMasterData": true,
    "lastUpdatedTime": "2018-09-03T09:09:00.187Z",
    "payModes": [
        {
            "covMonth": 1,
            "default": "",
            "factor": 12,
            "mode": "M",
            "operator": "D"
        },
        {
            "covMonth": 3,
            "default": "",
            "factor": 4,
            "mode": "Q",
            "operator": "D"
        },
        {
            "covMonth": 6,
            "default": "",
            "factor": 2,
            "mode": "S",
            "operator": "D"
        },
        {
            "covMonth": 12,
            "default": "",
            "factor": 1,
            "mode": "A",
            "operator": "D"
        }
    ],
    "planCodeMapping": {
        "planCode": [
            "LTTT"
        ],
        "tpd": [
            "Y"
        ]
    },
    "planInd": "R",
    "polMatSameAsPremMat": "N",
    "polMaturities": [],
    "polTermInd": "Y",
    "polTermRule": "na",
    "policyMatSameAsBasic": "N",
    "premMatSameAsBasic": "N",
    "premMatSameAsPolMat": "Y",
    "premTermInd": "N",
    "premTermRule": "na",
    "prodFeature": {},
    "prod_summary_1": 1181248,
    "productCategory": "ilp",
    "productLine": "WLE",
    "releaseDate": "2018-07-30 02:05:38",
    "remarks": {
        "en": "--"
    },
    "saInput": [
        {
            "ccy": "SGD",
            "decimal": 0,
            "factor": 0
        }
    ],
    "saInputInd": "Y",
    "saPostfix": {},
    "saRule": "na",
    "saScale": "",
    "saViewInd": "Y",
    "smokeInd": "*",
    "status": "A",
    "type": "product",
    "updatedBy": "mandy",
    "version": 2,
    "wholeLifeInd": "N"
}