{
    "compCode"  : "08",
    "type"      : "material",
    "section"   : "Product Summary",
    "sectionId" : "prod",
    "name"      : "Level Term Benefit PS Nov 2017",
    "id"        : "prod42_1",
    "effDate"   : "2017-05-22 14:10:34",
    "expDate"   : "2020-02-22 14:10:34"  
}