{
	"prod__startTime": "2018-07-01T16:00:00.000Z",
	"prod__endTime": "2018-10-04T15:59:59.999Z",
	"startTime": "2018-07-17T16:00:00.000Z",
	"endTime": "2018-10-07T12:59:59.999Z",
	"campaignCode": "LMP2018",
	"campaignId": "campaign_LMP2018_1",
	"impactedPlan": {
		"CIBX_LMP": [
			{
            	"discount": 0.15
			}
		],
		"ECIX_LMP": [
			{
            	"discount": 0.15
			}
		]
	},
	"type": "campaign"
}