
{
    "compCode"  : "08",
    "type"      : "material",
    "section"   : "INSPIRE Fund Range",
    "sectionId" : "indf",
    "name"      : "AXA South East Asia Special Situations (SGD)",
    "id"        : "ind22_1",
    "effDate"   : "2017-05-22 14:10:34",
    "expDate"   : "2118-05-22 14:19:47",
    "releaseDate":"2019-01-03 09:11:59"   
}