{
    "compCode": "08",
    "type": "material",
    "section": "Product Summary",
    "sectionId": "prod",
    "name": "AXA Basic Care Standard Plan PS August 2018",
    "id": "prod07_1",
    "effDate": "2017-05-22 14:10:34",
    "expDate": "2019-03-19 00:00:00"
}