{
	"type": "layout",
	"formId":"menu_plan",
	"skipCheck":true,
	"items": [
    {
      "title": "Proposer",
      "subType": "proposer",
      "priority":"proposer",
      "type": "tab",
      "items": [
        {
          "type": "BLOCK",
          "id":"groupedPlanDetails",
          "title": "",
          "items": [
            {
              "type": "CARDCONTAINER",
              "noPadding": true,
              "items":[
                {
                  "type": "tablesectionheading",
                  "id": "tableBasicPlanSection",
                  "title": "Basic Plan"
                },
                {
                  "type": "table",
                  "fullWidth": true,
                  "id": "basicPlanList",
                  "allowEdit": false,
                  "planDetailLayout": true,
                  "noBottomBorder": true,
                  "setWidth" : true,
                  "items": [
                    {
                      "type": "HBOX",
                      "title": "Plan Name",
                      "planDetailLayout": true,
                      "disableTdStyle": true,
                      "width": "21%",
                      "presentation": "planCover@covName",
                      "items": [
                        {
                          "type": "image",
                          "id": "planCover"
                        },
                        {
                          "type": "TEXT",
                          "id": "covName"
                        }
                      ]
                    },
                    {
                      "type": "TEXT",
                      "id": "planType",
                      "planDetailLayout": true,
                      "title": "Policy Type",
                      "inputWidth": "20%"
                    },
                    {
                      "type": "TEXT",
                      "id": "paymentMethodDesc",
                      "planDetailLayout": true,
                      "title": "Payment Method",
                      "inputWidth": "20%"
                    },
                    {
                      "type": "TEXT",
                      "id": "payFreqDesc",
                      "planDetailLayout": true,
                      "title": "Payment Mode",
                      "inputWidth": "20%"
                    },
                    {
                      "type": "TEXT",
                      "id": "premium",
                      "subType": "currency",
                      "decimal": 2,
                      "planDetailLayout": true,
                      "title": "Premium",
                      "subPostfix": "(incl. Medishield Life)",
                      "width": "19%"
                    }
                  ]
                },
                {
                  "type": "tablesectionheading",
                  "id": "tableRiderSection",
                  "title": "Rider",
                  "trigger":{
                    "id":"totalRiderPremium",
                    "type":"showIfNotEqual",
                    "value":"0"
                  }
                },
                {
                  "type": "table",
                  "fullWidth": true,
                  "id": "riderPlanList",
                  "allowEdit": false,
                  "planDetailLayout": true,
                  "noBottomBorder": true,
                  "setWidth" : true,
                  "items": [
                    {
                      "type": "HBOX",
                      "title": "Plan Name",
                      "planDetailLayout": true,
                      "disableTdStyle": true,
                      "presentation": "planCover@covName",
                      "inputWidth": "21%",
                      "items": [
                        {
                          "type": "image",
                          "id": "planCover"
                        },
                        {
                          "type": "TEXT",
                          "id": "covName"
                        }
                      ]
                    },
                    {
                      "type": "TEXT",
                      "id": "planType",
                      "planDetailLayout": true,
                      "title": "Policy Type",
                      "inputWidth": "20%"
                    },
                    {
                      "type": "TEXT",
                      "id": "paymentMethodDesc",
                      "planDetailLayout": true,
                      "title": "Payment Method",
                      "inputWidth": "20%"
                    },
                    {
                      "type": "TEXT",
                      "id": "payFreqDesc",
                      "planDetailLayout": true,
                      "title": "Payment Mode",
                      "inputWidth": "20%"
                    },
                    {
                      "type": "TEXT",
                      "id": "premium",
                      "planDetailLayout": true,
                      "title": "",
                      "notShowInTable": true,
                      "inputWidth": "19%"
                    }
                  ],
                  "trigger":{
                    "id":"totalRiderPremium",
                    "type":"showIfNotEqual",
                    "value":"0"
                  }
                },
                {
                  "type": "TEXTONLY",
                  "id": "totalRiderPremium",
                  "subType": "currency",
                  "decimal": 2,
                  "prefix": "Total Rider Premium: ",
                  "presentation": "rightAlignRiderPrem",
                  "trigger":{
                    "id":"totalRiderPremium",
                    "type":"showIfNotEqual",
                    "value":"0"
                  }
                }
              ]
            }
          ]
        }
      ]
    },
		{
			"title": "Life Assured",
			"subType": "insured",
			"priority":"proposer",
			"type": "tab",
			"items": [
				{
          "type": "BLOCK",
          "id":"groupedPlanDetails",
          "title": "",
          "items": [
            {
              "type": "CARDCONTAINER",
              "noPadding": true,
              "items":[
                {
                  "type": "tablesectionheading",
                  "id": "tableBasicPlanSection",
                  "title": "Basic Plan"
                },
                {
                  "type": "table",
                  "fullWidth": true,
                  "id": "basicPlanList",
                  "allowEdit": false,
                  "planDetailLayout": true,
                  "noBottomBorder": true,
                  "setWidth" : true,
                  "items": [
                    {
                      "type": "HBOX",
                      "title": "Plan Name",
                      "planDetailLayout": true,
                      "disableTdStyle": true,
                      "presentation": "planCover@covName",
                      "inputWidth": "21%",
                      "items": [
                        {
                          "type": "image",
                          "id": "planCover"
                        },
                        {
                          "type": "TEXT",
                          "id": "covName"
                        }
                      ]
                    },
                    {
                      "type": "TEXT",
                      "id": "planType",
                      "planDetailLayout": true,
                      "title": "Policy Type",
                      "inputWidth": "20%"
                    },
                    {
                      "type": "TEXT",
                      "id": "paymentMethodDesc",
                      "planDetailLayout": true,
                      "title": "Payment Method",
                      "inputWidth": "20%"
                    },
                    {
                      "type": "TEXT",
                      "id": "payFreqDesc",
                      "planDetailLayout": true,
                      "title": "Payment Mode",
                      "inputWidth": "20%"
                    },
                    {
                      "type": "TEXT",
                      "id": "premium",
                      "subType": "currency",
                      "decimal": 2,
                      "planDetailLayout": true,
                      "title": "Premium",
                      "subPostfix": "(incl. Medishield Life)",
                      "inputWidth": "19%"
                    }
                  ]
                },
                {
                  "type": "tablesectionheading",
                  "id": "tableRiderSection",
                  "title": "Rider",
                  "trigger":{
                    "id":"totalRiderPremium",
                    "type":"showIfNotEqual",
                    "value":"0"
                  }
                },
                {
                  "type": "table",
                  "fullWidth": true,
                  "id": "riderPlanList",
                  "allowEdit": false,
                  "planDetailLayout": true,
                  "noBottomBorder": true,
                  "setWidth" : true,
                  "items": [
                    {
                      "type": "HBOX",
                      "title": "Plan Name",
                      "planDetailLayout": true,
                      "disableTdStyle": true,
                      "presentation": "planCover@covName",
                      "inputWidth": "21%",
                      "items": [
                        {
                          "type": "image",
                          "id": "planCover"
                        },
                        {
                          "type": "TEXT",
                          "id": "covName"
                        }
                      ]
                    },
                    {
                      "type": "TEXT",
                      "id": "planType",
                      "planDetailLayout": true,
                      "title": "Policy Type",
                      "inputWidth": "20%"
                    },
                    {
                      "type": "TEXT",
                      "id": "paymentMethodDesc",
                      "planDetailLayout": true,
                      "title": "Payment Method",
                      "inputWidth": "20%"
                    },
                    {
                      "type": "TEXT",
                      "id": "payFreqDesc",
                      "planDetailLayout": true,
                      "title": "Payment Mode",
                      "inputWidth": "20%"
                    },
                    {
                      "type": "TEXT",
                      "id": "premium",
                      "planDetailLayout": true,
                      "title": "",
                      "notShowInTable": true,
                      "inputWidth": "19%"
                    }
                  ],
                  "trigger":{
                    "id":"totalRiderPremium",
                    "type":"showIfNotEqual",
                    "value":"0"
                  }
                },
                {
                  "type": "TEXTONLY",
                  "id": "totalRiderPremium",
                  "subType": "currency",
                  "decimal": 2,
                  "prefix": "Total Rider Premium: ",
                  "presentation": "rightAlignRiderPrem",
                  "trigger":{
                    "id":"totalRiderPremium",
                    "type":"showIfNotEqual",
                    "value":"0"
                  }
                }
              ]
            }
          ]
        }
      ]
    }
	]
}