{
    "compCode": "08",
    "expDate": "2047-06-01 08:36:38",
    "footer": {
        "en": "<div class=\"global_main\">\n<table style=\"width: calc(100% - 50px); font-size: 10pt;\">\n<tbody>\n<tr>\n<td style=\"width: 50.8018%;text-align:right\"><strong>CONFIDENTIAL</strong></td>\n<td style=\"padding-left:50px;text-align: right; width: 35.1982%;\">\n<strong>Date: <xsl:value-of select=\"*/genDate\"/></strong>\n</td>\n</tr>\n<tr>\n<td style=\"width: 50.8018%;\"><strong>Page [[@PAGE_NO]] of [[@TOTAL_PAGE]]</strong></td>\n<td style=\"padding-left:50px;text-align:right; width: 25.1982%;\">\n<strong>Release Version <xsl:value-of select=\"*/releaseVersion\"/></strong>\n</td>\n<td style=\"width: 80px; position: absolute; right:0 ; bottom:0;\">\n<div style=\"width: 80px; min-height: 1200px; background-color: #ffc000;\">\n<div style=\"\nfont-family: Calibri, Candara, Segoe, 'Segoe UI', Optima, Arial, sans-serif;\nfont-size: 19px;\nfont-weight: bold;\nposition: absolute;\ntop: 500px;\nleft: -395px;\ntransform: rotate(90deg)\ntranslateX(180px)\ntranslateY(-230px);\">\nCOVER PAGE FOR PARTICIPATING WHOLE LIFE PLAN\n</div>\n</div>\n</td>\n</tr>\n</tbody>\n</table>\n</div>",
        "zh-Hant": "<p></p>"
    },
    "header": {
        "en": "<table>\n<tbody>\n<tr>\n<td style=\"width: 68%; padding-top:10px;\">\n<div class=\"logo\"></div>\n</td>\n</tr>\n</tbody>\n</table>",
        "zh-Hant": "<p></p>"
    },
    "launchDate": "2018-06-01 08:34:23",
    "pdfCode": "LMP_COVER_FAIR_SECOND",
    "pdfName": {
        "en": "LMP_COVER_FAIR_SECOND",
        "zh-Hant": "LMP_COVER_FAIR_SECOND",
        "zh-tw": "LMP_COVER_FAIR_SECOND"
    },
    "releaseDate": "2018-11-29 08:30:11",
    "remarks": {
        "en": "LMP_COVER_FAIR_SECOND"
    },
    "status": "A",
    "style": ".coverDetails tr td{border:solid 1px;padding:3px 5px;text-align:center;}",
    "template": {
        "en": [
            "<!-- CONTENT START -->\n<div class=\"header\"></div>\n<div style=\"position:relative;font-size:10pt\">\n    <div style=\"width: calc(100% - 50px);height: 100vh;\">\n<hr style=\"display: block;height: 1px; border: 0; border-top: 2px solid #4A7EBB ; margin: 1em 0; padding: 0;\" />\n        <p style=\"font-weight:bold;\">\n            WHAT RETURNS CAN YOU EXPECT FROM THIS POLICY BASED ON THE ILLUSTRATED INVESTMENT RATES OF RETURN?\n        </p>\n        <p>\n            Based on the Illustrated Investment Rate of Return of <xsl:value-of select=\"*/HighIRR\" />% p.a., your total Illustrated Yield upon surrender  at age <xsl:value-of select=\"*/ageOlder\" /> is <xsl:value-of select=\"*/YTM_H\" />% p.a. \n        </p>\n        <p>\n            Based on the Illustrated Investment Rate of Return of <xsl:value-of select=\"*/LowIRR\" />% p.a., your total Illustrated Yield upon surrender  at age <xsl:value-of select=\"*/ageOlder\" /> is <xsl:value-of select=\"*/YTM_L\" />%  p.a.\n        </p>\n        <p>\n            These returns are not guaranteed and do not represent the upper and lower limits of the returns you may receive. \n        </p>\n        <p>\n            Please note that the guaranteed surrender benefit of your policy may be less than the total premiums paid.\n        </p>\n        <p>\n            You can compare <xsl:value-of select=\"*/YTM_H\" />% and <xsl:value-of select=\"*/YTM_L\" />% Illustrated Yields upon surrender with the returns of Singapore Savings Bonds and Singapore Government Securities.  You may refer to <a href=\"http://www.sgs.gov.sg/savingsbonds.aspx\">http://www.sgs.gov.sg/savingsbonds.aspx</a> and <a href=\"http://www.sgs.gov.sg/\">http://www.sgs.gov.sg/</a> for more information on the returns of Singapore Savings Bonds and Singapore Government Securities. Please note that the Illustrated Yields upon surrender have taken into account the cost of insurance and expenses incurred.\n        </p>\n\n        <p style=\"font-weight:bold;\">\n            HOW HAS THE PARTICIPATING FUND PERFORMED OVER THE LAST FEW YEARS?\n        </p>\n        <p>\n            The historical investment rates of return (after deducting investment expenses) of the Participating Fund are shown below:\n        </p>\n        <div style=\"margin: 0 auto;\">\n            <table class = \"coverDetails\" style=\"border-collapse: collapse; border: none; font-size:10pt;line-height:1.2em;\">\n                <colgroup>\n\t\t\t\t\t<col style=\"width:16%;\"/>\n\t\t\t\t\t<col style=\"width:10%;\"/>\n\t\t\t\t\t<col style=\"width:10%;\"/>\n\t\t\t\t\t<col style=\"width:10%;\"/>\n\t\t\t\t\t<col style=\"width:18%;\"/>\n\t\t\t\t\t<col style=\"width:18%;\"/>\n\t\t\t\t\t<col style=\"width:18%;\"/>\n\t\t\t\t</colgroup>\n\t\t\t\n\t\t\t\t<tr>\n\t\t\t\t\t<td></td>\n\t\t\t\t\t<td><xsl:value-of select=\"*/Year1_IR\" /></td>\n\t\t\t\t\t<td><xsl:value-of select=\"*/Year2_IR\" /></td>\n\t\t\t\t\t<td><xsl:value-of select=\"*/Year3_IR\" /></td>\n\t\t\t\t\t<td>Averaged over <br/>the last 3 years</td>\n\t\t\t\t\t<td>Averaged over <br/>the last 5 years</td>\n\t\t\t\t\t<td>Averaged over <br/>the last 10 years</td>\n\t\t\t\t</tr>\n\t\t\t\t\n\t\t\t\t<tr>\n\t\t\t\t\t<td>Investment <br/>Returns</td>\n\t\t\t\t\t<td><xsl:value-of select=\"*/IR_Year1\" />%</td>\n\t\t\t\t\t<td><xsl:value-of select=\"*/IR_Year2\" />%</td>\n\t\t\t\t\t<td><xsl:value-of select=\"*/IR_Year3\" />%</td>\n\t\t\t\t\t<td><xsl:value-of select=\"*/IRaveragedLast3Years\" />%</td>\n\t\t\t\t\t<td><xsl:value-of select=\"*/IRaveragedLast5Years\" />%</td>\n\t\t\t\t\t<td><xsl:value-of select=\"*/IRaveragedLast10Years\" />%</td>\n\t\t\t\t</tr>\n                \n            </table>\n        </div>\n        <p>\n            Please note that historical performance may not be indicative of future performance.\n        </p>\n        <p>\n            Changes in the economic and investment environment may affect the investment performance of the Participating Fund and the bonuses or dividends that you may receive.\n        </p>\n        <p style=\"font-weight:bold;\">\n            HOW WILL EXPENSES INCURRED BY THE PARTICIPATING FUND AFFECT YOU?\n        </p>\n        <p>\n            The expenses incurred by the Participating Fund include investment, management, distribution, tax and other expenses.  The Total Expense Ratio is the proportion of total expenses incurred by the Participating Fund to the assets of the Participating Fund.  The level of expenses incurred may affect the bonuses or dividends you may receive. \n        </p>\n        <!-- CONTENT END -->\n<!-- FOOTER START -->\n    <xsl:if test=\"*/mainInfo/quickQuote='Y'\">\n        <div style=\"position:absolute;bottom: -80px;width:calc(100% - 50px);\">\n            <table style=\"text-align: left; table-layout: fixed; width: 100%; font-size: 10pt; margin: 0 auto;\">\n                <tbody>\n                    <tr style=\"color: white;\">\n                        <td style=\"padding-left: 50px;\">\n                            <div style=\"border-bottom: solid 1px black; width: 80%;\">1</div>\n                        </td>\n                        <td style=\"padding-left: 50px;\">\n                            <div style=\"border-bottom: solid 1px black; width: 80%;\">2</div>\n                        </td>\n                    </tr>\n                    <tr>\n                        <td style=\"padding-left: 50px; padding-top: 10px;\">Adviser's Signature</td>\n                        <td style=\"padding-left: 50px; padding-top: 10px;\">Proposer's Signature</td>\n                    </tr>\n                    <tr>\n                        <td style=\"padding-left: 50px;\">Date:</td>\n                        <td style=\"padding-left: 50px;\">Date:</td>\n                    </tr>\n                </tbody>\n            </table>\n        </div>\n    </xsl:if>\n<!-- FOOTER END-->\n    </div>\n</div>",
            "<!-- CONTENT START -->\n<div class=\"header\"></div>\n<div style=\"position:relative;font-size:10pt\">\n<div style=\"width: calc(100% - 30px);height: 100vh;\">\n   <hr style=\"display: block;height: 1px; border: 0; border-top: 2px solid #4A7EBB ; margin: 1em 0; padding: 0;\" />\n\n        <p style=\"font-weight:bold;\">\n            WHAT IS THE TOTAL EXPENSE RATIO OF THE PARTICIPATING FUND OVER THE LAST FEW YEARS?\n        </p>\n        <p>\n            The historical expense ratios of the Participating Fund are shown below:\n        </p>\n        <div style=\"margin: 0 auto;\">\n            <table class=\"coverDetails\"  style=\"border-collapse: collapse; border: none; font-size:10pt;line-height:1.2em;\">\n                <colgroup>\n\t\t\t\t\t<col style=\"width:16%;\"/>\n\t\t\t\t\t<col style=\"width:10%;\"/>\n\t\t\t\t\t<col style=\"width:10%;\"/>\n\t\t\t\t\t<col style=\"width:10%;\"/>\n\t\t\t\t\t<col style=\"width:18%;\"/>\n\t\t\t\t\t<col style=\"width:18%;\"/>\n\t\t\t\t\t<col style=\"width:18%;\"/>\n\t\t\t\t</colgroup>\n\t\t\t\t\n\t\t\t\t<tr>\n\t\t\t\t\t<td></td>\n\t\t\t\t\t<td><xsl:value-of select=\"*/Year1_TER\" /></td>\n\t\t\t\t\t<td><xsl:value-of select=\"*/Year2_TER\" /></td>\n\t\t\t\t\t<td><xsl:value-of select=\"*/Year3_TER\" /></td>\n\t\t\t\t\t<td>Averaged over <br/>the last 3 years</td>\n\t\t\t\t\t<td>Averaged over <br/>the last 5 years</td>\n\t\t\t\t\t<td>Averaged over <br/>the last 10 years</td>\n\t\t\t\t</tr>\n\t\t\t\t\n\t\t\t\t<tr>\n\t\t\t\t\t<td>Total Expense <br/>Ratio</td>\n\t\t\t\t\t<td><xsl:value-of select=\"*/TER_Year1\" />%</td>\n\t\t\t\t\t<td><xsl:value-of select=\"*/TER_Year2\" />%</td>\n\t\t\t\t\t<td><xsl:value-of select=\"*/TER_Year3\" />%</td>\n\t\t\t\t\t<td><xsl:value-of select=\"*/TERAveragedLast3Years\" />%</td>\n\t\t\t\t\t<td><xsl:value-of select=\"*/TERAveragedLast5Years\" />%</td>\n\t\t\t\t\t<td><xsl:value-of select=\"*/TERAveragedLast10Years\" />%</td>\n\t\t\t\t</tr>\n               \n            </table>\n        </div>\n        <p>\n            Please note that historical expense ratios may not be indicative of future expense ratios.\n        </p>\n        <p style=\"font-weight:bold;\">\n            HOW MUCH WILL YOU NEED TO PAY FOR ADVICE?\n        </p>\n        <p>\n            The total distribution cost of this product is the amount that you will pay for advice and for other distribution related expenses.  It includes cash payments in the form of commissions and benefits paid to the financial advisory firm and its representative(s) who have provided you with financial advice.  This is not an additional cost to you as it has been included in the premiums payable for this plan.\n        </p>\n        <p>\n            The Total Distribution Cost for this plan is $<xsl:value-of select=\"*/Basic_Total_Distribution\" /> as shown in the Policy Illustration.  This makes up <xsl:value-of select=\"*/totalBasicTDC_Premium\" />% of the total premiums payable.\n        </p>\n        <p style=\"font-weight:bold;\">\n            WHAT HAPPENS IF YOU SURRENDER YOUR POLICY EARLY?\n        </p>\n        <p>\n            As buying a life insurance policy is a long-term commitment, an early termination of the policy usually involves high costs and the surrender value, if any, that is payable to you may be zero or less than the total premiums paid.   \n        </p>\n        <p style=\"font-weight:bold;\">\n            OTHER IMPORTANT INFORMATION\n        </p>\n        <p>\n            After purchasing a life insurance policy, the insurer will give you at least 14 days from the date you receive the policy documents to be sure that you want to keep the policy. If the insurer posts or emails the policy to you, the 14 days will start seven days from the date of posting or emailing.\n        </p>\n        <p>\n        \tDuring this time, if you choose to cancel the policy, the insurer will refund you the premiums you have paid, less any medical fees and other expenses such as payments for medical check-ups and medical reports incurred by the insurer.\n        </p>\n        <p>\n            compareFIRST is an online portal that enables you to easily compare the premiums and features of  life insurance products available to the retail market in Singapore. compareFIRST empowers you to make informed decisions when purchasing life insurance products. You can access the portal at <a href=\"www.comparefirst.sg\" style=\"color:black;\">www.comparefirst.sg</a> before making a life insurance purchase. You can also find out more about life insurance products at <a href=\"www.moneysense.gov.sg\" style=\"color:black;\">www.moneysense.gov.sg</a>.\n        </p>\n        <!-- CONTENT END -->\n<!-- FOOTER START -->\n        <div style=\"position:absolute;bottom: -80px;width:calc(100% - 50px);\">\n            <table style=\"text-align: left; table-layout: fixed; width: 100%; font-size: 10pt; margin: 0 auto;\">\n                <tbody>\n                    <tr style=\"color: white;\">\n                        <td style=\"padding-left: 50px;\">\n                            <div style=\"border-bottom: solid 1px black; width: 80%;\">ADVISOR_SIGNATURE</div>\n                        </td>\n                        <td style=\"padding-left: 50px;\">\n                            <div style=\"border-bottom: solid 1px black; width: 80%;\">PROPOSER_SIGNATURE</div>\n                        </td>\n                    </tr>\n                    <tr>\n                        <td style=\"padding-left: 50px; padding-top: 10px;\">Adviser's Signature</td>\n                        <td style=\"padding-left: 50px; padding-top: 10px;\">Proposer's Signature</td>\n                    </tr>\n                    <tr>\n                        <td style=\"padding-left: 50px;\">Date:</td>\n                        <td style=\"padding-left: 50px;\">Date:</td>\n                    </tr>\n                </tbody>\n            </table>\n        </div>\n<!-- FOOTER END-->\n    </div>\n</div>\n<!-- End Page -->"
        ],
        "zh-Hant": []
    },
    "type": "pdfTemplate",
    "version": 3
}