
{
    "compCode"  : "08",
    "type"      : "material",
    "section"   : "Attending Physician Statement",
    "sectionId" : "aps",
    "name"      : "HIV due to blood transfusion",
    "id"        : "physician36_1",
    "effDate"   : "2017-05-22 14:10:34",
    "expDate"   : "2118-05-22 14:19:47"  
}