{
    "compCode": "08",
    "expDate": "2100-03-28 07:38:28",
    "footer": {
        "en": "<div class=\"global_intro\"><xsl:if test=\"*/mainInfo/quickQuote='Y'\">\n<table style=\"text-align: left; table-layout: fixed; width: 100%; font-size: 10pt; margin: 0 auto;\">\n<tbody>\n<xsl:if test=\"*/cover/sameAs='N'\">\n<tr style=\"color: white;\">\n<td style=\"padding-left: 50px;\">\n<div style=\"border-bottom: solid 1px black; width: 80%;\">1</div>\n</td>\n<td style=\"padding-left: 50px;\">\n<div style=\"border-bottom: solid 1px black; width: 80%;\">2</div>\n</td>\n<td style=\"padding-left: 50px;\">\n<div style=\"border-bottom: solid 1px black; width: 80%;\">3</div>\n</td>\n</tr>\n<tr>\n<td style=\"padding-left: 50px; padding-top: 3px;\">Adviser's Signature</td>\n<td style=\"padding-left: 50px; padding-top: 3px;\">Proposer's Signature</td>\n<td style=\"padding-left: 50px; padding-top: 3px;\">Life Assured 2's Signature</td>\n</tr>\n<tr>\n<td style=\"padding-left: 50px;\">Date:</td>\n<td style=\"padding-left: 50px;\">Date:</td>\n<td style=\"padding-left: 50px;\">Date:</td>\n</tr>\n</xsl:if>\n<xsl:if test=\"*/cover/sameAs='Y'\">\n<tr style=\"color: white;\">\n<td style=\"padding-left: 50px;\">\n<div style=\"border-bottom: solid 1px black; width: 80%;\">1</div>\n</td>\n<td style=\"padding-left: 50px;\">\n<div style=\"border-bottom: solid 1px black; width: 80%;\">2</div>\n</td>\n</tr>\n<tr>\n<td style=\"padding-left: 50px; padding-top: 3px;\">Adviser's Signature</td>\n<td style=\"padding-left: 50px; padding-top: 3px;\">Proposer's Signature</td>\n</tr>\n<tr>\n<td style=\"padding-left: 50px;\">Date:</td>\n<td style=\"padding-left: 50px;\">Date:</td>\n</tr>\n</xsl:if>\n</tbody>\n</table>\n</xsl:if>\n<table style=\"width: 100%; font-size: 10pt;\">\n<tbody>\n<tr>\n<td style=\"width: 49.8018%;\"><strong>Page [[@PAGE_NO]] of [[@TOTAL_PAGE]]</strong></td>\n<td style=\"text-align: right; width: 46.1982%;\">Release Version <xsl:value-of select=\"*/releaseVersion\"/></td>\n</tr>\n</tbody>\n</table>\n<div><xsl:value-of select=\"*/footer/planCode\"/></div>\n<div class=\"foot\">\n<div style=\"text-align: center;\"><strong><xsl:value-of select=\"*/footer/compName\"/></strong> (Co. Reg. No. <xsl:value-of select=\"*/footer/compRegNo\"/>)</div>\n<div style=\"text-align: center;\"><xsl:value-of select=\"*/footer/compAddr\"/> | Tel: <xsl:value-of select=\"*/footer/compTel\"/> | Email: <xsl:value-of select=\"*/footer/customerCareEmail\"/> | <xsl:value-of select=\"*/footer/compWeb\"/></div>\n</div>\n</div>",
        "zh-Hant": "<p></p>"
    },
    "formulas": {
        "prepareReportData": "function(quotation, planInfo, planDetails, extraPara) {/*test pvtvul mainBI**/ var illust = extraPara.illustrations[planInfo.covCode]; var company = extraPara.company; var sameAs = quotation.sameAs; var illustrationIRR_High = []; var illustrationIRR_High2 = []; var illustrationIRR_High3 = []; var illustrationIRR_High4 = []; var policyTerm = parseInt(planInfo.policyTerm); var polType = (quotation.policyOptions.policytype == \"joint\") ? true : false; var policyOption = quotation.policyOptions; var baseProductCode = quotation.baseProductCode; var productVersion = quotation.productVersion; var withdrawalFee = baseProductCode == 'PVTVUL' ? 500 : 100; var grossRate = policyOption.grossInvRate; var charge = policyOption.charge; var initPremiumTop = illust[0].totalPremium; var sumAssuredTop = illust[0].sumAssured.IRR_UI; var lapseDisclosure = 0; var lapseFlag = true; if(isNaN(grossRate)){ grossRate = 0 ; } if(isNaN(charge)){ charge = 0 ; } var in_IRR = (grossRate - charge).toFixed(1) + '%'; var i; var yearCount = 0; var yearCount2 = 0; var polTerm = 0; var incRowCnt = 0; var incRowRiderCnt = 0; var incRowAnnualCnt = 0; var tdcbasicCnt = 0; var LA1age = quotation.pAge + 1; var showTextThisPage2 = false; var showTextThisPage3 = false; var showTextThisPage4 = false; var illustTextExtra = false; if(illust[illust.length-1].policy_Fund.IRR_High == 0){ illustTextExtra = true; } var getSmokingDesc = function(value){ return value == \"N\"? \"Non-Smoker\": \"Smoker\"; }; var getGenderDesc = function(value){ return value == \"M\"? \"Male\": \"Female\"; }; var getCurrencyDesc = function(ccy) { var sign = \"$\"; if (ccy === 'SGD') { sign = 'S$ '; } else if (ccy === 'USD') { sign = 'US$ '; } else if (ccy === 'GBP') { sign = '£ '; } else if (ccy === 'EUR') { sign = '€ '; } else if (ccy === 'AUD') { sign = 'A$ '; } else if (ccy === 'JPY') { sign = '¥ '; } else if (ccy === 'CHF') { sign = 'CHF '; } return sign; }; for (i = 0; i < illust.length; i++) { var row = illust[i]; var policyYear = row.policyYear; var LA2age = row.age; var LA12age = LA1age + ' / ' + LA2age; var endYearAge = row.policyYear + ' / ' + LA2age; var totPremiumPtd = row.totalPremium; var sumAssured = row.sumAssured.IRR_High; var polFundValueUI = row.policy_Fund.IRR_High; var deathBenefitUI = row.death_Benefit.IRR_High; var surrenderValueUI = row.surrender_Value.IRR_High; var fees = row.fees.IRR_UI; var InsuranceCharge = row.insurance_Charge.IRR_High; var incRow = false; LA1age++; if (policyYear <= policyTerm) { incRow = true; incRowCnt++; } if(surrenderValueUI == 0 && lapseFlag){ lapseDisclosure = i; lapseFlag = false; } var incRowCntLineBreak = false; if(incRowCnt !== 0 && incRowCnt % 5 === 0 && incRowCnt !== illust.length){ incRowCntLineBreak = true; } if(polType){ if (incRow) { if(i < 30){ illustrationIRR_High.push({ policyYear: policyYear, LA12age: LA2age, totPremiumPtd: getCurrency(totPremiumPtd, '', 0), sumAssured: getCurrency(sumAssured, '', 0), polFundValueUI: getCurrency(polFundValueUI, '', 0), deathBenefitUI: getCurrency(deathBenefitUI, '', 0), surrenderValueUI: getCurrency(surrenderValueUI, '', 0), fees: getCurrency(fees, '', 0), InsuranceCharge: getCurrency(InsuranceCharge, '', 0) }); if(incRowCntLineBreak){ illustrationIRR_High.push({ policyYear: \"\", LA12age: \"\", totPremiumPtd: \"\", sumAssured: \"\", polFundValueUI: \"\", deathBenefitUI: \"\", surrenderValueUI: \"\", fees: \"\", InsuranceCharge: \"\", }); } }else if(i < 60){ illustrationIRR_High2.push({ policyYear: policyYear, LA12age: LA2age, totPremiumPtd: getCurrency(totPremiumPtd, '', 0), sumAssured: getCurrency(sumAssured, '', 0), polFundValueUI: getCurrency(polFundValueUI, '', 0), deathBenefitUI: getCurrency(deathBenefitUI, '', 0), surrenderValueUI: getCurrency(surrenderValueUI, '', 0), fees: getCurrency(fees, '', 0), InsuranceCharge: getCurrency(InsuranceCharge, '', 0) }); if(incRowCntLineBreak){ illustrationIRR_High2.push({ policyYear: \"\", LA12age: \"\", totPremiumPtd: \"\", sumAssured: \"\", polFundValueUI: \"\", deathBenefitUI: \"\", surrenderValueUI: \"\", fees: \"\", InsuranceCharge: \"\", }); } }else if(i < 90){ illustrationIRR_High3.push({ policyYear: policyYear, LA12age: LA2age, totPremiumPtd: getCurrency(totPremiumPtd, '', 0), sumAssured: getCurrency(sumAssured, '', 0), polFundValueUI: getCurrency(polFundValueUI, '', 0), deathBenefitUI: getCurrency(deathBenefitUI, '', 0), surrenderValueUI: getCurrency(surrenderValueUI, '', 0), fees: getCurrency(fees, '', 0), InsuranceCharge: getCurrency(InsuranceCharge, '', 0) }); if(incRowCntLineBreak){ illustrationIRR_High3.push({ policyYear: \"\", LA12age: \"\", totPremiumPtd: \"\", sumAssured: \"\", polFundValueUI: \"\", deathBenefitUI: \"\", surrenderValueUI: \"\", fees: \"\", InsuranceCharge: \"\", }); } }else if(i < 120){ illustrationIRR_High4.push({ policyYear: policyYear, LA12age: LA2age, totPremiumPtd: getCurrency(totPremiumPtd, '', 0), sumAssured: getCurrency(sumAssured, '', 0), polFundValueUI: getCurrency(polFundValueUI, '', 0), deathBenefitUI: getCurrency(deathBenefitUI, '', 0), surrenderValueUI: getCurrency(surrenderValueUI, '', 0), fees: getCurrency(fees, '', 0), InsuranceCharge: getCurrency(InsuranceCharge, '', 0) }); if(incRowCntLineBreak){ illustrationIRR_High4.push({ policyYear: \"\", LA12age: \"\", totPremiumPtd: \"\", sumAssured: \"\", polFundValueUI: \"\", deathBenefitUI: \"\", surrenderValueUI: \"\", fees: \"\", InsuranceCharge: \"\", }); } } } }else{ if (incRow) { if(i < 30){ illustrationIRR_High.push({ endYearAge: endYearAge, totPremiumPtd: getCurrency(totPremiumPtd, '', 0), sumAssured: getCurrency(sumAssured, '', 0), polFundValueUI: getCurrency(polFundValueUI, '', 0), deathBenefitUI: getCurrency(deathBenefitUI, '', 0), surrenderValueUI: getCurrency(surrenderValueUI, '', 0), fees: getCurrency(fees, '', 0), InsuranceCharge: getCurrency(InsuranceCharge, '', 0) }); if(incRowCntLineBreak){ illustrationIRR_High.push({ endYearAge: \"\", totPremiumPtd: \"\", sumAssured: \"\", polFundValueUI: \"\", deathBenefitUI: \"\", surrenderValueUI: \"\", fees: \"\", InsuranceCharge: \"\", }); } }else if(i < 60){ illustrationIRR_High2.push({ endYearAge: endYearAge, totPremiumPtd: getCurrency(totPremiumPtd, '', 0), sumAssured: getCurrency(sumAssured, '', 0), polFundValueUI: getCurrency(polFundValueUI, '', 0), deathBenefitUI: getCurrency(deathBenefitUI, '', 0), surrenderValueUI: getCurrency(surrenderValueUI, '', 0), fees: getCurrency(fees, '', 0), InsuranceCharge: getCurrency(InsuranceCharge, '', 0) }); if(incRowCntLineBreak){ illustrationIRR_High2.push({ endYearAge: \"\", totPremiumPtd: \"\", sumAssured: \"\", polFundValueUI: \"\", deathBenefitUI: \"\", surrenderValueUI: \"\", fees: \"\", InsuranceCharge: \"\", }); } }else if(i < 90){ illustrationIRR_High3.push({ endYearAge: endYearAge, totPremiumPtd: getCurrency(totPremiumPtd, '', 0), sumAssured: getCurrency(sumAssured, '', 0), polFundValueUI: getCurrency(polFundValueUI, '', 0), deathBenefitUI: getCurrency(deathBenefitUI, '', 0), surrenderValueUI: getCurrency(surrenderValueUI, '', 0), fees: getCurrency(fees, '', 0), InsuranceCharge: getCurrency(InsuranceCharge, '', 0) }); if(incRowCntLineBreak){ illustrationIRR_High3.push({ endYearAge: \"\", totPremiumPtd: \"\", sumAssured: \"\", polFundValueUI: \"\", deathBenefitUI: \"\", surrenderValueUI: \"\", fees: \"\", InsuranceCharge: \"\", }); } }else if(i < 120){ illustrationIRR_High4.push({ endYearAge: endYearAge, totPremiumPtd: getCurrency(totPremiumPtd, '', 0), sumAssured: getCurrency(sumAssured, '', 0), polFundValueUI: getCurrency(polFundValueUI, '', 0), deathBenefitUI: getCurrency(deathBenefitUI, '', 0), surrenderValueUI: getCurrency(surrenderValueUI, '', 0), fees: getCurrency(fees, '', 0), InsuranceCharge: getCurrency(InsuranceCharge, '', 0) }); if(incRowCntLineBreak){ illustrationIRR_High4.push({ endYearAge: \"\", totPremiumPtd: \"\", sumAssured: \"\", polFundValueUI: \"\", deathBenefitUI: \"\", surrenderValueUI: \"\", fees: \"\", InsuranceCharge: \"\", }); } } } } incRowCntLineBreak = false; } var result = []; var maxRow = 30; if(illustrationIRR_High2.length <maxRow){ showTextThisPage2 = true; }else if(illustrationIRR_High3.length <maxRow){ showTextThisPage3 = true; }else if(illustrationIRR_High4.length <maxRow){ showTextThisPage4 = true; } result = { footer: { compName: company.compName, compRegNo: company.compRegNo, compAddr: company.compAddr, compAddr2: company.compAddr2, compTel: company.compTel, compFax: company.compFax, compWeb: company.compWeb, sysdate: new Date(extraPara.systemDate).format(extraPara.dateFormat), releaseVersion: \"1\", customerCareEmail: company.customerCareEmail }, cover: { sameAs: quotation.sameAs, ccy: quotation.ccy, initPremiumTop: getCurrency(initPremiumTop, '', 0), sumAssuredTop: getCurrency(sumAssuredTop, '', 0), ccySign: getCurrencyDesc(quotation.ccy), polType: quotation.policyOptions.policytype, riskCommenDate: new Date(quotation.riskCommenDate).format(extraPara.dateFormat), genDate: new Date(extraPara.systemDate).format(extraPara.dateFormat), in_IRR : in_IRR, lapseDisclosure: lapseDisclosure, proposer: { name: quotation.pFullName, gender: getGenderDesc(quotation.pGender), dob: new Date(quotation.pDob).format(extraPara.dateFormat), age: quotation.pAge, smoking: getSmokingDesc(quotation.pSmoke) }, insured: { name: quotation.iFullName, gender: getGenderDesc(quotation.iGender), dob: new Date(quotation.iDob).format(extraPara.dateFormat), age: quotation.iAge, smoking: getSmokingDesc(quotation.iSmoke) } }, illustration: { illustrationIRR_High: illustrationIRR_High, illustrationIRR_High2: illustrationIRR_High2, illustrationIRR_High3: illustrationIRR_High3, illustrationIRR_High4: illustrationIRR_High4, showTextThisPage2: showTextThisPage2, showTextThisPage3: showTextThisPage3, showTextThisPage4: showTextThisPage4, illustTextExtra : illustTextExtra } }; if(showTextThisPage2){ result.hidePagesIndexArray = [2,3]; }else if(showTextThisPage3){ result.hidePagesIndexArray = [3]; } return result; }"
    },
    "header": {
        "en": "<table style=\"width: 100%;\">\n<tbody>\n<tr>\n<td><div class=\"awt-intro-logo\"/></td>\n</tr>\n</tbody>\n</table>",
        "zh-Hant": ""
    },
    "launchDate": "2018-03-28 07:37:44",
    "overlay": {
        "en": ""
    },
    "pdfCode": "PVTVUL_IRR_HIGH",
    "pdfName": {
        "en": "PVTVUL IRR High",
        "zh-Hant": "RHP Main BI (New)",
        "zh-tw": "RHP Main BI"
    },
    "releaseDate": "2020-02-18 03:11:51",
    "remarks": {
        "en": "PVTVUL Main BI",
        "zh-Hant": "RHP Main BI (New)",
        "zh-tw": "RHP Main BI"
    },
    "status": "A",
    "style": ".centerBox{margin:auto;text-align:center;padding:0;}.rhp-intro-logo{background-image:<img@rhp_intro-logo-img>;width:50px;height:50px;background-repeat:round;margin-top:0;float:left;}.autofitfooter{font-size:8px;font-size:2.5vw;}.pd6{padding:6px;}.w90{width:90%;font-size:10pt;}.emptyspace10{height:10px;}.noBold{font-weight:normal;text-align:left;}.emptyspace0{height:0;}.tdCol{height:13px;vertical-align:middle;text-align:center;font-size:9pt;}.foot{font-size:9pt;text-align:center;}",
    "template": {
        "en": [
            "<div class=\"global_main\">\n    \n        <table class=\"w100\">\n           <colgroup>\n            <col style=\"width:25%\" />\n            <col style=\"width:35%\" />\n            <col style=\"width:15%;\" />\n            <col style=\"width:25%\" />\n        </colgroup>\n    \n            <thead>\n                <tr>\n                    <th colspan=\"4\" style=\"text-align: center; padding-bottom: 10px;\">\n                        <strong>MAIN POLICY ILLUSTRATION</strong>\n                    </th>\n                </tr>\n    \n                 <xsl:if test=\"*/cover/polType='joint'\">\n        <tr>\n                <td class=\"vtop b tleft\" style=\"padding-top: 4px;\">\n                    <b>\n                        Proposal on the life of\n                    </b>\n                </td>\n                <td class=\"vtop b tleft\" style=\"padding-top: 4px;\">\n                    <b>\n                        :\n                        <xsl:value-of select=\"*/cover/proposer/name\" />\n                        AND\n                        <xsl:value-of select=\"*/cover/insured/name\" />\n                    </b>\n                </td>\n                <td class=\"vtop b tleft\" style=\"padding-top: 4px;\">\n                    <b>\n                        Date\n                    </b>\n                </td>\n                <td class=\"vtop b tleft\" style=\"padding-top: 4px;\">\n                    <b>\n                        :\n                        <xsl:value-of select=\"*/cover/genDate\" />\n                    </b>\n                </td>\n            </tr>\n            <tr>\n                <td class=\"vtop b tleft\">\n                    <b>\n                        <xsl:value-of select=\"*/cover/proposer/name\" />\n                        Gender\n                    </b>\n                </td>\n                <td class=\"vtop b tleft\">\n                    <b>\n                        :\n                        <xsl:value-of select=\"*/cover/proposer/gender\" />\n                        (\n                        <xsl:value-of select=\"*/cover/proposer/smoking\" />\n                        )\n                    </b>\n                </td>\n                <td class=\"vtop b tleft\">\n                    <b>\n                        Age\n                    </b>\n                </td>\n                <td class=\"vtop b tleft\">\n                    <b>\n                        :\n                        <xsl:value-of select=\"*/cover/proposer/age\" />\n                        (As At\n                        <xsl:value-of select=\"*/cover/genDate\" />\n                        )\n                    </b>\n                </td>\n            </tr>\n            <tr>\n                <td class=\"vtop b tleft\">\n                    <b>\n                        <xsl:value-of select=\"*/cover/insured/name\" />\n                        Gender\n                    </b>\n                </td>\n                <td class=\"vtop b tleft\">\n                    <b>\n                        :\n                        <xsl:value-of select=\"*/cover/insured/gender\" />\n                        (\n                        <xsl:value-of select=\"*/cover/insured/smoking\" />\n                        )\n                    </b>\n                </td>\n                <td class=\"vtop b tleft\">\n                    <b>\n                        Age\n                    </b>\n                </td>\n                <td class=\"vtop b tleft\">\n                    <b>\n                        :\n                        <xsl:value-of select=\"*/cover/insured/age\" />\n                        (As At\n                        <xsl:value-of select=\"*/cover/genDate\" />\n                        )\n                    </b>\n                </td>\n            </tr>\n        </xsl:if>\n\n        <xsl:if test=\"*/cover/polType='single'\">\n        <tr>\n            <td class=\"vtop b tleft\">Proposal on the life of </td>\n            <td class=\"vtop b tleft\">: <span><xsl:value-of select=\"*/cover/insured/name\"/></span> </td>\n            <td class=\"vtop b tleft\">Date</td>\n            <td class=\"vtop b tleft\">:\n                <xsl:value-of select=\"*/cover/genDate\" />\n            </td>\n        </tr>\n        <tr>\n            <td class=\"vtop b tleft\">Gender</td>\n            <td class=\"vtop b tleft\">:\n                <xsl:value-of select=\"*/cover/insured/gender\" /> \n                (<xsl:value-of select=\"*/cover/insured/smoking\" />)</td>\n            <td class=\"vtop b tleft\">Age</td>\n            <td class=\"vtop b tleft\">:\n                <xsl:value-of select=\"*/cover/insured/age\" /> (as at\n                <xsl:value-of select=\"*/cover/riskCommenDate\" />)</td>\n        </tr>\n        </xsl:if>\n                \n                <tr>\n                    <td class=\"vtop b tleft\">Initial Premium</td>\n                    <td class=\"vtop b tleft\">:\n                        <xsl:value-of select=\"*/cover/initPremiumTop\" /> \n                    </td>\n                    <td class=\"vtop b tleft\" style=\"padding-right: 10px;\">Sum Assured\n                    </td>\n                    <td class=\"vtop b tleft\">:\n                        <xsl:value-of select=\"*/cover/sumAssuredTop\" />\n                    </td>\n                </tr>\n\n                <tr>\n                    <td class=\"vtop b tleft\">Policy Currency</td>\n                    <td class=\"vtop b tleft\" colspan=\"3\">:\n                        <xsl:value-of select=\"*/cover/ccy\" /> \n                    </td>\n                </tr>\n\n                <tr style=\"border-bottom: solid 1pt black\">\n                    <th colspan=\"4\">\n                        <br/>\n                    </th>\n                </tr>\n    \n            </thead>\n    \n            <tbody>\n                <tr>\n                    <td colspan=\"4\">\n                        <div id=\"pageDB\">\n                            <div class=\"emptyspace10\"></div>\n                            <div>This illustration assumes that your policy performance has deviated from your Chosen Investment Rate of Return of \n                                <xsl:value-of select=\"*/cover/in_IRR\" /> and performs at 8.0% instead. This illustration also assumes no partial \n                                withdrawals and additional premiums. Fees illustrated are a sum of Establishment Fee, Policy Fee and Ongoing Administration Fee</div>\n                            <div class=\"emptyspace10\"></div>\n                            <div class=\"emptyspace10\"></div>\n                            <xsl:if test=\"*/cover/polType='joint'\">\n                            <table class=\"w100\">\n                                <colgroup>\n                                    <col style=\"width:14.3%\" />\n                                    <col style=\"width:14.3%\" />\n                                    <col style=\"width:14.3%\" />\n                                    <col style=\"width:14.3%\" />\n                                    <col style=\"width:14.3%\" />\n                                    <col style=\"width:14.3%\" />\n                                    <col style=\"width:14.2%\" />\n                                </colgroup>\n    \n                                <thead>\n                                    <tr>\n                                        <th colspan=\"1\" class=\"vtop pd2 noBold\">\n                                        </th>\n                                        <th colspan=\"6\" class=\"bgblack tcwhite\">Illustration at Investment Rate of Return of 8.0%</th>\n                                    </tr>\n                                    <tr>\n                                        <th class=\"vtop pd2\">\n                                            End of\n                                            <br/>Policy\n                                            <br/>Year\n                                        </th>\n                                        <th class=\"vtop pd2\">\n                                            <br/>LA1 Age/\n                                            <br/>LA2 Age\n                                        </th>\n                                        \n                                        <th class=\"vtop pd2\">\n                                            Policy Fund\n                                            <br/>Value\n                                            <br/>(<xsl:value-of select=\"*/cover/ccySign\" />)\n                                        </th>\n                                        <th class=\"vtop pd2\">\n                                            Death\n                                            <br/>Benefit\n                                            <br/>(<xsl:value-of select=\"*/cover/ccySign\" />)\n                                        </th>\n                                        <th class=\"vtop pd2\">\n                                            Surrender\n                                            <br/>Value\n                                            <br/>(<xsl:value-of select=\"*/cover/ccySign\" />)\n                                        </th>\n                                        <th class=\"vtop pd2\">\n                                            <br/>Fees\n                                            <br/>(<xsl:value-of select=\"*/cover/ccySign\" />)\n                                        </th>\n                                        <th class=\"vtop pd2\">\n                                            Insurance\n                                            <br/>Charge\n                                            <br/>(<xsl:value-of select=\"*/cover/ccySign\" />)\n                                        </th>\n                                    </tr>\n                                    <tr>\n                                        <th colspan=\"7\" class=\"vtop pd2 noBold\"><div class=\"sectionSpace\" /></th>\n                                    </tr>\n                                </thead>\n    \n                                <tbody>\n                                    <xsl:for-each select=\"*/illustration/illustrationIRR_High\">\n                                        <tr>\n                                            <td class=\"tdCol\" style=\"text-align: center;\">\n                                                <xsl:value-of select=\"policyYear\" />\n                                            </td>\n                                            <td class=\"tdCol\" style=\"text-align: center;\">\n                                                <xsl:value-of select=\"LA12age\" />\n                                            </td>\n                                            <td class=\"tdCol\" style=\"text-align: center;\">\n                                                <xsl:value-of select=\"polFundValueUI\" />\n                                            </td>\n                                            <td class=\"tdCol\" style=\"text-align: center;\">\n                                                <xsl:value-of select=\"deathBenefitUI\" />\n                                            </td>\n                                            <td class=\"tdCol\" style=\"text-align: center;\">\n                                                <xsl:value-of select=\"surrenderValueUI\" />\n                                            </td>\n                                            <td class=\"tdCol\" style=\"text-align: center;\">\n                                                <xsl:value-of select=\"fees\" />\n                                            </td>\n                                            <td class=\"tdCol\" style=\"text-align: center;\">\n                                                <xsl:value-of select=\"InsuranceCharge\" />\n                                            </td>\n                                        </tr>\n                                    </xsl:for-each>\n                                </tbody>\n                            </table>\n                            </xsl:if>\n                            <xsl:if test=\"*/cover/polType='single'\">\n                            <table class=\"w100\">\n                                <colgroup>\n                                    <col style=\"width:16.7%\" />\n                                    <col style=\"width:16.7%\" />\n                                    <col style=\"width:16.7%\" />\n                                    <col style=\"width:16.7%\" />\n                                    <col style=\"width:16.7%\" />\n                                    <col style=\"width:16.5%\" />\n                                </colgroup>\n    \n                                <thead>\n                                    <tr>\n                                        <th colspan=\"1\" class=\"vtop pd2 noBold\">\n                                        </th>\n                                        <th colspan=\"5\" class=\"bgblack tcwhite\">Illustration at Investment Rate of Return of 8.0%</th>\n                                    </tr>\n                                    <tr>\n                                        <th class=\"vtop pd2\">\n                                            End of\n                                            <br/>Policy\n                                            <br/>Year/Age\n                                        </th>\n\n                                        <th class=\"vtop pd2\">\n                                            Policy Fund\n                                            <br/>Value\n                                            <br/>(<xsl:value-of select=\"*/cover/ccySign\" />)\n                                        </th>\n                                        <th class=\"vtop pd2\">\n                                            Death\n                                            <br/>Benefit\n                                            <br/>(<xsl:value-of select=\"*/cover/ccySign\" />)\n                                        </th>\n                                        <th class=\"vtop pd2\">\n                                            Surrender\n                                            <br/>Value\n                                            <br/>(<xsl:value-of select=\"*/cover/ccySign\" />)\n                                        </th>\n                                        <th class=\"vtop pd2\">\n                                            <br/>Fees\n                                            <br/>(<xsl:value-of select=\"*/cover/ccySign\" />)\n                                        </th>\n                                        <th class=\"vtop pd2\">\n                                            Insurance\n                                            <br/>Charge\n                                            <br/>(<xsl:value-of select=\"*/cover/ccySign\" />)\n                                        </th>\n                                    </tr>\n                                    <tr>\n                                        <th colspan=\"6\" class=\"vtop pd2 noBold\"><div class=\"sectionSpace\" /></th>\n                                    </tr>\n                                </thead>\n    \n                                <tbody>\n                                    <xsl:for-each select=\"*/illustration/illustrationIRR_High\">\n                                        <tr>\n                                            <td class=\"tdCol\" style=\"text-align: center;\">\n                                                <xsl:value-of select=\"endYearAge\" />\n                                            </td>\n                                            <td class=\"tdCol\" style=\"text-align: center;\">\n                                                <xsl:value-of select=\"polFundValueUI\" />\n                                            </td>\n                                            <td class=\"tdCol\" style=\"text-align: center;\">\n                                                <xsl:value-of select=\"deathBenefitUI\" />\n                                            </td>\n                                            <td class=\"tdCol\" style=\"text-align: center;\">\n                                                <xsl:value-of select=\"surrenderValueUI\" />\n                                            </td>\n                                            <td class=\"tdCol\" style=\"text-align: center;\">\n                                                <xsl:value-of select=\"fees\" />\n                                            </td>\n                                            <td class=\"tdCol\" style=\"text-align: center;\">\n                                                <xsl:value-of select=\"InsuranceCharge\" />\n                                            </td>\n                                        </tr>\n                                    </xsl:for-each>\n                                </tbody>\n                            </table>\n                            </xsl:if>\n                            <div class=\"emptyspace10\"></div>\n                            <div class=\"emptyspace10\"></div> \n                        </div>\n    \n                    </td>\n                </tr>\n            </tbody>\n        </table>\n    </div>\n    \n    \n    \n    ",
            "<div class=\"global_main\">\n    \n        <table class=\"w100\">\n           <colgroup>\n            <col style=\"width:25%\" />\n            <col style=\"width:35%\" />\n            <col style=\"width:15%;\" />\n            <col style=\"width:25%\" />\n        </colgroup>\n    \n            <thead>\n                <tr>\n                    <th colspan=\"4\" style=\"text-align: center; padding-bottom: 10px;\">\n                        <strong>MAIN POLICY ILLUSTRATION</strong>\n                    </th>\n                </tr>\n    \n                 <xsl:if test=\"*/cover/polType='joint'\">\n        <tr>\n                <td class=\"vtop b tleft\" style=\"padding-top: 4px;\">\n                    <b>\n                        Proposal on the life of\n                    </b>\n                </td>\n                <td class=\"vtop b tleft\" style=\"padding-top: 4px;\">\n                    <b>\n                        :\n                        <xsl:value-of select=\"*/cover/proposer/name\" />\n                        AND\n                        <xsl:value-of select=\"*/cover/insured/name\" />\n                    </b>\n                </td>\n                <td class=\"vtop b tleft\" style=\"padding-top: 4px;\">\n                    <b>\n                        Date\n                    </b>\n                </td>\n                <td class=\"vtop b tleft\" style=\"padding-top: 4px;\">\n                    <b>\n                        :\n                        <xsl:value-of select=\"*/cover/genDate\" />\n                    </b>\n                </td>\n            </tr>\n            <tr>\n                <td class=\"vtop b tleft\">\n                    <b>\n                        <xsl:value-of select=\"*/cover/proposer/name\" />\n                        Gender\n                    </b>\n                </td>\n                <td class=\"vtop b tleft\">\n                    <b>\n                        :\n                        <xsl:value-of select=\"*/cover/proposer/gender\" />\n                        (\n                        <xsl:value-of select=\"*/cover/proposer/smoking\" />\n                        )\n                    </b>\n                </td>\n                <td class=\"vtop b tleft\">\n                    <b>\n                        Age\n                    </b>\n                </td>\n                <td class=\"vtop b tleft\">\n                    <b>\n                        :\n                        <xsl:value-of select=\"*/cover/proposer/age\" />\n                        (As At\n                        <xsl:value-of select=\"*/cover/genDate\" />\n                        )\n                    </b>\n                </td>\n            </tr>\n            <tr>\n                <td class=\"vtop b tleft\">\n                    <b>\n                        <xsl:value-of select=\"*/cover/insured/name\" />\n                        Gender\n                    </b>\n                </td>\n                <td class=\"vtop b tleft\">\n                    <b>\n                        :\n                        <xsl:value-of select=\"*/cover/insured/gender\" />\n                        (\n                        <xsl:value-of select=\"*/cover/insured/smoking\" />\n                        )\n                    </b>\n                </td>\n                <td class=\"vtop b tleft\">\n                    <b>\n                        Age\n                    </b>\n                </td>\n                <td class=\"vtop b tleft\">\n                    <b>\n                        :\n                        <xsl:value-of select=\"*/cover/insured/age\" />\n                        (As At\n                        <xsl:value-of select=\"*/cover/genDate\" />\n                        )\n                    </b>\n                </td>\n            </tr>\n        </xsl:if>\n\n        <xsl:if test=\"*/cover/polType='single'\">\n        <tr>\n            <td class=\"vtop b tleft\">Proposal on the life of </td>\n            <td class=\"vtop b tleft\">: <span><xsl:value-of select=\"*/cover/insured/name\"/></span> </td>\n            <td class=\"vtop b tleft\">Date</td>\n            <td class=\"vtop b tleft\">:\n                <xsl:value-of select=\"*/cover/genDate\" />\n            </td>\n        </tr>\n        <tr>\n            <td class=\"vtop b tleft\">Gender</td>\n            <td class=\"vtop b tleft\">:\n                <xsl:value-of select=\"*/cover/insured/gender\" /> \n                (<xsl:value-of select=\"*/cover/insured/smoking\" />)</td>\n            <td class=\"vtop b tleft\">Age</td>\n            <td class=\"vtop b tleft\">:\n                <xsl:value-of select=\"*/cover/insured/age\" /> (as at\n                <xsl:value-of select=\"*/cover/riskCommenDate\" />)</td>\n        </tr>\n        </xsl:if>\n                \n                <tr>\n                    <td class=\"vtop b tleft\">Initial Premium</td>\n                    <td class=\"vtop b tleft\">:\n                        <xsl:value-of select=\"*/cover/initPremiumTop\" /> \n                    </td>\n                    <td class=\"vtop b tleft\" style=\"padding-right: 10px;\">Sum Assured\n                    </td>\n                    <td class=\"vtop b tleft\">:\n                        <xsl:value-of select=\"*/cover/sumAssuredTop\" />\n                    </td>\n                </tr>\n\n                <tr>\n                    <td class=\"vtop b tleft\">Policy Currency</td>\n                    <td class=\"vtop b tleft\" colspan=\"3\">:\n                        <xsl:value-of select=\"*/cover/ccy\" /> \n                    </td>\n                </tr>\n\n                <tr style=\"border-bottom: solid 1pt black\">\n                    <th colspan=\"4\">\n                        <br/>\n                    </th>\n                </tr>\n    \n            </thead>\n    \n            <tbody>\n                <tr>\n                    <td colspan=\"4\">\n                        <div id=\"pageDB\">\n                              <xsl:if test=\"count(*/illustration/illustrationIRR_High2) >0\">\n                            <div class=\"emptyspace10\"></div>\n    <div>This illustration assumes that your policy performance has deviated from your Chosen Investment Rate of Return of \n                                <xsl:value-of select=\"*/cover/in_IRR\" /> and performs at 8.0% instead. This illustration also assumes no partial \n                                withdrawals and additional premiums. Fees illustrated are a sum of Establishment Fee, Policy Fee and Ongoing Administration Fee</div>\n                            <div class=\"emptyspace10\"></div>\n                             </xsl:if>\n                            <div class=\"emptyspace10\"></div>\n                            <xsl:if test=\"(*/cover/polType='joint') and count(*/illustration/illustrationIRR_High2) >0\">\n                            <table class=\"w100\">\n                                <colgroup>\n                                    <col style=\"width:14.3%\" />\n                                    <col style=\"width:14.3%\" />\n                                    <col style=\"width:14.3%\" />\n                                    <col style=\"width:14.3%\" />\n                                    <col style=\"width:14.3%\" />\n                                    <col style=\"width:14.3%\" />\n                                    <col style=\"width:14.2%\" />\n                                </colgroup>\n    \n                                <thead>\n                                    <tr>\n                                        <th colspan=\"1\" class=\"vtop pd2 noBold\">\n                                        </th>\n                                        <th colspan=\"6\" class=\"bgblack tcwhite\">Illustration at Investment Rate of Return of 8.0%</th>\n                                    </tr>\n                                    <tr>\n                                        <th class=\"vtop pd2\">\n                                            End of\n                                            <br/>Policy\n                                            <br/>Year\n                                        </th>\n                                        <th class=\"vtop pd2\">\n                                            <br/>LA1 Age/\n                                            <br/>LA2 Age\n                                        </th>\n                                        \n                                        <th class=\"vtop pd2\">\n                                            Policy Fund\n                                            <br/>Value\n                                            <br/>(<xsl:value-of select=\"*/cover/ccySign\" />)\n                                        </th>\n                                        <th class=\"vtop pd2\">\n                                            Death\n                                            <br/>Benefit\n                                            <br/>(<xsl:value-of select=\"*/cover/ccySign\" />)\n                                        </th>\n                                        <th class=\"vtop pd2\">\n                                            Surrender\n                                            <br/>Value\n                                            <br/>(<xsl:value-of select=\"*/cover/ccySign\" />)\n                                        </th>\n                                        <th class=\"vtop pd2\">\n                                            <br/>Fees\n                                            <br/>(<xsl:value-of select=\"*/cover/ccySign\" />)\n                                        </th>\n                                        <th class=\"vtop pd2\">\n                                            Insurance\n                                            <br/>Charge\n                                            <br/>(<xsl:value-of select=\"*/cover/ccySign\" />)\n                                        </th>\n                                    </tr>\n                                    <tr>\n                                        <th colspan=\"7\" class=\"vtop pd2 noBold\"><div class=\"sectionSpace\" /></th>\n                                    </tr>\n                                </thead>\n    \n                                <tbody>\n                                    <xsl:for-each select=\"*/illustration/illustrationIRR_High2\">\n                                        <tr>\n                                            <td class=\"tdCol\" style=\"text-align: center;\">\n                                                <xsl:value-of select=\"policyYear\" />\n                                            </td>\n                                            <td class=\"tdCol\" style=\"text-align: center;\">\n                                                <xsl:value-of select=\"LA12age\" />\n                                            </td>\n                                            <td class=\"tdCol\" style=\"text-align: center;\">\n                                                <xsl:value-of select=\"polFundValueUI\" />\n                                            </td>\n                                            <td class=\"tdCol\" style=\"text-align: center;\">\n                                                <xsl:value-of select=\"deathBenefitUI\" />\n                                            </td>\n                                            <td class=\"tdCol\" style=\"text-align: center;\">\n                                                <xsl:value-of select=\"surrenderValueUI\" />\n                                            </td>\n                                            <td class=\"tdCol\" style=\"text-align: center;\">\n                                                <xsl:value-of select=\"fees\" />\n                                            </td>\n                                            <td class=\"tdCol\" style=\"text-align: center;\">\n                                                <xsl:value-of select=\"InsuranceCharge\" />\n                                            </td>\n                                        </tr>\n                                    </xsl:for-each>\n                                </tbody>\n                            </table>\n                            </xsl:if>\n                            <xsl:if test=\"(*/cover/polType='single') and count(*/illustration/illustrationIRR_High2) > 0\">\n                            <table class=\"w100\">\n                                <colgroup>\n                                    <col style=\"width:16.7%\" />\n                                    <col style=\"width:16.7%\" />\n                                    <col style=\"width:16.7%\" />\n                                    <col style=\"width:16.7%\" />\n                                    <col style=\"width:16.7%\" />\n                                    <col style=\"width:16.5%\" />\n                                </colgroup>\n    \n                                <thead>\n                                    <tr>\n                                        <th colspan=\"1\" class=\"vtop pd2 noBold\">\n                                        </th>\n                                        <th colspan=\"5\" class=\"bgblack tcwhite\">Illustration at Investment Rate of Return of 8.0%</th>\n                                    </tr>\n                                    <tr>\n                                        <th class=\"vtop pd2\">\n                                            End of\n                                            <br/>Policy\n                                            <br/>Year/Age\n                                        </th>\n\n                                        <th class=\"vtop pd2\">\n                                            Policy Fund\n                                            <br/>Value\n                                            <br/>(<xsl:value-of select=\"*/cover/ccySign\" />)\n                                        </th>\n                                        <th class=\"vtop pd2\">\n                                            Death\n                                            <br/>Benefit\n                                            <br/>(<xsl:value-of select=\"*/cover/ccySign\" />)\n                                        </th>\n                                        <th class=\"vtop pd2\">\n                                            Surrender\n                                            <br/>Value\n                                            <br/>(<xsl:value-of select=\"*/cover/ccySign\" />)\n                                        </th>\n                                        <th class=\"vtop pd2\">\n                                            <br/>Fees\n                                            <br/>(<xsl:value-of select=\"*/cover/ccySign\" />)\n                                        </th>\n                                        <th class=\"vtop pd2\">\n                                            Insurance\n                                            <br/>Charge\n                                            <br/>(<xsl:value-of select=\"*/cover/ccySign\" />)\n                                        </th>\n                                    </tr>\n                                    <tr>\n                                        <th colspan=\"6\" class=\"vtop pd2 noBold\"><div class=\"sectionSpace\" /></th>\n                                    </tr>\n                                </thead>\n    \n                                <tbody>\n                                    <xsl:for-each select=\"*/illustration/illustrationIRR_High2\">\n                                        <tr>\n                                            <td class=\"tdCol\" style=\"text-align: center;\">\n                                                <xsl:value-of select=\"endYearAge\" />\n                                            </td>\n                                            <td class=\"tdCol\" style=\"text-align: center;\">\n                                                <xsl:value-of select=\"polFundValueUI\" />\n                                            </td>\n                                            <td class=\"tdCol\" style=\"text-align: center;\">\n                                                <xsl:value-of select=\"deathBenefitUI\" />\n                                            </td>\n                                            <td class=\"tdCol\" style=\"text-align: center;\">\n                                                <xsl:value-of select=\"surrenderValueUI\" />\n                                            </td>\n                                            <td class=\"tdCol\" style=\"text-align: center;\">\n                                                <xsl:value-of select=\"fees\" />\n                                            </td>\n                                            <td class=\"tdCol\" style=\"text-align: center;\">\n                                                <xsl:value-of select=\"InsuranceCharge\" />\n                                            </td>\n                                        </tr>\n                                    </xsl:for-each>\n                                </tbody>\n                            </table>\n                            </xsl:if>\n    \n                            <div class=\"emptyspace10\"></div>\n                            <div class=\"emptyspace10\"></div>\n                            <div class=\"emptyspace10\"></div>\n                            <xsl:if test=\"*/illustration/showTextThisPage2='true'\">\n                            <table class=\"w100\">\n                                <tr>\n                                    <td class=\"vtop b tleft\">Illustrated Lapse Disclosure</td>\n                                </tr>\n                                <xsl:if test=\"*/cover/lapseDisclosure = 0\">\n                                    <tr>\n                                        <td class=\"vtop  tleft\">Under 8.0% Illustrated Investment Rate of Return, your policy is illustrated to have no lapse from insufficient Policy Fund Value.</td>\n                                    </tr>\n                                </xsl:if>\n                                <xsl:if test=\"*/cover/lapseDisclosure > 0\">\n                                    <tr>\n                                        <td class=\"vtop  tleft\">Under 8.0% Illustrated Investment Rate of Return, the Surrender Value is illustrated to sustain your policy up to end of policy year <xsl:value-of select=\"*/cover/lapseDisclosure\" /> before lapsing due to insufficient Policy Fund Value. </td>\n                                    </tr>\n                                </xsl:if>\n                                <tr>\n                                    <td class=\"vtop  tleft\">\n                                        <div class=\"emptyspace0\"></div>\n                                    </td>\n                                </tr>\n<xsl:if test=\"*/illustration/illustTextExtra ='true'\">\n    <tr>\n\t\t<td class=\"vtop  tleft\">To ensure your policy can continue to stay in force, you may contribute Additional Premiums, or reduce your Sum Assured, at any time before your Policy Fund Value \n            becomes zero.</td>\n\t</tr>\n</xsl:if>\n                            </table>\t\n                            </xsl:if>\n                        </div>\n    \n                    </td>\n                </tr>\n            </tbody>\n        </table>\n    </div>\n    \n    \n    \n    ",
            "<div class=\"global_main\">\n    \n        <table class=\"w100\">\n           <colgroup>\n            <col style=\"width:25%\" />\n            <col style=\"width:35%\" />\n            <col style=\"width:15%;\" />\n            <col style=\"width:25%\" />\n        </colgroup>\n    \n            <thead>\n                <tr>\n                    <th colspan=\"4\" style=\"text-align: center; padding-bottom: 10px;\">\n                        <strong>MAIN POLICY ILLUSTRATION</strong>\n                    </th>\n                </tr>\n    \n                 <xsl:if test=\"*/cover/polType='joint'\">\n        <tr>\n                <td class=\"vtop b tleft\" style=\"padding-top: 4px;\">\n                    <b>\n                        Proposal on the life of\n                    </b>\n                </td>\n                <td class=\"vtop b tleft\" style=\"padding-top: 4px;\">\n                    <b>\n                        :\n                        <xsl:value-of select=\"*/cover/proposer/name\" />\n                        AND\n                        <xsl:value-of select=\"*/cover/insured/name\" />\n                    </b>\n                </td>\n                <td class=\"vtop b tleft\" style=\"padding-top: 4px;\">\n                    <b>\n                        Date\n                    </b>\n                </td>\n                <td class=\"vtop b tleft\" style=\"padding-top: 4px;\">\n                    <b>\n                        :\n                        <xsl:value-of select=\"*/cover/genDate\" />\n                    </b>\n                </td>\n            </tr>\n            <tr>\n                <td class=\"vtop b tleft\">\n                    <b>\n                        <xsl:value-of select=\"*/cover/proposer/name\" />\n                        Gender\n                    </b>\n                </td>\n                <td class=\"vtop b tleft\">\n                    <b>\n                        :\n                        <xsl:value-of select=\"*/cover/proposer/gender\" />\n                        (\n                        <xsl:value-of select=\"*/cover/proposer/smoking\" />\n                        )\n                    </b>\n                </td>\n                <td class=\"vtop b tleft\">\n                    <b>\n                        Age\n                    </b>\n                </td>\n                <td class=\"vtop b tleft\">\n                    <b>\n                        :\n                        <xsl:value-of select=\"*/cover/proposer/age\" />\n                        (As At\n                        <xsl:value-of select=\"*/cover/genDate\" />\n                        )\n                    </b>\n                </td>\n            </tr>\n            <tr>\n                <td class=\"vtop b tleft\">\n                    <b>\n                        <xsl:value-of select=\"*/cover/insured/name\" />\n                        Gender\n                    </b>\n                </td>\n                <td class=\"vtop b tleft\">\n                    <b>\n                        :\n                        <xsl:value-of select=\"*/cover/insured/gender\" />\n                        (\n                        <xsl:value-of select=\"*/cover/insured/smoking\" />\n                        )\n                    </b>\n                </td>\n                <td class=\"vtop b tleft\">\n                    <b>\n                        Age\n                    </b>\n                </td>\n                <td class=\"vtop b tleft\">\n                    <b>\n                        :\n                        <xsl:value-of select=\"*/cover/insured/age\" />\n                        (As At\n                        <xsl:value-of select=\"*/cover/genDate\" />\n                        )\n                    </b>\n                </td>\n            </tr>\n        </xsl:if>\n\n        <xsl:if test=\"*/cover/polType='single'\">\n        <tr>\n            <td class=\"vtop b tleft\">Proposal on the life of </td>\n            <td class=\"vtop b tleft\">: <span><xsl:value-of select=\"*/cover/insured/name\"/></span> </td>\n            <td class=\"vtop b tleft\">Date</td>\n            <td class=\"vtop b tleft\">:\n                <xsl:value-of select=\"*/cover/genDate\" />\n            </td>\n        </tr>\n        <tr>\n            <td class=\"vtop b tleft\">Gender</td>\n            <td class=\"vtop b tleft\">:\n                <xsl:value-of select=\"*/cover/insured/gender\" /> \n                (<xsl:value-of select=\"*/cover/insured/smoking\" />)</td>\n            <td class=\"vtop b tleft\">Age</td>\n            <td class=\"vtop b tleft\">:\n                <xsl:value-of select=\"*/cover/insured/age\" /> (as at\n                <xsl:value-of select=\"*/cover/riskCommenDate\" />)</td>\n        </tr>\n        </xsl:if>\n                \n                <tr>\n                    <td class=\"vtop b tleft\">Initial Premium</td>\n                    <td class=\"vtop b tleft\">:\n                        <xsl:value-of select=\"*/cover/initPremiumTop\" /> \n                    </td>\n                    <td class=\"vtop b tleft\" style=\"padding-right: 10px;\">Sum Assured\n                    </td>\n                    <td class=\"vtop b tleft\">:\n                        <xsl:value-of select=\"*/cover/sumAssuredTop\" />\n                    </td>\n                </tr>\n\n                <tr>\n                    <td class=\"vtop b tleft\">Policy Currency</td>\n                    <td class=\"vtop b tleft\" colspan=\"3\">:\n                        <xsl:value-of select=\"*/cover/ccy\" /> \n                    </td>\n                </tr>\n\n                <tr style=\"border-bottom: solid 1pt black\">\n                    <th colspan=\"4\">\n                        <br/>\n                    </th>\n                </tr>\n    \n            </thead>\n    \n            <tbody>\n                <tr>\n                    <td colspan=\"4\">\n                        <div id=\"pageDB\">\n                              <xsl:if test=\"count(*/illustration/illustrationIRR_High3) >0\">\n                            <div class=\"emptyspace10\"></div>\n    <div>This illustration assumes that your policy performance has deviated from your Chosen Investment Rate of Return of \n                                <xsl:value-of select=\"*/cover/in_IRR\" /> and performs at 8.0% instead. This illustration also assumes no partial \n                                withdrawals and additional premiums. Fees illustrated are a sum of Establishment Fee, Policy Fee and Ongoing Administration Fee</div>\n                            <div class=\"emptyspace10\"></div>\n                             </xsl:if>\n                            <div class=\"emptyspace10\"></div>\n                            <xsl:if test=\"(*/cover/polType='joint') and count(*/illustration/illustrationIRR_High3) >0\">\n                            <table class=\"w100\">\n                                <colgroup>\n                                    <col style=\"width:14.3%\" />\n                                    <col style=\"width:14.3%\" />\n                                    <col style=\"width:14.3%\" />\n                                    <col style=\"width:14.3%\" />\n                                    <col style=\"width:14.3%\" />\n                                    <col style=\"width:14.3%\" />\n                                    <col style=\"width:14.2%\" />\n                                </colgroup>\n    \n                                <thead>\n                                    <tr>\n                                        <th colspan=\"1\" class=\"vtop pd2 noBold\">\n                                        </th>\n                                        <th colspan=\"6\" class=\"bgblack tcwhite\">Illustration at Investment Rate of Return of 8.0%</th>\n                                    </tr>\n                                    <tr>\n                                        <th class=\"vtop pd2\">\n                                            End of\n                                            <br/>Policy\n                                            <br/>Year\n                                        </th>\n                                        <th class=\"vtop pd2\">\n                                            <br/>LA1 Age/\n                                            <br/>LA2 Age\n                                        </th>\n                                        \n                                        <th class=\"vtop pd2\">\n                                            Policy Fund\n                                            <br/>Value\n                                            <br/>(<xsl:value-of select=\"*/cover/ccySign\" />)\n                                        </th>\n                                        <th class=\"vtop pd2\">\n                                            Death\n                                            <br/>Benefit\n                                            <br/>(<xsl:value-of select=\"*/cover/ccySign\" />)\n                                        </th>\n                                        <th class=\"vtop pd2\">\n                                            Surrender\n                                            <br/>Value\n                                            <br/>(<xsl:value-of select=\"*/cover/ccySign\" />)\n                                        </th>\n                                        <th class=\"vtop pd2\">\n                                            <br/>Fees\n                                            <br/>(<xsl:value-of select=\"*/cover/ccySign\" />)\n                                        </th>\n                                        <th class=\"vtop pd2\">\n                                            Insurance\n                                            <br/>Charge\n                                            <br/>(<xsl:value-of select=\"*/cover/ccySign\" />)\n                                        </th>\n                                    </tr>\n                                    <tr>\n                                        <th colspan=\"7\" class=\"vtop pd2 noBold\"><div class=\"sectionSpace\" /></th>\n                                    </tr>\n                                </thead>\n    \n                                <tbody>\n                                    <xsl:for-each select=\"*/illustration/illustrationIRR_High3\">\n                                        <tr>\n                                            <td class=\"tdCol\" style=\"text-align: center;\">\n                                                <xsl:value-of select=\"policyYear\" />\n                                            </td>\n                                            <td class=\"tdCol\" style=\"text-align: center;\">\n                                                <xsl:value-of select=\"LA12age\" />\n                                            </td>\n                                            <td class=\"tdCol\" style=\"text-align: center;\">\n                                                <xsl:value-of select=\"polFundValueUI\" />\n                                            </td>\n                                            <td class=\"tdCol\" style=\"text-align: center;\">\n                                                <xsl:value-of select=\"deathBenefitUI\" />\n                                            </td>\n                                            <td class=\"tdCol\" style=\"text-align: center;\">\n                                                <xsl:value-of select=\"surrenderValueUI\" />\n                                            </td>\n                                            <td class=\"tdCol\" style=\"text-align: center;\">\n                                                <xsl:value-of select=\"fees\" />\n                                            </td>\n                                            <td class=\"tdCol\" style=\"text-align: center;\">\n                                                <xsl:value-of select=\"InsuranceCharge\" />\n                                            </td>\n                                        </tr>\n                                    </xsl:for-each>\n                                </tbody>\n                            </table>\n                            </xsl:if>\n                            <xsl:if test=\"(*/cover/polType='single') and count(*/illustration/illustrationIRR_High3) > 0\">\n                            <table class=\"w100\">\n                                <colgroup>\n                                    <col style=\"width:16.7%\" />\n                                    <col style=\"width:16.7%\" />\n                                    <col style=\"width:16.7%\" />\n                                    <col style=\"width:16.7%\" />\n                                    <col style=\"width:16.7%\" />\n                                    <col style=\"width:16.5%\" />\n                                </colgroup>\n    \n                                <thead>\n                                    <tr>\n                                        <th colspan=\"1\" class=\"vtop pd2 noBold\">\n                                        </th>\n                                        <th colspan=\"5\" class=\"bgblack tcwhite\">Illustration at Investment Rate of Return of 8.0%</th>\n                                    </tr>\n                                    <tr>\n                                        <th class=\"vtop pd2\">\n                                            End of\n                                            <br/>Policy\n                                            <br/>Year/Age\n                                        </th>\n\n                                        <th class=\"vtop pd2\">\n                                            Policy Fund\n                                            <br/>Value\n                                            <br/>(<xsl:value-of select=\"*/cover/ccySign\" />)\n                                        </th>\n                                        <th class=\"vtop pd2\">\n                                            Death\n                                            <br/>Benefit\n                                            <br/>(<xsl:value-of select=\"*/cover/ccySign\" />)\n                                        </th>\n                                        <th class=\"vtop pd2\">\n                                            Surrender\n                                            <br/>Value\n                                            <br/>(<xsl:value-of select=\"*/cover/ccySign\" />)\n                                        </th>\n                                        <th class=\"vtop pd2\">\n                                            <br/>Fees\n                                            <br/>(<xsl:value-of select=\"*/cover/ccySign\" />)\n                                        </th>\n                                        <th class=\"vtop pd2\">\n                                            Insurance\n                                            <br/>Charge\n                                            <br/>(<xsl:value-of select=\"*/cover/ccySign\" />)\n                                        </th>\n                                    </tr>\n                                    <tr>\n                                        <th colspan=\"6\" class=\"vtop pd2 noBold\"><div class=\"sectionSpace\" /></th>\n                                    </tr>\n                                </thead>\n    \n                                <tbody>\n                                    <xsl:for-each select=\"*/illustration/illustrationIRR_High3\">\n                                        <tr>\n                                            <td class=\"tdCol\" style=\"text-align: center;\">\n                                                <xsl:value-of select=\"endYearAge\" />\n                                            </td>\n                                            <td class=\"tdCol\" style=\"text-align: center;\">\n                                                <xsl:value-of select=\"polFundValueUI\" />\n                                            </td>\n                                            <td class=\"tdCol\" style=\"text-align: center;\">\n                                                <xsl:value-of select=\"deathBenefitUI\" />\n                                            </td>\n                                            <td class=\"tdCol\" style=\"text-align: center;\">\n                                                <xsl:value-of select=\"surrenderValueUI\" />\n                                            </td>\n                                            <td class=\"tdCol\" style=\"text-align: center;\">\n                                                <xsl:value-of select=\"fees\" />\n                                            </td>\n                                            <td class=\"tdCol\" style=\"text-align: center;\">\n                                                <xsl:value-of select=\"InsuranceCharge\" />\n                                            </td>\n                                        </tr>\n                                    </xsl:for-each>\n                                </tbody>\n                            </table>\n                            </xsl:if>\n    \n                            <div class=\"emptyspace10\"></div>\n                            <div class=\"emptyspace10\"></div>\n                            <div class=\"emptyspace10\"></div>\n                            <xsl:if test=\"*/illustration/showTextThisPage3='true'\">\n                            <table class=\"w100\">\n                                <tr>\n                                    <td class=\"vtop b tleft\">Illustrated Lapse Disclosure</td>\n                                </tr>\n                                <xsl:if test=\"*/cover/lapseDisclosure = 0\">\n                                    <tr>\n                                        <td class=\"vtop  tleft\">Under 8.0% Illustrated Investment Rate of Return, your policy is illustrated to have no lapse from insufficient Policy Fund Value.</td>\n                                    </tr>\n                                </xsl:if>\n                                <xsl:if test=\"*/cover/lapseDisclosure > 0\">\n                                    <tr>\n                                        <td class=\"vtop  tleft\">Under 8.0% Illustrated Investment Rate of Return, the Surrender Value is illustrated to sustain your policy up to end of policy year <xsl:value-of select=\"*/cover/lapseDisclosure\" /> before lapsing due to insufficient Policy Fund Value. </td>\n                                    </tr>\n                                </xsl:if>\n                                <tr>\n                                    <td class=\"vtop  tleft\">\n                                        <div class=\"emptyspace0\"></div>\n                                    </td>\n                                </tr>\n<xsl:if test=\"*/illustration/illustTextExtra ='true'\">\n    <tr>\n\t\t<td class=\"vtop  tleft\">To ensure your policy can continue to stay in force, you may contribute Additional Premiums, or reduce your Sum Assured, at any time before your Policy Fund Value \n            becomes zero.</td>\n\t</tr>\n</xsl:if>\n                            </table>\t\n                            </xsl:if>\n                        </div>\n    \n                    </td>\n                </tr>\n            </tbody>\n        </table>\n    </div>\n    \n    \n    \n    ",
            "<div class=\"global_main\">\n    \n        <table class=\"w100\">\n           <colgroup>\n            <col style=\"width:25%\" />\n            <col style=\"width:35%\" />\n            <col style=\"width:15%;\" />\n            <col style=\"width:25%\" />\n        </colgroup>\n    \n            <thead>\n                <tr>\n                    <th colspan=\"4\" style=\"text-align: center; padding-bottom: 10px;\">\n                        <strong>MAIN POLICY ILLUSTRATION</strong>\n                    </th>\n                </tr>\n    \n                 <xsl:if test=\"*/cover/polType='joint'\">\n        <tr>\n                <td class=\"vtop b tleft\" style=\"padding-top: 4px;\">\n                    <b>\n                        Proposal on the life of\n                    </b>\n                </td>\n                <td class=\"vtop b tleft\" style=\"padding-top: 4px;\">\n                    <b>\n                        :\n                        <xsl:value-of select=\"*/cover/proposer/name\" />\n                        AND\n                        <xsl:value-of select=\"*/cover/insured/name\" />\n                    </b>\n                </td>\n                <td class=\"vtop b tleft\" style=\"padding-top: 4px;\">\n                    <b>\n                        Date\n                    </b>\n                </td>\n                <td class=\"vtop b tleft\" style=\"padding-top: 4px;\">\n                    <b>\n                        :\n                        <xsl:value-of select=\"*/cover/genDate\" />\n                    </b>\n                </td>\n            </tr>\n            <tr>\n                <td class=\"vtop b tleft\">\n                    <b>\n                        <xsl:value-of select=\"*/cover/proposer/name\" />\n                        Gender\n                    </b>\n                </td>\n                <td class=\"vtop b tleft\">\n                    <b>\n                        :\n                        <xsl:value-of select=\"*/cover/proposer/gender\" />\n                        (\n                        <xsl:value-of select=\"*/cover/proposer/smoking\" />\n                        )\n                    </b>\n                </td>\n                <td class=\"vtop b tleft\">\n                    <b>\n                        Age\n                    </b>\n                </td>\n                <td class=\"vtop b tleft\">\n                    <b>\n                        :\n                        <xsl:value-of select=\"*/cover/proposer/age\" />\n                        (As At\n                        <xsl:value-of select=\"*/cover/genDate\" />\n                        )\n                    </b>\n                </td>\n            </tr>\n            <tr>\n                <td class=\"vtop b tleft\">\n                    <b>\n                        <xsl:value-of select=\"*/cover/insured/name\" />\n                        Gender\n                    </b>\n                </td>\n                <td class=\"vtop b tleft\">\n                    <b>\n                        :\n                        <xsl:value-of select=\"*/cover/insured/gender\" />\n                        (\n                        <xsl:value-of select=\"*/cover/insured/smoking\" />\n                        )\n                    </b>\n                </td>\n                <td class=\"vtop b tleft\">\n                    <b>\n                        Age\n                    </b>\n                </td>\n                <td class=\"vtop b tleft\">\n                    <b>\n                        :\n                        <xsl:value-of select=\"*/cover/insured/age\" />\n                        (As At\n                        <xsl:value-of select=\"*/cover/genDate\" />\n                        )\n                    </b>\n                </td>\n            </tr>\n        </xsl:if>\n\n        <xsl:if test=\"*/cover/polType='single'\">\n        <tr>\n            <td class=\"vtop b tleft\">Proposal on the life of </td>\n            <td class=\"vtop b tleft\">: <span><xsl:value-of select=\"*/cover/insured/name\"/></span> </td>\n            <td class=\"vtop b tleft\">Date</td>\n            <td class=\"vtop b tleft\">:\n                <xsl:value-of select=\"*/cover/genDate\" />\n            </td>\n        </tr>\n        <tr>\n            <td class=\"vtop b tleft\">Gender</td>\n            <td class=\"vtop b tleft\">:\n                <xsl:value-of select=\"*/cover/insured/gender\" /> \n                (<xsl:value-of select=\"*/cover/insured/smoking\" />)</td>\n            <td class=\"vtop b tleft\">Age</td>\n            <td class=\"vtop b tleft\">:\n                <xsl:value-of select=\"*/cover/insured/age\" /> (as at\n                <xsl:value-of select=\"*/cover/riskCommenDate\" />)</td>\n        </tr>\n        </xsl:if>\n                \n                <tr>\n                    <td class=\"vtop b tleft\">Initial Premium</td>\n                    <td class=\"vtop b tleft\">:\n                        <xsl:value-of select=\"*/cover/initPremiumTop\" /> \n                    </td>\n                    <td class=\"vtop b tleft\" style=\"padding-right: 10px;\">Sum Assured\n                    </td>\n                    <td class=\"vtop b tleft\">:\n                        <xsl:value-of select=\"*/cover/sumAssuredTop\" />\n                    </td>\n                </tr>\n\n                <tr>\n                    <td class=\"vtop b tleft\">Policy Currency</td>\n                    <td class=\"vtop b tleft\" colspan=\"3\">:\n                        <xsl:value-of select=\"*/cover/ccy\" /> \n                    </td>\n                </tr>\n\n                <tr style=\"border-bottom: solid 1pt black\">\n                    <th colspan=\"4\">\n                        <br/>\n                    </th>\n                </tr>\n    \n            </thead>\n    \n            <tbody>\n                <tr>\n                    <td colspan=\"4\">\n                        <div id=\"pageDB\">\n                              <xsl:if test=\"count(*/illustration/illustrationIRR_High4) >0\">\n                            <div class=\"emptyspace10\"></div>\n    <div>This illustration assumes that your policy performance has deviated from your Chosen Investment Rate of Return of \n                                <xsl:value-of select=\"*/cover/in_IRR\" /> and performs at 8.0% instead. This illustration also assumes no partial \n                                withdrawals and additional premiums. Fees illustrated are a sum of Establishment Fee, Policy Fee and Ongoing Administration Fee</div>\n                            <div class=\"emptyspace10\"></div>\n                             </xsl:if>\n                            <div class=\"emptyspace10\"></div>\n                            <xsl:if test=\"(*/cover/polType='joint') and count(*/illustration/illustrationIRR_High4) >0\">\n                            <table class=\"w100\">\n                                <colgroup>\n                                    <col style=\"width:14.3%\" />\n                                    <col style=\"width:14.3%\" />\n                                    <col style=\"width:14.3%\" />\n                                    <col style=\"width:14.3%\" />\n                                    <col style=\"width:14.3%\" />\n                                    <col style=\"width:14.3%\" />\n                                    <col style=\"width:14.2%\" />\n                                </colgroup>\n    \n                                <thead>\n                                    <tr>\n                                        <th colspan=\"1\" class=\"vtop pd2 noBold\">\n                                        </th>\n                                        <th colspan=\"6\" class=\"bgblack tcwhite\">Illustration at Investment Rate of Return of 8.0%</th>\n                                    </tr>\n                                    <tr>\n                                        <th class=\"vtop pd2\">\n                                            End of\n                                            <br/>Policy\n                                            <br/>Year\n                                        </th>\n                                        <th class=\"vtop pd2\">\n                                            <br/>LA1 Age/\n                                            <br/>LA2 Age\n                                        </th>\n                                        \n                                        <th class=\"vtop pd2\">\n                                            Policy Fund\n                                            <br/>Value\n                                            <br/>(<xsl:value-of select=\"*/cover/ccySign\" />)\n                                        </th>\n                                        <th class=\"vtop pd2\">\n                                            Death\n                                            <br/>Benefit\n                                            <br/>(<xsl:value-of select=\"*/cover/ccySign\" />)\n                                        </th>\n                                        <th class=\"vtop pd2\">\n                                            Surrender\n                                            <br/>Value\n                                            <br/>(<xsl:value-of select=\"*/cover/ccySign\" />)\n                                        </th>\n                                        <th class=\"vtop pd2\">\n                                            <br/>Fees\n                                            <br/>(<xsl:value-of select=\"*/cover/ccySign\" />)\n                                        </th>\n                                        <th class=\"vtop pd2\">\n                                            Insurance\n                                            <br/>Charge\n                                            <br/>(<xsl:value-of select=\"*/cover/ccySign\" />)\n                                        </th>\n                                    </tr>\n                                    <tr>\n                                        <th colspan=\"7\" class=\"vtop pd2 noBold\"><div class=\"sectionSpace\" /></th>\n                                    </tr>\n                                </thead>\n    \n                                <tbody>\n                                    <xsl:for-each select=\"*/illustration/illustrationIRR_High4\">\n                                        <tr>\n                                            <td class=\"tdCol\" style=\"text-align: center;\">\n                                                <xsl:value-of select=\"policyYear\" />\n                                            </td>\n                                            <td class=\"tdCol\" style=\"text-align: center;\">\n                                                <xsl:value-of select=\"LA12age\" />\n                                            </td>\n                                            <td class=\"tdCol\" style=\"text-align: center;\">\n                                                <xsl:value-of select=\"polFundValueUI\" />\n                                            </td>\n                                            <td class=\"tdCol\" style=\"text-align: center;\">\n                                                <xsl:value-of select=\"deathBenefitUI\" />\n                                            </td>\n                                            <td class=\"tdCol\" style=\"text-align: center;\">\n                                                <xsl:value-of select=\"surrenderValueUI\" />\n                                            </td>\n                                            <td class=\"tdCol\" style=\"text-align: center;\">\n                                                <xsl:value-of select=\"fees\" />\n                                            </td>\n                                            <td class=\"tdCol\" style=\"text-align: center;\">\n                                                <xsl:value-of select=\"InsuranceCharge\" />\n                                            </td>\n                                        </tr>\n                                    </xsl:for-each>\n                                </tbody>\n                            </table>\n                            </xsl:if>\n                            <xsl:if test=\"(*/cover/polType='single') and count(*/illustration/illustrationIRR_High4) > 0\">\n                            <table class=\"w100\">\n                                <colgroup>\n                                    <col style=\"width:16.7%\" />\n                                    <col style=\"width:16.7%\" />\n                                    <col style=\"width:16.7%\" />\n                                    <col style=\"width:16.7%\" />\n                                    <col style=\"width:16.7%\" />\n                                    <col style=\"width:16.5%\" />\n                                </colgroup>\n    \n                                <thead>\n                                    <tr>\n                                        <th colspan=\"1\" class=\"vtop pd2 noBold\">\n                                        </th>\n                                        <th colspan=\"5\" class=\"bgblack tcwhite\">Illustration at Investment Rate of Return of 8.0%</th>\n                                    </tr>\n                                    <tr>\n                                        <th class=\"vtop pd2\">\n                                            End of\n                                            <br/>Policy\n                                            <br/>Year/Age\n                                        </th>\n\n                                        <th class=\"vtop pd2\">\n                                            Policy Fund\n                                            <br/>Value\n                                            <br/>(<xsl:value-of select=\"*/cover/ccySign\" />)\n                                        </th>\n                                        <th class=\"vtop pd2\">\n                                            Death\n                                            <br/>Benefit\n                                            <br/>(<xsl:value-of select=\"*/cover/ccySign\" />)\n                                        </th>\n                                        <th class=\"vtop pd2\">\n                                            Surrender\n                                            <br/>Value\n                                            <br/>(<xsl:value-of select=\"*/cover/ccySign\" />)\n                                        </th>\n                                        <th class=\"vtop pd2\">\n                                            <br/>Fees\n                                            <br/>(<xsl:value-of select=\"*/cover/ccySign\" />)\n                                        </th>\n                                        <th class=\"vtop pd2\">\n                                            Insurance\n                                            <br/>Charge\n                                            <br/>(<xsl:value-of select=\"*/cover/ccySign\" />)\n                                        </th>\n                                    </tr>\n                                    <tr>\n                                        <th colspan=\"6\" class=\"vtop pd2 noBold\"><div class=\"sectionSpace\" /></th>\n                                    </tr>\n                                </thead>\n    \n                                <tbody>\n                                    <xsl:for-each select=\"*/illustration/illustrationIRR_High4\">\n                                        <tr>\n                                            <td class=\"tdCol\" style=\"text-align: center;\">\n                                                <xsl:value-of select=\"endYearAge\" />\n                                            </td>\n                                            <td class=\"tdCol\" style=\"text-align: center;\">\n                                                <xsl:value-of select=\"polFundValueUI\" />\n                                            </td>\n                                            <td class=\"tdCol\" style=\"text-align: center;\">\n                                                <xsl:value-of select=\"deathBenefitUI\" />\n                                            </td>\n                                            <td class=\"tdCol\" style=\"text-align: center;\">\n                                                <xsl:value-of select=\"surrenderValueUI\" />\n                                            </td>\n                                            <td class=\"tdCol\" style=\"text-align: center;\">\n                                                <xsl:value-of select=\"fees\" />\n                                            </td>\n                                            <td class=\"tdCol\" style=\"text-align: center;\">\n                                                <xsl:value-of select=\"InsuranceCharge\" />\n                                            </td>\n                                        </tr>\n                                    </xsl:for-each>\n                                </tbody>\n                            </table>\n                            </xsl:if>\n    \n                            <div class=\"emptyspace10\"></div>\n                            <div class=\"emptyspace10\"></div>\n                            <div class=\"emptyspace10\"></div>\n                            <xsl:if test=\"*/illustration/showTextThisPage4='true'\">\n                            <table class=\"w100\">\n                                <tr>\n                                    <td class=\"vtop b tleft\">Illustrated Lapse Disclosure</td>\n                                </tr>\n                                <xsl:if test=\"*/cover/lapseDisclosure = 0\">\n                                    <tr>\n                                        <td class=\"vtop  tleft\">Under 8.0% Illustrated Investment Rate of Return, your policy is illustrated to have no lapse from insufficient Policy Fund Value.</td>\n                                    </tr>\n                                </xsl:if>\n                                <xsl:if test=\"*/cover/lapseDisclosure > 0\">\n                                    <tr>\n                                        <td class=\"vtop  tleft\">Under 8.0% Illustrated Investment Rate of Return, the Surrender Value is illustrated to sustain your policy up to end of policy year <xsl:value-of select=\"*/cover/lapseDisclosure\" /> before lapsing due to insufficient Policy Fund Value. </td>\n                                    </tr>\n                                </xsl:if>\n                                <tr>\n                                    <td class=\"vtop  tleft\">\n                                        <div class=\"emptyspace0\"></div>\n                                    </td>\n                                </tr>\n<xsl:if test=\"*/illustration/illustTextExtra ='true'\">\n    <tr>\n\t\t<td class=\"vtop  tleft\">To ensure your policy can continue to stay in force, you may contribute Additional Premiums, or reduce your Sum Assured, at any time before your Policy Fund Value \n            becomes zero.</td>\n\t</tr>\n</xsl:if>\n                            </table>\t\n                            </xsl:if>\n                        </div>\n    \n                    </td>\n                </tr>\n            </tbody>\n        </table>\n    </div>\n    \n    \n    \n    "
        ],
        "zh-Hant": []
    },
    "type": "pdfTemplate",
    "version": 1
}