
{
    "compCode"  : "08",
    "type"      : "material",
    "section"   : "Proposal Forms",
    "sectionId" : "propform",
    "name"      : "Proposal for AXA Criticare (072018)",
    "id"        : "proposal_form03_1",
    "effDate"   : "2017-05-22 14:10:34",
    "expDate"   : "2018-05-22 14:19:47"  
}