{
  "fromTime": "2019-11-24 00:00:00",
  "toTime": "2019-11-24 23:59:59",
  "scheduleCron": "0 22 * 1-12 *",
  "jobDetailsDocId":"GeneralInvalidationJob",
  "impactedListDocId":"InvalidationImpactedList",
  "messages":[
    {
      "messageId": "invalidateMessage_Release21CR236",
      "message": "AXA Super CritiCare is now available on EASE!<br/>Early Stage Criticare and the following 3 funds are now closed. Any existing cases that are not fully signed are no longer valid.<br/><br/>• Janus Henderson Global Technology Fund (SGD)<br/>• Janus Henderson Global Property Equities Fund (SGD)<br/>• Janus Henderson Asia Pacific Property Equities (SGD)",
      "messageGroup": "invalidateMsg",
      "messageGroupPriority": "1",
      "messageType": "ALL_AGENTS"
    }
  ],
  "jobs":[
    {
      "id": "inflightJobRelease21CR236",
      "ruleIds":["invalidateESC","invalidateFunds"],
      "rulesParamsMapping":{
        "invalidateESC":{
          "functId": "invalidateProductsRule",
          "productCodes":["ESC"],
          "partiallySignedOnly": true
        },
        "invalidateFunds":{
          "functId": "invalidateProductsByFundRule",
          "fundCodes":["HGTE", "HGPE", "HAPP"],
          "partiallySignedOnly": true
        }
      },
      "rulesCombinations":[
        {
          "combinationId": "invalidateProductsCombine",
          "ruleIdsLookUp":["invalidateESC","invalidateFunds"],
          "lookUpFormula": "#1 || #2",
          "expirePolicy": false
        }
      ]
    }
  ]
}

