
{
    "compCode"  : "08",
    "type"      : "material",
    "section"   : "General Provision",
    "sectionId" : "gprov",
    "name"      : "Joint Life Decreasing Term Assurance RP GP Nov 2018",
    "id"        : "genprov52_1",
    "effDate"   : "2017-05-22 14:10:34",
    "expDate"   : "2020-02-17 17:35:01"  
}