{
  "detailSeq": 1,
  "id": "planMenu",
  "type": "menuItem",
  "title": "",
  "items": [
    {
      "id": "clientChoiceSelect",
      "type": "LABEL",
      "style": {"display":"none"}
    },
    {
      "id": "recommendTitle",
      "type": "HEADER",
      "title": "My Financial Consultant's recommendations"
    },
    {
      "id": "proposerAndLifeAssuredName",
      "type": "LABEL",
      "hideTitle": true,
      "style":  {"height": 36, "fontWeight": 600}
    },
    {
      "id": "basicPlanName",
      "type": "LABEL",
      "hideTitle": true,
      "style":  {"height": 36, "fontWeight": 600}
    },
    {
      "id": "ridersName",
      "type": "LABEL",
      "hideTitle": true,
      "style":  {"height": 36, "fontWeight": 600}
    },

    {
      "id": "staticInspireDuoText",
      "type": "PARAGRAPH",
      "title": "",
      "style": {
        "fontStyle": "italic"
      },
      "trigger": {
        "id": "hasIFAST,baseProductCode,paymentMethod, channel",
        "type": "dynamicCondition",
        "value": "#1=='Y' && #2=='AWICA' && #3=='cash' && ('AGENCY' == #4 || 'SINGPOST' == #4 || 'DIRECT' == #4 || 'FUSION' == #4)"
      },
      "content": "It is advisable to propose Unit Trust if one of the client’s need is wealth accumulation and AXA Wealth Invest (SP-Cash) is one of the recommended product"
    },


    {
      "id": "recommendReason",
      "type": "TEXTAREA",
      "title": "Reason for Plan and Rider(s) recommendation",
      "maxLength": 5000,
      "mandatory": true,
      "disabled": false,
      "placeholder": {
        "en": "Please justify"
      },
      "hints": {
        "en": "<ul><li style=\"list-style:disc\">State how the plan meets client's need(s)</li><li style=\"list-style:disc\">State how client will be able to service the premiums if the premium payment term (i) exceeds the current statutory age of 62 for employment or (ii) exceeds the client's indicated retirement age (if earlier than age 62)</li><li style=\"list-style:disc\">Policy Term vs when funds are needed</li></ul>"
      },
      "align": "left"
    },
    {
      "id": "recommendBenefit",
      "type": "TEXTAREA",
      "title": "Benefits for Plan and Rider(s) recommended",
      "maxLength": 5000,
      "mandatory": true,
      "disabled": false,
      "resetDefaultValue": true,
      "placeholder": {
        "en": "Please justify"
      },
      "align": "left"
    },
    {
      "id": "recommendLimit",
      "type": "TEXTAREA",
      "title": "Limitation/Deviation of Plan and Rider(s) recommended",
      "maxLength": 5000,
      "mandatory": true,
      "disabled": false,
      "resetDefaultValue": true,
      "placeholder": {
        "en": "Please justify"
      },
      "align": "left"
    },
    {
      "type": "BLOCK",
      "title": "",
      "trigger": {
        "id": "clientChoiceSelect",
        "type": "showIfEqual",
        "value": "Y"
      },
      "items": [
        {
          "id": "ropTitle",
          "type": "HEADER",
          "title": "Replacement of Policy (ROP)/Switching of Products"
        },
        {
          "id": "ropQ1",
          "type": "TEXTSELECTION",
          "isSingleSelect": true,
          "title": "Do you intend to purchase a policy to replace (in part or full) any existing or recently terminated insurance policy, or other investment product from AXA Insurance Pte Ltd or any other Financial Institution?",
          "mandatory": true,
          "disabled": false,
          "options": [
            {
              "title": "Yes",
              "value": "Y"
            },
            {
              "title": "No",
              "value": "N"
            }
          ]
        },
        {
          "type": "BLOCK",
          "trigger": [
            {
              "id": "ropQ1",
              "type": "showIfEqual",
              "value": "Y"
            }
          ],
          "items": [
            {
              "id": "ropQ1sub1",
              "type": "TEXTSELECTION",
              "isSingleSelect": true,
              "title": "i) Is the replacement of policy advised by the financial consultant?",
              "mandatory": true,
              "disabled": false,
              "options": [
                {
                  "title": "Yes",
                  "value": "Y"
                },
                {
                  "title": "No",
                  "value": "N"
                }
              ]
            },
            {
              "id": "ropQ1sub2",
              "type": "TEXTSELECTION",
              "isSingleSelect": true,
              "title": "ii) Has your financial consultant explained the implications/impact of a policy replacement",
              "mandatory": true,
              "disabled": false,
              "options": [
                {
                  "title": "Yes",
                  "value": "Y"
                },
                {
                  "title": "No",
                  "value": "N"
                }
              ]
            },
            {
              "id": "ropQ1sub3",
              "type": "TEXTAREA",
              "title": "Basis of Policy Replacement / Switching",
              "mandatory": true,
              "disabled": false,
              "maxLength": 3000
            },
            {
              "id": "ropWarning",
              "type": "PARAGRAPH",
              "title": "WARNING NOTE:",
              "style": {
                "color": "red"
              },
              "content": "<p style='padding: 0px; line-height: 16px'>It is usually disadvantageous to replace an existing life insurance policy or other investment product with a new one. Some of the implications and impact:</p><p style='padding: 0px; line-height: 16px'>a) You may incur transaction costs without gaining any real benefit from the replacement.</p><p style='padding: 0px; line-height: 16px'>b) You may incur penalties for terminating any of your existing policies.</p><p style='padding: 0px; line-height: 16px'>c) You may not be insurable at standard terms.</p><p style='padding: 0px; line-height: 16px'>d) The replacement plan may offer a lower level of benefit at a higher cost or same cost, or offer the same level of benefit at a higher cost.</p><p style='padding: 0px; line-height: 16px'>e) The replacement plan may be less suitable and the terms and conditions may differ.</p><p style='padding: 0px; line-height: 16px'>f) There may be other options available besides policy replacement (e.g. free switching facilities for investment policy)</p>"
            },
            {
              "id": "policyTable",
              "type": "TABLEVIEW",
              "title": "policyTable",
              "items": [
                {
                  "type": "TABLEVIEW-HEADER",
                  "items": [
                    {
                      "id": "headerLife",
                      "title": "Life"
                    },
                    {
                      "id": "headerTpd",
                      "title": "TPD"
                    },
                    {
                      "id": "headerCi",
                      "title": "CI"
                    },
                    {
                      "id": "headerPaadb",
                      "title": "PA/ADB"
                    },
                    {
                      "id": "headerTotalPremiums",
                      "title": "Total Annual Premiums"
                    }
                  ]
                },
                {
                  "type": "TABLEVIEW-SUBHEADER",
                  "title": "Existing policies",
                  "colSpan": 5
                },
                {
                  "type": "TABLEVIEW-DATA",
                  "items": [
                    {
                      "id": "existLife",
                      "type": "READONLY",
                      "subType": "CURRENCY",
                      "ccy": "SGD",
                      "decimal": 2,
                      "showHyphenZeroValue": true,
                      "hideTitle": true,
                      "style": {
                        "minWidth": "110px"
                      }
                    },
                    {
                      "id": "existTpd",
                      "type": "READONLY",
                      "subType": "CURRENCY",
                      "ccy": "SGD",
                      "decimal": 2,
                      "showHyphenZeroValue": true,
                      "hideTitle": true,
                      "style": {
                        "minWidth": "110px"
                      }
                    },
                    {
                      "id": "existCi",
                      "type": "READONLY",
                      "subType": "CURRENCY",
                      "ccy": "SGD",
                      "decimal": 2,
                      "showHyphenZeroValue": true,
                      "hideTitle": true,
                      "style": {
                        "minWidth": "110px"
                      }
                    },
                    {
                      "id": "existPaAdb",
                      "type": "READONLY",
                      "subType": "CURRENCY",
                      "ccy": "SGD",
                      "decimal": 2,
                      "showHyphenZeroValue": true,
                      "hideTitle": true,
                      "style": {
                        "minWidth": "110px"
                      }
                    },
                    {
                      "id": "existTotalPrem",
                      "type": "READONLY",
                      "subType": "CURRENCY",
                      "ccy": "SGD",
                      "decimal": 2,
                      "showHyphenZeroValue": true,
                      "hideTitle": true,
                      "style": {
                        "minWidth": "110px"
                      }
                    }
                  ]
                },
                {
                  "type": "TABLEVIEW-SUBHEADER",
                  "title": "Policy to be replaced",
                  "colSpan": 5
                },
                {
                  "type": "TABLEVIEW-DATA",
                  "validation": "function(i,v,rv,vrv){var hasInput = (v.replaceLife || v.replaceTpd || v.replaceCi || v.replacePaAdb); if (!hasInput || (v.replaceLife==0 && v.replaceTpd==0 && v.replaceCi==0 && v.replacePaAdb==0)){return 801;}}",
                  "items": [
                    {
                      "id": "replaceLife",
                      "type": "TEXT",
                      "subType": "CURRENCY",
                      "disabled": false,
                      "placeholder": {
                        "en": "0"
                      },
                      "max": 9999999999
                    },
                    {
                      "id": "replaceTpd",
                      "type": "TEXT",
                      "subType": "CURRENCY",
                      "disabled": false,
                      "placeholder": {
                        "en": "0"
                      },
                      "max": 9999999999
                    },
                    {
                      "id": "replaceCi",
                      "type": "TEXT",
                      "subType": "CURRENCY",
                      "disabled": false,
                      "placeholder": {
                        "en": "0"
                      },
                      "max": 9999999999
                    },
                    {
                      "id": "replacePaAdb",
                      "type": "TEXT",
                      "subType": "CURRENCY",
                      "disabled": false,
                      "placeholder": {
                        "en": "0"
                      },
                      "max": 9999999999
                    },
                    {
                      "id": "replaceTotalPrem",
                      "type": "TEXT",
                      "subType": "CURRENCY",
                      "disabled": false,
                      "placeholder": {
                        "en": "0"
                      },
                      "max": 9999999999
                    }
                  ]
                }
              ]
            }
          ]
        }
      ]
    }
  ]
}
