{
    "allowBackdate": "N",
    "budgetRules": [
        "RP"
    ],
    "compCode": "08",
    "covCode": "WPPT",
    "covName": {
        "en": "Waiver of Premium Plus",
        "zh-Hant": "-"
    },
    "ctyGroup": [
        "*"
    ],
    "currencies": [
        {
            "ccy": [
                "SGD"
            ],
            "country": "*"
        }
    ],
    "dealerGroup": [
        "AGENCY",
        "DIRECT",
        "SINGPOST",
        "FUSION",
        "SYNERGY",
        "BROKER"
    ],
    "effDate": "2017-12-18 16:00:00",
    "entryAge": [
        {
            "country": "*",
            "imaxAge": 60,
            "imaxAgeUnit": "nearestAge",
            "iminAge": "",
            "iminAgeUnit": "na",
            "omaxAge": 60,
            "omaxAgeUnit": "nearestAge",
            "ominAge": 18,
            "ominAgeUnit": "year",
            "sameAsOwner": "N"
        }
    ],
    "expDate": "2118-07-26 16:00:00",
    "formulas": {
        "calcQuotFunc": "",
        "illustrateFunc": "",
        "polTermsFunc": "function (planDetail, quotation) {var opts = [], polTerm = 5, pAge = quotation.pAge; while(polTerm <=30 && pAge + polTerm <= 70){ opts.push({ value: \"yrs\" + polTerm, title: polTerm + \" Years\" }); polTerm++; } return opts;}",
        "premFunc": "",
        "premTermsFunc": "",
        "prepareClassConfig": "",
        "prepareSAPremConfig": "function (planDetail, quotation, planDetails) {planDetail.inputConfig.canViewPremium = false; }",
        "prepareTermConfig": "",
        "saFunc": "",
        "validAfterCalcFunc": "function (quotation, planInfo, planDetail) {if(planInfo.policyTerm){ var year = planInfo.policyTerm.substring(3, planInfo.policyTerm.length); if (year.length < 2) { year = '0' + year; } planInfo.planCode = year + \"WPPT\"; planInfo.policyTermYr = math.number(year); planInfo.premTermYr = math.number(year);}planInfo.premTerm = planInfo.policyTerm;planInfo.premTermDesc = planInfo.polTermDesc;}",
        "validBeforeCalcFunc": "",
        "validQuotFunc": "",
        "willValidQuotFunc": ""
    },
    "genderInd": "*",
    "isMasterData": true,
    "lastUpdatedTime": "2018-09-03T09:09:00.178Z",
    "payModes": [
        {
            "covMonth": 1,
            "default": "",
            "factor": 12,
            "mode": "M",
            "operator": "D"
        },
        {
            "covMonth": 3,
            "default": "",
            "factor": 4,
            "mode": "Q",
            "operator": "D"
        },
        {
            "covMonth": 6,
            "default": "",
            "factor": 2,
            "mode": "S",
            "operator": "D"
        },
        {
            "covMonth": 1,
            "default": "",
            "factor": 1,
            "mode": "A",
            "operator": "D"
        }
    ],
    "planCodeMapping": {
        "planCode": [
            "05WPPT",
            "06WPPT",
            "07WPPT",
            "08WPPT",
            "09WPPT",
            "10WPPT",
            "11WPPT",
            "12WPPT",
            "13WPPT",
            "14WPPT",
            "15WPPT",
            "16WPPT",
            "17WPPT",
            "18WPPT",
            "19WPPT",
            "20WPPT",
            "21WPPT",
            "22WPPT",
            "23WPPT",
            "24WPPT",
            "25WPPT",
            "26WPPT",
            "27WPPT",
            "28WPPT",
            "29WPPT",
            "30WPPT"
        ],
        "polTerm": [
            "5",
            "6",
            "7",
            "8",
            "9",
            "10",
            "11",
            "12",
            "13",
            "14",
            "15",
            "16",
            "17",
            "18",
            "19",
            "20",
            "21",
            "22",
            "23",
            "24",
            "25",
            "26",
            "27",
            "28",
            "29",
            "30"
        ],
        "tpd": [
            "Yes",
            "Yes",
            "Yes",
            "Yes",
            "Yes",
            "Yes",
            "Yes",
            "Yes",
            "Yes",
            "Yes",
            "Yes",
            "Yes",
            "Yes",
            "Yes",
            "Yes",
            "Yes",
            "Yes",
            "Yes",
            "Yes",
            "Yes",
            "Yes",
            "Yes",
            "Yes",
            "Yes",
            "Yes",
            "Yes"
        ]
    },
    "planInd": "R",
    "polMatSameAsPremMat": "N",
    "polMaturities": [],
    "polTermInd": "Y",
    "polTermRule": "na",
    "policyMatSameAsBasic": "N",
    "premMatSameAsBasic": "N",
    "premMatSameAsPolMat": "N",
    "premMaturities": [],
    "premTermInd": "N",
    "premTermRule": "BT",
    "prodFeature": {},
    "prod_summary_1": 1787168,
    "productCategory": "ilp",
    "productLine": "IL",
    "releaseDate": "2018-07-30 02:08:15",
    "remarks": {
        "en": "-"
    },
    "smokeInd": "*",
    "status": "A",
    "type": "product",
    "updatedBy": "mandy",
    "version": 2,
    "wholeLifeInd": "N"
}