{
  "options": {
    "mixed_assets_regional": {
      "title": {
        "en": "Mixed Assets Regional"
      }
    },
    "equity_regional": {
      "title": {
        "en": "Equity Regional"
      }
    },
    "mixed_assets_global": {
      "title": {
        "en": "Mixed Assets Global"
      }
    },
    "equity_global": {
      "title": {
        "en": "Equity Global"
      }
    },
    "bond_sgd": {
      "title": {
        "en": "Bond SGD"
      }
    },
    "bond_singapore": {
      "title": {
        "en": "Bond Singapore"
      }
    },
    "equity_country_emerging": {
      "title": {
        "en": "Equity Country - Emerging"
      }
    },
    "bond_emerging_markets": {
      "title": {
        "en": "Bond Emerging Markets"
      }
    },
    "equity_singapore": {
      "title": {
        "en": "Equity Singapore"
      }
    },
    "bond_global": {
      "title": {
        "en": "Bond Global"
      }
    },
    "equity_emerging_global": {
      "title": {
        "en": "Equity Emerging Global"
      }
    },
    "equity_sector": {
      "title": {
        "en": "Equity Sector"
      }
    },
    "mixed_assets_singapore": {
      "title": {
        "en": "Mixed Assets Singapore"
      }
    },
    "money_market_sgd": {
      "title": {
        "en": "Money Market SGD"
      }
    },
    "alternatives_long_short": {
      "title": {
        "en": "Alternatives Long/Short"
      }
    },
    "alternatives_multi_strategies": {
      "title": {
        "en": "Alternatives Multi Strategies"
      }
    },
    "bond_asia_pacific_ex_japan": {
      "title": {
        "en": "Bond Asia Pacific ex-Japan"
      }
    },
    "bond_asia_pacific_ex_japan_lc": {
      "title": {
        "en": "Bond Asia Pacific ex-Japan LC"
      }
    },
    "bond_global_flexi": {
      "title": {
        "en": "Bond Global Flexi"
      }
    },
    "bond_global_high_yield": {
      "title": {
        "en": "Bond Global High Yield"
      }
    },
    "bond_global_inflation": {
      "title": {
        "en": "Bond Global Inflation"
      }
    },
    "bond_global_preferred_securities": {
      "title": {
        "en": "Bond Global Preferred Securities"
      }
    },
    "bond_short_duration_singapore": {
      "title": {
        "en": "Bond Short Duration Singapore"
      }
    },
    "bond_usd": {
      "title": {
        "en": "Bond USD"
      }
    },
    "equity_asia_pacific": {
      "title": {
        "en": "Equity Asia Pacific"
      }
    },
    "equity_brazil": {
      "title": {
        "en": "Equity Brazil"
      }
    },
    "equity_china": {
      "title": {
        "en": "Equity China"
      }
    },
    "equity_em_asia_pacific_ex_japan": {
      "title": {
        "en": "Equity EM Asia Pacific ex-Japan"
      }
    },
    "equity_em_asia_smaller_companies": {
      "title": {
        "en": "Equity EM Asia Smaller Companies"
      }
    },
    "equity_em_eastern_europe": {
      "title": {
        "en": "Equity EM Eastern Europe"
      }
    },
    "equity_em_latin_america": {
      "title": {
        "en": "Equity EM Latin America"
      }
    },
    "equity_emerging_markets": {
      "title": {
        "en": "Equity Emerging Markets"
      }
    },
    "equity_europe": {
      "title": {
        "en": "Equity Europe"
      }
    },
    "equity_europe_ex_uk": {
      "title": {
        "en": "Equity Europe ex-UK"
      }
    },
    "equity_global_smaller_companies": {
      "title": {
        "en": "Equity Global Smaller Companies"
      }
    },
    "equity_greater_china": {
      "title": {
        "en": "Equity Greater China"
      }
    },
    "equity_india": {
      "title": {
        "en": "Equity India"
      }
    },
    "equity_indonesia": {
      "title": {
        "en": "Equity Indonesia"
      }
    },
    "equity_japan": {
      "title": {
        "en": "Equity Japan"
      }
    },
    "equity_korea": {
      "title": {
        "en": "Equity Korea"
      }
    },
    "equity_sector_asia_consumer": {
      "title": {
        "en": "Equity Sector Asia Consumer"
      }
    },
    "equity_sector_commodities": {
      "title": {
        "en": "Equity Sector Commodities"
      }
    },
    "equity_sector_consumer": {
      "title": {
        "en": "Equity Sector Consumer"
      }
    },
    "equity_sector_energy": {
      "title": {
        "en": "Equity Sector Energy"
      }
    },
    "equity_sector_financials": {
      "title": {
        "en": "Equity Sector Financials"
      }
    },
    "equity_sector_gold": {
      "title": {
        "en": "Equity Sector Gold"
      }
    },
    "equity_sector_healthcare": {
      "title": {
        "en": "Equity Sector Healthcare"
      }
    },
    "equity_sector_property_asia_pacific": {
      "title": {
        "en": "Equity Sector Property Asia Pacific"
      }
    },
    "equity_sector_property_europe": {
      "title": {
        "en": "Equity Sector Property Europe"
      }
    },
    "equity_sector_property_global": {
      "title": {
        "en": "Equity Sector Property Global"
      }
    },
    "equity_sector_technology": {
      "title": {
        "en": "Equity Sector Technology"
      }
    },
    "equity_shariah_global": {
      "title": {
        "en": "Equity Shariah Global"
      }
    },
    "equity_southeast_asia": {
      "title": {
        "en": "Equity Southeast Asia"
      }
    },
    "equity_taiwan": {
      "title": {
        "en": "Equity Taiwan"
      }
    },
    "equity_us": {
      "title": {
        "en": "Equity US"
      }
    },
    "equity_us_smaller_companies": {
      "title": {
        "en": "Equity US Smaller Companies"
      }
    },
    "mixed_assets_asia_pacific": {
      "title": {
        "en": "Mixed Assets Asia Pacific"
      }
    },
    "mixed_assets_global_flexi": {
      "title": {
        "en": "Mixed Assets Global Flexi"
      }
    },
    "equity_real_estate_asia": {
      "title": {
        "en": "Equity Real Estate Asia"
      }
    },
    "equity_real_estate_europe": {
      "title": {
        "en": "Equity Real Estate Europe"
      }
    },
    "equity_real_estate_global": {
      "title": {
        "en": "Equity Real Estate Global"
      }
    },
    "equity_real_estate_asia_pacific": {
      "title": {
        "en": "Equity Real Estate Asia Pacific"
      }
    },
    "equity_commodities": {
      "title": {
        "en": "Equity Commodities"
      }
    },
    "equity_healthcare": {
      "title": {
        "en": "Equity Healthcare"
      }
    },
    "equity_europe_inc_uk": {
      "title": {
        "en": "Equity Europe inc UK"
      }
    },
    "alternatives": {
      "title": {
        "en": "Alternatives"
      }
    },
    "equity_technology": {
      "title": {
        "en": "Equity Technology"
      }
    },
    "asset_allocation_global": {
      "title": {
        "en": "Asset Allocation Global"
      }
    },
    "equity_asia_pacific_ex_japan": {
      "title": {
        "en": "Equity Asia Pacific ex-Japan"
      }
    },
    "equity_latin_america": {
      "title": {
        "en": "Equity Latin America"
      }
    },
    "equity_asean": {
      "title": {
        "en": "Equity ASEAN"
      }
    },
    "equity_sector_luxury": {
      "title": {
        "en": "Equity Sector Luxury"
      }
    },
    "equity_emerging_europe": {
      "title": {
        "en": "Equity Emerging Europe"
      }
    },
    "equity_asia_pacific_ex_japan_smaller_companies": {
      "title": {
        "en": "Equity Asia Pacific ex-Japan Smaller Companies"
      }
    },
    "mixed_assets_asia_pacific_ex_japan": {
      "title": {
        "en": "Mixed Assets Asia Pacific ex-Japan"
      }
    },
    "equity_global_shariah": {
      "title": {
        "en": "Equity Global Shariah"
      }
    },
    "equity_financials": {
      "title": {
        "en": "Equity Financials"
      }
    },
    "bond_global_inflation_linked": {
      "title": {
        "en": "Bond Global Inflation-linked"
      }
    },
    "money_market_usd": {
      "title": {
        "en": "Money Market USD"
      }
    },
    "Asset_Allocation_Emerging_Markets": {
      "title": {
        "en": "Asset Allocation Emerging Markets"
      }
    },
   "Equity_Europe_Smaller_Companies": {
      "title": {
        "en": "Equity Europe Smaller Companies"
      }
    }
  }
}
