{
    "compCode"  : "08",
    "type"      : "material",
    "section"   : "Product Summary",
    "sectionId" : "prod",
    "name"      : "AXA Retire Happy Plus (Inflated) PS Jun 2019",
    "id"        : "prod15_1",
    "effDate"   : "2017-05-22 14:10:34",
    "expDate"   : "2020-02-17 14:19:47"  
}