{
  "id": "financialConsultantRecommendation_shield",
  "items": [
    {
      "planList": ["ASIMSA", "ASPA", "ASGC", "ASHCD"],
      "benefits": {
        "en": "AXA Shield Plan A with AXA Basic Care, AXA General Care and AXA Home Care: 1) Reimburses eligible expenses in private hospital standard rooms 2) 365 days of post-hospitalisation coverage 3) Covers Deductibles and Co-Insurance 4) Provides Daily Hospital Cash Incentive of up to $250 if the Life Assured stays in a four-bedded or lower ward class in public hospital 5) Covers Traditional Chinese Medicine treatment, certain planned overseas medical treatments, emergency outpatient treatments due to an accident, outpatient treatments for fractures, dislocations, sports injuries, food poisoning, dengue and Hand Foot and Mouth Disease 6)  Covers home nursing, home care medical services, GP home visits, and purchase or rental of mobility aids(within 30 days of post hospitalisation), Inpatient Hospice Care Daily Reimbursement(up to 90 days per Policy Year). You can decide within 21 days from the date of receipt of the Policy whether You want to continue with Your Policy.  If You do not want to continue, You may cancel this Policy by giving us written notice and We shall refund the Premiums paid for this Policy."
      },
      "limitations": {
        "en": "AXA Shield Plan A with AXA Basic Care, AXA General Care and AXA Home Care: 1) Premiums are not guaranteed 2) Premiums increase with age band 3) The additional private insurance coverage portion of AXA Shield premium in excess of the AWL is not payable via Medisave 4) Does not cover medical treatment outside of Singapore, except in the case of emergency, or certain planned medical treatments (as stated in the AXA General Care Supplementary Provisions). 5) Pro-ration Factors will apply if Life Assured is Hospitalized in a higher class ward than the Hospital class ward entitled under your policy. \n\nThe plan does not cover treatment for congenital abnormalities such as, but not limited to genetics, hereditary conditions and physical or birth defects from childbirth, and first diagnosed by a Physician or signs and symptoms were first presented within 365 days from the Effective Date or last Reinstatement Date.\n\nYou have bought the Basic Care Rider (no copay).\nIn line with the Ministry of Health guidelines issued on 8 Mar 2018, you will have to transit to a rider with co-payment of 5% (or more) from 1 April 2021 upon policy renewal. You also have the option to transit to a rider with co-payment earlier when it is available from 1 April 2019 upon policy renewal."
      },
      "additionalLimitations": {
        "en": "Does not cover treatment for congenital abnormalities such as, but not limited to genetics, hereditary conditions and physical or birth defects from childbirth, and first diagnosed by a Physician or signs and symptoms were first presented within 365 days from the Effective Date or last Reinstatement Date."

      }
    },
    {
      "planList": ["ASIMSA", "ASPA", "ASGC"],
      "benefits": {
        "en": "AXA Shield Plan A with AXA Basic Care and AXA General Care: 1) Reimburses eligible expenses in private hospital standard rooms 2) 365 days of post-hospitalisation coverage 3) Covers Deductibles and Co-Insurance 4) Provides Daily Hospital Cash Incentive of up to $250 if the Life Assured stays in a four-bedded or lower ward class in public hospital 5) Covers Traditional Chinese Medicine treatment, certain planned overseas medical treatments, emergency outpatient treatments due to accident, outpatient treatments for fractures, dislocations, sports injuries, food poisoning, dengue and Hand Foot and Mouth Disease. You can decide within 21 days from the date of receipt of the Policy whether You want to continue with Your Policy.  If You do not want to continue, You may cancel this Policy by giving us written notice and We shall refund the Premiums paid for this Policy."
      },
      "limitations": {
        "en": "AXA Shield Plan A with AXA Basic Care and AXA General Care: 1) Premiums are not guaranteed 2) Premiums increase with age band 3) The additional private insurance coverage portion of AXA Shield premium in excess of the AWL is not payable via Medisave 4) Does not cover medical treatment outside of Singapore, except in the case of emergency, or certain planned medical treatments (as stated in the AXA General Care Supplementary Provisions). 5)Pro-ration Factors will apply if Life Assured is Hospitalized in a higher class ward than the Hospital class ward entitled under your policy.\n\nThe plan does not cover treatment for congenital abnormalities such as, but not limited to genetics, hereditary conditions and physical or birth defects from childbirth, and first diagnosed by a Physician or signs and symptoms were first presented within 365 days from the Effective Date or last Reinstatement Date.\n\nYou have bought the Basic Care Rider (no copay).\nIn line with the Ministry of Health guidelines issued on 8 Mar 2018, you will have to transit to a rider with co-payment of 5% (or more) from 1 April 2021 upon policy renewal. You also have the option to transit to a rider with co-payment earlier when it is available from 1 April 2019 upon policy renewal."
      },
      "additionalLimitations": {
        "en": "Does not cover treatment for congenital abnormalities such as, but not limited to genetics, hereditary conditions and physical or birth defects from childbirth, and first diagnosed by a Physician or signs and symptoms were first presented within 365 days from the Effective Date or last Reinstatement Date."
      }
    },
    {
      "planList": ["ASIMSA", "ASPA", "ASHC"],
      "benefits": {
        "en": "AXA Shield Plan A with AXA Basic Care and AXA Home Care: 1) Reimburses eligible expenses in private hospital standard rooms 2) 365 days of post-hospitalisation coverage 3) Covers Deductibles and Co-Insurance 4) Covers home nursing, home care medical services, GP home visits, and purchase or rental or mobility aids(within 30 days of post hospitalisation), Inpatient Hospice Care Daily Reimbursement(up to 90 days per Policy Year).  You can decide within 21 days from the date of receipt of the Policy whether You want to continue with Your Policy.  If You do not want to continue, You may cancel this Policy by giving us written notice and We shall refund the Premiums paid for this Policy."
      },
      "limitations": {
        "en": "AXA Shield Plan A with AXA Basic Care and AXA Home Care: 1) Premiums are not guaranteed 2) Premiums increase with age band 3) The additional private insurance coverage portion of AXA Shield premium in excess of the AWL is not payable via Medisave 4) Does not cover medical treatment outside of Singapore, except in the case of emergency, or certain planned medical treatments (as stated under the additional benefits of your AXA Shield Policy). 5) Pro-ration Factors will apply if Life Assured is Hospitalized in a higher class ward than the Hospital class ward entitled under your policy.\n\nThis plan does not cover treatment for congenital abnormalities such as, but not limited to genetics, hereditary conditions and physical or birth defects from childbirth, and first diagnosed by a Physician or signs and symptoms were first presented within 365 days from the Effective Date or last Reinstatement Date.\n\nYou have bought the Basic Care Rider (no copay).\nIn line with the Ministry of Health guidelines issued on 8 Mar 2018, you will have to transit to a rider with co-payment of 5% (or more) from 1 April 2021 upon policy renewal. You also have the option to transit to a rider with co-payment earlier when it is available from 1 April 2019 upon policy renewal."
      },
      "additionalLimitations": {
        "en": "Does not cover treatment for congenital abnormalities such as, but not limited to genetics, hereditary conditions and physical or birth defects from childbirth, and first diagnosed by a Physician or signs and symptoms were first presented within 365 days from the Effective Date or last Reinstatement Date."
      }
    },
    {
      "planList": ["ASIMSA", "ASPA"],
      "benefits": {
        "en": "AXA Shield Plan A with AXA Basic Care: 1) Reimburses eligible expenses in private hospital standard rooms 2) 365 days of post-hospitalisation coverage 3) Covers Deductibles and Co-Insurance.  You can decide within 21 days from the date of receipt of the Policy whether You want to continue with Your Policy.  If You do not want to continue, You may cancel this Policy by giving us written notice and We shall refund the Premiums paid for this Policy."
      },
      "limitations": {
        "en": "AXA Shield Plan A with AXA Basic Care: 1) Premiums are not guaranteed 2) Premiums increase with age band 3) The additional private insurance coverage portion of AXA Shield premium in excess of the AWL is not payable via Medisave 4) Does not cover medical treatment outside of Singapore, except in the case of emergency, or certain planned medical treatments (as stated under the additional benefits of your AXA Shield Policy). 5) Pro-ration Factors will apply if Life Assured is Hospitalized in a higher class ward than the Hospital class ward entitled under your policy.\n\nThis plan does not cover treatment for congenital abnormalities such as, but not limited to genetics, hereditary conditions and physical or birth defects from childbirth, and first diagnosed by a Physician or signs and symptoms were first presented within 365 days from the Effective Date or last Reinstatement Date.\n\nYou have bought the Basic Care Rider (no copay).\nIn line with the Ministry of Health guidelines issued on 8 Mar 2018, you will have to transit to a rider with co-payment of 5% (or more) from 1 April 2021 upon policy renewal. You also have the option to transit to a rider with co-payment earlier when it is available from 1 April 2019 upon policy renewal."
      },
      "additionalLimitations": {
        "en": "Does not cover treatment for congenital abnormalities such as, but not limited to genetics, hereditary conditions and physical or birth defects from childbirth, and first diagnosed by a Physician or signs and symptoms were first presented within 365 days from the Effective Date or last Reinstatement Date."
      }
    },
    {
      "planList": ["ASIMSA"],
      "benefits": {
        "en": "AXA Shield Plan A: 1) Reimburses eligible expenses in private hospital standard rooms 2) 365 days of post-hospitalisation coverage.  You can decide within 21 days from the date of receipt of the Policy whether You want to continue with Your Policy.  If You do not want to continue, You may cancel this Policy by giving us written notice and We shall refund the Premiums paid for this Policy."
      },
      "limitations": {
        "en": "AXA Shield Plan A: 1) Premiums are not guaranteed 2) Premiums increase with age band 3) The additional private insurance coverage portion of AXA Shield premium in excess of the AWL is not payable via Medisave 4) Does not cover Deductibles and Co-Insurance 5) Does not cover medical treatment outside of Singapore, except in the case of emergency, or certain planned medical treatments (as stated under the additional benefits of your AXA Shield Policy). 6) Pro-ration Factors will apply if Life Assured is Hospitalized in a higher class ward than the Hospital class ward entitled under your policy.\n\nThis plan does not cover treatment for congenital abnormalities such as, but not limited to genetics, hereditary conditions and physical or birth defects from childbirth, and first diagnosed by a Physician or signs and symptoms were first presented within 365 days from the Effective Date or last Reinstatement Date. "
      },
      "additionalLimitations": {
        "en": "Does not cover treatment for congenital abnormalities such as, but not limited to genetics, hereditary conditions and physical or birth defects from childbirth, and first diagnosed by a Physician or signs and symptoms were first presented within 365 days from the Effective Date or last Reinstatement Date."
      }
    },
    {
      "planList": ["ASIMSB", "ASPB", "ASGCB", "ASHCD"],
      "benefits": {
        "en": "AXA Shield Plan B with AXA Basic Care, AXA General Care and AXA Home Care: 1) Reimburses eligible expenses in single-bedded wards in restructured (public) hospitals 2) 365 days of post-hospitalisation coverage 3) Covers Deductibles and Co-Insurance 4) Provides Daily Hospital Cash Incentive of $100 if the Life Assured stays in a four-bedded ward class in a public hospital, and $150 for six-bedded or lower ward class in a public hospital 5) Covers Traditional Chinese Medicine treatment, certain planned overseas medical treatments, emergency outpatient treatments due to an accident, outpatient treatments for fractures, dislocations, sports injuries, food poisoning, dengue and Hand Foot and Mouth Disease 6)  Covers home nursing, home care medical services, GP home visits, and purchase or rental or mobility aids(within 30 days of post hospitalisation), Inpatient Hospice Care Daily Reimbursement(up to 90 days per Policy Year). You can decide within 21 days from the date of receipt of the Policy whether You want to continue with Your Policy.  If You do not want to continue, You may cancel this Policy by giving us written notice and We shall refund the Premiums paid for this Policy."
      },
      "limitations": {
        "en": "AXA Shield Plan B with AXA Basic Care, AXA General Care and AXA Home Care: 1) Premiums are not guaranteed 2) Premiums increase with age band 3) The additional private insurance coverage portion of AXA Shield premium in excess of the AWL is not payable via Medisave 4) Does not cover medical treatment outside of Singapore, except in the case of emergency, or certain planned medical treatments (as stated in the AXA General Care Supplementary Provisions) 5) Pro-ration Factors will apply if Life Assured is Hospitalized in a higher class ward than the Hospital class ward entitled under your policy.\n\nThe plan does not cover treatment for congenital abnormalities such as, but not limited to genetics, hereditary conditions and physical or birth defects from childbirth, and first diagnosed by a Physician or signs and symptoms were first presented within 365 days from the Effective Date or last Reinstatement Date.\n\nYou have bought the Basic Care Rider (no copay).\nIn line with the Ministry of Health guidelines issued on 8 Mar 2018, you will have to transit to a rider with co-payment of 5% (or more) from 1 April 2021 upon policy renewal. You also have the option to transit to a rider with co-payment earlier when it is available from 1 April 2019 upon policy renewal."
      },
      "additionalLimitations": {
        "en": "Does not cover treatment for congenital abnormalities such as, but not limited to genetics, hereditary conditions and physical or birth defects from childbirth, and first diagnosed by a Physician or signs and symptoms were first presented within 365 days from the Effective Date or last Reinstatement Date."
      }
    },
    {
      "planList": ["ASIMSB", "ASPB", "ASGCB"],
      "benefits": {
        "en": "AXA Shield Plan B with AXA Basic Care and AXA General Care: 1) Reimburses eligible expenses in single-bedded wards in restructured (public) hospitals 2) 365 days of post-hospitalisation coverage 3) Covers Deductibles and Co-Insurance 4) Provides Daily Hospital Cash Incentive of $100 if the Life Assured stays in a four-bedded ward class in a public hospital, and $150 for six-bedded or lower ward class in a public hospital 5) Covers Traditional Chinese Medicine treatment, certain planned overseas medical treatments, emergency outpatient treatments due to accident, outpatient treatments for fractures, dislocations, sports injuries, food poisoning, dengue and Hand Foot and Mouth Disease.  You can decide within 21 days from the date of receipt of the Policy whether You want to continue with Your Policy.  If You do not want to continue, You may cancel this Policy by giving us written notice and We shall refund the Premiums paid for this Policy."
      },
      "limitations": {
        "en": "AXA Shield Plan B with AXA Basic Care and AXA General Care: 1) Premiums are not guaranteed 2) Premiums increase with age band 3) The additional private insurance coverage portion of AXA Shield premium in excess of the AWL is not payable via Medisave 4) Does not cover medical treatment outside of Singapore, except in the case of emergency, or certain planned medical treatments (as stated in the AXA General Care Supplementary Provisions). 5) Pro-ration Factors will apply if Life Assured is Hospitalized in a higher class ward than the Hospital class ward entitled under your policy.\n\nThis plan does not cover treatment for congenital abnormalities such as, but not limited to genetics, hereditary conditions and physical or birth defects from childbirth, and first diagnosed by a Physician or signs and symptoms were first presented within 365 days from the Effective Date or last Reinstatement Date.\n\nYou have bought the Basic Care Rider (no copay).\nIn line with the Ministry of Health guidelines issued on 8 Mar 2018, you will have to transit to a rider with co-payment of 5% (or more) from 1 April 2021 upon policy renewal. You also have the option to transit to a rider with co-payment earlier when it is available from 1 April 2019 upon policy renewal."
      },
      "additionalLimitations": {
        "en": "Does not cover treatment for congenital abnormalities such as, but not limited to genetics, hereditary conditions and physical or birth defects from childbirth, and first diagnosed by a Physician or signs and symptoms were first presented within 365 days from the Effective Date or last Reinstatement Date."
      }
    },
    {
      "planList": ["ASIMSB", "ASPB", "ASHC"],
      "benefits": {
        "en": "AXA Shield Plan B with AXA Basic Care and AXA Home Care: 1) Reimburses eligible expenses in single-bedded wards in restructured (public) hospitals 2) 365 days of post-hospitalisation coverage 3) Covers Deductibles and Co-Insurance 4) Covers home nursing, home care medical services, GP home visits, and purchase or rental of mobility aids(within 30 days of post hospitalisation), Inpatient Hospice Care Daily Reimbursement(up to 90 days per Policy Year).  You can decide within 21 days from the date of receipt of the Policy whether You want to continue with Your Policy.  If You do not want to continue, You may cancel this Policy by giving us written notice and We shall refund the Premiums paid for this Policy."
      },
      "limitations": {
        "en": "AXA Shield Plan B with AXA Basic Care and AXA Home Care: 1) Premiums are not guaranteed 2) Premiums increase with age band 3) The additional private insurance coverage portion of AXA Shield premium in excess of the AWL is not payable via Medisave 4) Does not cover medical treatment outside of Singapore, except in the case of emergency, or certain planned medical treatments (as stated under the additional benefits of your AXA Shield Policy). 5) Pro-ration Factors will apply if Life Assured is Hospitalized in a higher class ward than the Hospital class ward entitled under your policy.\n\nThis plan does not cover treatment for congenital abnormalities such as, but not limited to genetics, hereditary conditions and physical or birth defects from childbirth, and first diagnosed by a Physician or signs and symptoms were first presented within 365 days from the Effective Date or last Reinstatement Date.\n\nYou have bought the Basic Care Rider (no copay).\nIn line with the Ministry of Health guidelines issued on 8 Mar 2018, you will have to transit to a rider with co-payment of 5% (or more) from 1 April 2021 upon policy renewal. You also have the option to transit to a rider with co-payment earlier when it is available from 1 April 2019 upon policy renewal."
      },
      "additionalLimitations": {
        "en": "Does not cover treatment for congenital abnormalities such as, but not limited to genetics, hereditary conditions and physical or birth defects from childbirth, and first diagnosed by a Physician or signs and symptoms were first presented within 365 days from the Effective Date or last Reinstatement Date."
      }
    },
    {
      "planList": ["ASIMSB", "ASPB"],
      "benefits": {
        "en": "AXA Shield Plan B with AXA Basic Care: 1) Reimburses eligible expenses in single-bedded wards in restructured (public) hospitals 2) 365 days of post-hospitalisation coverage 3) Covers Deductibles and Co-Insurance.  You can decide within 21 days from the date of receipt of the Policy whether You want to continue with Your Policy.  If You do not want to continue, You may cancel this Policy by giving us written notice and We shall refund the Premiums paid for this Policy."
      },
      "limitations": {
        "en": "AXA Shield Plan B with AXA Basic Care: 1) Premiums are not guaranteed 2) Premiums increase with age band 3) The additional private insurance coverage portion of AXA Shield premium in excess of the AWL is not payable via Medisave 4) Does not cover medical treatment outside of Singapore, except in the case of emergency, or certain planned medical treatments (as stated under the additional benefits of your AXA Shield Policy). 5) Pro-ration Factors will apply if Life Assured is Hospitalized in a higher class ward than the Hospital class ward entitled under your policy.\n\nThis plan does not cover treatment for congenital abnormalities such as, but not limited to genetics, hereditary conditions and physical or birth defects from childbirth, and first diagnosed by a Physician or signs and symptoms were first presented within 365 days from the Effective Date or last Reinstatement Date.\n\nYou have bought the Basic Care Rider (no copay).\nIn line with the Ministry of Health guidelines issued on 8 Mar 2018, you will have to transit to a rider with co-payment of 5% (or more) from 1 April 2021 upon policy renewal. You also have the option to transit to a rider with co-payment earlier when it is available from 1 April 2019 upon policy renewal."
      },
      "additionalLimitations": {
        "en": "Does not cover treatment for congenital abnormalities such as, but not limited to genetics, hereditary conditions and physical or birth defects from childbirth, and first diagnosed by a Physician or signs and symptoms were first presented within 365 days from the Effective Date or last Reinstatement Date."
      }
    },
    {
      "planList": ["ASIMSB"],
      "benefits": {
        "en": "AXA Shield Plan B: 1) Reimburses eligible expenses in single-bedded wards in restructured (public) hospitals 2) 365 days of post-hospitalisation coverage.  You can decide within 21 days from the date of receipt of the Policy whether You want to continue with Your Policy.  If You do not want to continue, You may cancel this Policy by giving us written notice and We shall refund the Premiums paid for this Policy."
      },
      "limitations": {
        "en": "AXA Shield Plan B: 1) Premiums are not guaranteed 2) Premiums increase with age band 3) The additional private insurance coverage portion of AXA Shield premium in excess of the AWL is not payable via Medisave 4) Does not cover Deductibles and Co-Insurance 5) Does not cover medical treatment outside of Singapore, except in the case of emergency, or certain planned medical treatments (as stated under the additional benefits of your AXA Shield Policy). 6) Pro-ration Factors will apply if Life Assured is Hospitalized in a higher class ward than the Hospital class ward entitled under your policy.\n\nThis plan does not cover treatment for congenital abnormalities such as, but not limited to genetics, hereditary conditions and physical or birth defects from childbirth, and first diagnosed by a Physician or signs and symptoms were first presented within 365 days from the Effective Date or last Reinstatement Date. "
      },
      "additionalLimitations": {
        "en": " Does not cover treatment for congenital abnormalities such as, but not limited to genetics, hereditary conditions and physical or birth defects from childbirth, and first diagnosed by a Physician or signs and symptoms were first presented within 365 days from the Effective Date or last Reinstatement Date."
      }
    },
    {
      "planList": ["ASIMSC"],
      "benefits": {
        "en": "AXA Shield Standard Plan: 1) Reimburses eligible expenses in class B1  wards and below in restructured (public) hospitals.  You can decide within 21 days from the date of receipt of the Policy whether You want to continue with Your Policy.  If You do not want to continue, You may cancel this Policy by giving us written notice and We shall refund the Premiums paid for this Policy."
      },
      "limitations": {
        "en": "AXA Shield Stardard Plan: 1) Premiums are not guaranteed 2) Premiums increase with age band 3) The additional private insurance coverage portion of AXA Shield premium in excess of the AWL is not payable via Medisave 4) Does not cover Deductibles and Co-Insurance 5) Does not cover medical treatment or Hospitalization outside of Singapore 6) Pro-ration Factors will apply if Life Assured is Hospitalized in a higher class ward than the Hospital class ward entitled under your policy.\n\nThis plan does not cover Treatment for congenital abnormalities such as, but not limited to genetics, hereditary conditions and physical or birth defects from childbirth."
      },
      "additionalLimitations": {
        "en": "Does not cover Treatment for congenital abnormalities such as, but not limited to genetics, hereditary conditions and physical or birth defects from childbirth."
      }
    },
    {
      "planList": ["ASIMSC", "ASPC"],
      "benefits": {
        "en": "AXA Shield Standard Plan with AXA Basic Care: 1) Reimburses eligible expenses in class B1 and below wards in restructured (public) hospitals 2) Covers Deductibles and Co-Insurance.  You can decide within 21 days from the date of receipt of the Policy whether You want to continue with Your Policy.  If You do not want to continue, You may cancel this Policy by giving us written notice and We shall refund the Premiums paid for this Policy."
      },
      "limitations": {
        "en": "AXA Shield Standard Plan with AXA Basic Care: 1) Premiums are not guaranteed 2) Premiums increase with age band 3) The additional private insurance coverage portion of AXA Shield premium in excess of the AWL is not payable via Medisave 4) Does not cover medical treatment or Hospitalization outside of Singapore.  5)Pro-ration Factors will apply if Life Assured is Hospitalized in a higher class ward than the Hospital class ward entitled under your policy.\n\nThis plan does not cover Treatment for congenital abnormalities such as, but not limited to genetics, hereditary conditions and physical or birth defects from childbirth.\n\nYou have bought the Basic Care Rider (no copay).\nIn line with the Ministry of Health guidelines issued on 8 Mar 2018, you will have to transit to a rider with co-payment of 5% (or more) from 1 April 2021 upon policy renewal. You also have the option to transit to a rider with co-payment earlier when it is available from 1 April 2019 upon policy renewal."
      },
      "additionalLimitations": {
        "en": "Does not cover Treatment for congenital abnormalities such as, but not limited to genetics, hereditary conditions and physical or birth defects from childbirth."
      }
    }
  ]
}
