{
  "otherDocNames" : {
    "la":[
      {
        "title":"Supplementary Proposal Form"
      },
      {
        "title":"Clinical Abstract Application Form"
      },
      {
        "title":"Medical Request Form"
      },
      {
        "title":"Copy of medical test or investigation or checkup report"
      },
      {
        "title":"Health Questionnaire"
      },
      {
        "title":"Income Tax Returns for the last 2 years"
      },
      {
        "title":"Proof of Source of Fund"
      },
      {
        "title":"Proof of Source of Wealth"
      },
      {
        "title":"Military Questionnaire"
      },
      {
        "title":"General Occupation Questionnaire"
      },
      {
        "title":"Aviation Questionnaire"
      },
      {
        "title":"Avocation Questionnaire"
      },
      {
        "title":"Financial Questionnaire"
      },
      {
        "title":"Service Request Form"
      },
      {
        "title":"Secondary Life Assured Form"
      },
      {
        "title":"Other"
      }
    ],
    "ph":[
      {
        "title":"Supplementary Proposal Form"
      },
      {
        "title":"Clinical Abstract Application Form"
      },
      {
        "title":"Medical Request Form"
      },
      {
        "title":"Copy of medical test or investigation or checkup report"
      },
      {
        "title":"Health Questionnaire"
      },
      {
        "title":"Income Tax Returns for the last 2 years"
      },
      {
        "title":"Proof of Source of Fund"
      },
      {
        "title":"Proof of Source of Wealth"
      },
      {
        "title":"Military Questionnaire"
      },
      {
        "title":"General Occupation Questionnaire"
      },
      {
        "title":"Aviation Questionnaire"
      },
      {
        "title":"Avocation Questionnaire"
      },
      {
        "title":"Financial Questionnaire"
      },
      {
        "title":"Service Request Form"
      },
      {
        "title":"Secondary Life Assured Form"
      },
      {
        "title":"Other"
      }
    ]
  },
  "otherDocNames_JapaneseAndNotShield" : {
    "la":[
      {
        "title":"Supplementary Proposal Form"
      },
      {
        "title":"Clinical Abstract Application Form"
      },
      {
        "title":"Medical Request Form"
      },
      {
        "title":"Copy of medical test or investigation or checkup report"
      },
      {
        "title":"Health Questionnaire"
      },
      {
        "title":"Income Tax Returns for the last 2 years"
      },
      {
        "title":"Proof of Source of Fund"
      },
      {
        "title":"Proof of Source of Wealth"
      },
      {
        "title":"Military Questionnaire"
      },
      {
        "title":"General Occupation Questionnaire"
      },
      {
        "title":"Aviation Questionnaire"
      },
      {
        "title":"Avocation Questionnaire"
      },
      {
        "title":"Financial Questionnaire"
      },
      {
        "title":"Service Request Form"
      },
      {
        "title":"Other"
      }
    ],
    "ph":[
      {
        "title":"Supplementary Proposal Form"
      },
      {
        "title":"Clinical Abstract Application Form"
      },
      {
        "title":"Medical Request Form"
      },
      {
        "title":"Copy of medical test or investigation or checkup report"
      },
      {
        "title":"Health Questionnaire"
      },
      {
        "title":"Income Tax Returns for the last 2 years"
      },
      {
        "title":"Proof of Source of Fund"
      },
      {
        "title":"Proof of Source of Wealth"
      },
      {
        "title":"Military Questionnaire"
      },
      {
        "title":"General Occupation Questionnaire"
      },
      {
        "title":"Aviation Questionnaire"
      },
      {
        "title":"Avocation Questionnaire"
      },
      {
        "title":"Financial Questionnaire"
      },
      {
        "title":"Service Request Form"
      },
      {
        "title":"Other"
      }
    ]
  }
}
