{
    "allowBackdate": "N",
    "benlim": [
        {
            "ageFr": "0",
            "ageTo": "70",
            "class": "*",
            "country": "*",
            "limits": [
                {
                    "ccy": "SGD",
                    "max": 50000,
                    "min": 10000,
                    "payMode": "A"
                },
                {
                    "ccy": "SGD",
                    "max": 50000,
                    "min": 10000,
                    "payMode": "S"
                },
                {
                    "ccy": "SGD",
                    "max": 50000,
                    "min": 10000,
                    "payMode": "Q"
                },
                {
                    "ccy": "SGD",
                    "max": 50000,
                    "min": 10000,
                    "payMode": "M"
                }
            ]
        }
    ],
    "budgetRules": [
        "RP"
    ],
    "classInd": "N",
    "compCode": "08",
    "covCode": "BBR",
    "covName": {
        "en": "Broken Bones Benefit",
        "zh-Hant": "Broken Bones Benefit"
    },
    "ctyGroup": [
        "*"
    ],
    "currencies": [
        {
            "ccy": [
                "SGD"
            ],
            "country": "*"
        }
    ],
    "dealerGroup": [
        "AGENCY",
        "SYNERGY",
        "SINGPOST",
        "BROKER",
        "DIRECT",
        "FUSION"
    ],
    "effDate": "2017-08-26 05:17:07",
    "entryAge": [
        {
            "country": "*",
            "imaxAge": 70,
            "imaxAgeUnit": "nearestAge",
            "iminAge": 15,
            "iminAgeUnit": "day",
            "omaxAge": 70,
            "omaxAgeUnit": "nearestAge",
            "ominAge": 18,
            "ominAgeUnit": "year",
            "sameAsOwner": ""
        }
    ],
    "expDate": "2118-07-26 16:00:00",
    "formulas": {
        "calcQuotFunc": "",
        "getOccupationClass": "function (quotation, planDetail) { if (quotation && quotation.plans && quotation.plans[0]) { var cls = quotation.plans[0].covClass; if (cls) { return parseInt(cls, 10) - 1; } return 0; }}",
        "illustrateFunc": "",
        "polTermsFunc": "",
        "premFunc": "function (quotation, planInfo, planDetail) { var ocls = runFunc(planDetail.formulas.getOccupationClass, quotation, planDetail); var rate = parseFloat(planDetail.rates.premRate.rates[ocls]); var scale = parseFloat(planDetail.saScale); for(var i = 0; i< quotation.plans.length; i++){ var plan = quotation.plans[i]; if(plan.covCode == planInfo.covCode){ plan.premRate = rate; break; } } var prem = math.divide(math.multiply(math.bignumber(planInfo.sumInsured), rate), scale); var payModes = planDetail.payModes; for (var i = 0; i < payModes.length; i++) { let { mode, factor, operator } = payModes[i]; if (quotation.paymentMode == mode) { if (operator == 'M') { prem = math.multiply(prem, factor); } else if (operator == 'D') { prem = math.divide(prem, factor); } break; } } return math.number(prem);}",
        "premTermsFunc": "",
        "prepareClassConfig": "",
        "prepareSAPremConfig": "function (planDetail, quotation, planDetails) { quotDriver.prepareAmountConfig(planDetail, quotation, planDetails); if (quotation.plans && quotation.plans[0].sumInsured && planDetail.inputConfig.benlim.max > (quotation.plans[0].sumInsured * 0.2)) { planDetail.inputConfig.benlim.max = math.multiply(quotation.plans[0].sumInsured, 0.2); }}",
        "prepareTermConfig": "",
        "saFunc": "",
        "validAfterCalcFunc": "function (quotation, planInfo, planDetail) { quotValid.validatePlanAfterCalc(quotation, planInfo, planDetail); if (planDetail.gstInd == \"Y\") { planInfo.tax = { yearTax: math.number(math.round(math.multiply(math.bignumber(planInfo.yearPrem), planDetail.gstRate), 2)), halfYearTax: math.number(math.round(math.multiply(math.bignumber(planInfo.halfYearPrem), planDetail.gstRate), 2)), quarterTax: math.number(math.round(math.multiply(math.bignumber(planInfo.quarterPrem), planDetail.gstRate), 2)), monthTax: math.number(math.round(math.multiply(math.bignumber(planInfo.monthPrem), planDetail.gstRate), 2)) }; }}",
        "validBeforeCalcFunc": "",
        "validQuotFunc": "",
        "willValidQuotFunc": ""
    },
    "genderInd": "*",
    "payModes": [
        {
            "covMonth": 12,
            "default": "N",
            "factor": 1,
            "mode": "A",
            "operator": "M"
        },
        {
            "covMonth": 6,
            "default": "N",
            "factor": 0.51,
            "mode": "S",
            "operator": "M"
        },
        {
            "covMonth": 3,
            "default": "N",
            "factor": 0.26,
            "mode": "Q",
            "operator": "M"
        },
        {
            "covMonth": 1,
            "default": "N",
            "factor": 0.0875,
            "mode": "M",
            "operator": "M"
        }
    ],
    "planInd": "R",
    "polMatSameAsPremMat": "N",
    "polTermInd": "N",
    "polTermRule": "na",
    "policyMatSameAsBasic": "Y",
    "premInput": [
        {
            "ccy": "SGD",
            "decimal": 2,
            "factor": 0
        }
    ],
    "premInputInd": "N",
    "premMatSameAsBasic": "Y",
    "premMatSameAsPolMat": "N",
    "premTermInd": "N",
    "premTermRule": "na",
    "premType": "L",
    "prodFeature": {
        "en": "Up to a maximum of 100% of the coverage amount per Policy Year for bodily Injuries within 90 days from the date of Accident."
    },
    "productCategory": "ilp",
    "productLine": "AP",
    "rates": {
        "premRate": {
            "rates": [
                1.9,
                2.1,
                2.25,
                2.8
            ]
        }
    },
    "releaseDate": "2018-07-30 01:56:30",
    "remarks": {
        "en": "-"
    },
    "saInput": [
        {
            "ccy": "SGD",
            "decimal": 0,
            "factor": 1000
        }
    ],
    "saInputInd": "Y",
    "saPostfix": {
        "en": "per policy year"
    },
    "saRule": "0",
    "saScale": 1000,
    "saViewInd": "Y",
    "smokeInd": "*",
    "status": "A",
    "type": "product",
    "version": 2,
    "wholeLifeInd": "N"
}