{ 
    "type":"agent",
    "compCode":	"AG",
    "agentCode": "444444",
    "role":	"02",
    "name":	"T2807926A Direct",
    "profileId":	"T2807926A",
    "channel":	"DIRECT",
    "createDate": "1/7/2017",
    "lastUpdateDate":	"14/7/2017",
    "company":	"AXA Direct",
    "tel": "99444444",
    "mobile": "66444444",
    "email":	"T2807926A@eabsystems.com",
    "position":	"Agent",
    "manager": "T2807926A Direct(M)",
    "managerCode": "900002",
    "achievements": "MDRT",
    "authorised":   "M9A,M9"
}
