{
    "apiVersion": "v1",
    "kind": "DeploymentConfig",
    "metadata": {
        "annotations": {
            "openshift.io/generated-by": "OpenShiftWebConsole"
        },
        "creationTimestamp": "2017-07-21T09:41:30Z",
        "generation": 72,
        "labels": {
            "app": "signdoc"
        },
        "name": "signdoc",
        "namespace": "axasgsit",
        "resourceVersion": "5562113",
        "selfLink": "/oapi/v1/namespaces/axasgsit/deploymentconfigs/signdoc",
        "uid": "c60d293f-6df8-11e7-bc05-00155dde16b4"
    },
    "spec": {
        "replicas": 1,
        "selector": {
            "app": "signdoc",
            "deploymentconfig": "signdoc"
        },
        "strategy": {
            "activeDeadlineSeconds": 21600,
            "resources": {},
            "rollingParams": {
                "intervalSeconds": 1,
                "maxSurge": "25%",
                "maxUnavailable": "25%",
                "timeoutSeconds": 600,
                "updatePeriodSeconds": 1
            },
            "type": "Rolling"
        },
        "template": {
            "metadata": {
                "annotations": {
                    "openshift.io/generated-by": "OpenShiftWebConsole"
                },
                "creationTimestamp": null,
                "labels": {
                    "app": "signdoc",
                    "deploymentconfig": "signdoc"
                }
            },
            "spec": {
                "containers": [
                    {
                        "env": [
                            {
                                "name": "TZ",
                                "value": "Asia/Singapore"
                            }
                        ],
                        "image": "172.30.66.113:5000/openshift/signdoc@sha256:5c994380b909c273410737afdd0406cce2e7bea3c718cfb03c20406e21c8e102",
                        "imagePullPolicy": "Always",
                        "name": "signdoc",
                        "ports": [
                            {
                                "containerPort": 8080,
                                "protocol": "TCP"
                            }
                        ],
                        "resources": {},
                        "terminationMessagePath": "/dev/termination-log",
                        "volumeMounts": [
                            {
                                "mountPath": "/var/softpro/sdweb_home/conf",
                                "name": "volume-0l7r2"
                            },
                            {
                                "mountPath": "/var/softpro/sdweb_home/lic",
                                "name": "volume-jzcir"
                            },
                            {
                                "mountPath": "/var/softpro/sdweb_home/cert",
                                "name": "volume-qr6he",
                                "readOnly": true
                            }
                        ]
                    }
                ],
                "dnsPolicy": "ClusterFirst",
                "restartPolicy": "Always",
                "securityContext": {},
                "terminationGracePeriodSeconds": 30,
                "volumes": [
                    {
                        "configMap": {
                            "defaultMode": 420,
                            "name": "sdw-config"
                        },
                        "name": "volume-0l7r2"
                    },
                    {
                        "configMap": {
                            "defaultMode": 420,
                            "name": "sdw-license"
                        },
                        "name": "volume-jzcir"
                    },
                    {
                        "name": "volume-qr6he",
                        "secret": {
                            "defaultMode": 420,
                            "secretName": "sdw-cert"
                        }
                    }
                ]
            }
        },
        "test": false,
        "triggers": [
            {
                "type": "ConfigChange"
            },
            {
                "imageChangeParams": {
                    "automatic": true,
                    "containerNames": [
                        "signdoc"
                    ],
                    "from": {
                        "kind": "ImageStreamTag",
                        "name": "signdoc:latest",
                        "namespace": "openshift"
                    },
                    "lastTriggeredImage": "172.30.66.113:5000/openshift/signdoc@sha256:5c994380b909c273410737afdd0406cce2e7bea3c718cfb03c20406e21c8e102"
                },
                "type": "ImageChange"
            }
        ]
    },
    "status": {
        "availableReplicas": 1,
        "conditions": [
            {
                "lastTransitionTime": "2017-09-14T04:35:47Z",
                "lastUpdateTime": "2017-09-14T04:35:50Z",
                "message": "replication controller \"signdoc-41\" successfully rolled out",
                "reason": "NewReplicationControllerAvailable",
                "status": "True",
                "type": "Progressing"
            },
            {
                "lastTransitionTime": "2017-09-14T10:51:19Z",
                "lastUpdateTime": "2017-09-14T10:51:19Z",
                "message": "Deployment config has minimum availability.",
                "status": "True",
                "type": "Available"
            }
        ],
        "details": {
            "causes": [
                {
                    "type": "ConfigChange"
                }
            ],
            "message": "config change"
        },
        "latestVersion": 41,
        "observedGeneration": 72,
        "readyReplicas": 1,
        "replicas": 1,
        "unavailableReplicas": 0,
        "updatedReplicas": 1
    }
}
