{
  "type": "BLOCK",
  "items":[     
    {
      "type": "CARDCONTAINER",
      "items":[
        {
          "type": "BLOCK",
          "items": [
            {
              "id": "mandatoryDocsLackMsg",
              "type": "PARAGRAPH",
              "content": "You cannot submit the case as mandatory documents are not uploaded!",
              "style": {"color":"#ec4d33"},
              "align": "center", 
              "trigger": {
                "id": "isMandDocsAllUploaded",
                "type": "showIfEqual",
                "value": "false"
              }
            },
            {
              "id": "mandatoryDocsPassMsg",
              "type": "PARAGRAPH",
              "content": "You may proceed to submit the case.",
              "align": "center", 
              "trigger": {
                "id": "agentChannelType,isMandDocsAllUploaded,submitStatus",
                "type": "dynamicCondition",
                "value": "#1=='N'&&#2==true&&#3!=='SUCCESS'&&#3!=='FAIL'"
              }
            },
            {
              "type": "BLOCK",
              "id": "submission",
              "trigger": {
                "id": "agentChannelType,isMandDocsAllUploaded",
                "type": "dynamicCondition",
                "value": "#1=='Y'&&#2==true"
              },
              "items": [
                {
                  "id": "receiveEmailFa",
                  "mandatory":true,
                  "type": "QRADIOGROUP",
                  "horizontal": false,
                  "title": "Do you want to receive Point-of-sale document by email?",
                  "options": [
                    {
                      "value": "Y",
                      "title": "Yes"
                    },
                    {
                      "value": "N",
                      "title": "No"
                    }
                  ]
                }
              ]
            },
            {
              "type": "BLOCK",
              "trigger": {
                "id": "submitStatus",
                "type": "showIfEqual",
                "value": "FAIL"
              },
              "items": [
                {
                  "id": "failMsg",
                  "type": "LABEL",
                  "style": {"color":"#ec4d33"},
                  "value": "Submission Fail. Please try again later"
                }, 
                {
                  "id": "applicationSubmittedDate",
                  "type": "LABEL",
                  "subType": "ISOString",
                  "title": "Last Submission Date and Time", 
                  "showInOneRow": true,
                  "notHidden": true
                }
              ]
            },
            {
              "type": "BLOCK",
              "trigger": {
                "id": "submitStatus",
                "type": "showIfEqual",
                "value": "SUCCESS"
              },
              "items":[
                {
                  "id": "thankYouTitle",
                  "type": "PARAGRAPH",
                  "content": "Thank you for your submission. The application has been successfully submitted for Supervisor Approval. Should you have any queries, kindly quote the Policy Number below.",
                  "style": {"lineHeight": "20px"}
                },
                {
                  "id": "thankYouTitle",
                  "type": "PARAGRAPH",
                  "content": "Point of Sale documents have been triggered to your customer's email, he/she can view the same in inbox (or it could have gone into the spam folder).",
                  "style": {"lineHeight": "20px"},
                  "trigger": {
                    "id": "agentChannelType",
                    "type": "showIfEqual",
                    "value": "N"
                  }
                },
                {
                  "type": "BLOCK",
                  "id": "submission",
                  "items": [
                    {
                      "id": "thankYouTitle",
                      "type": "PARAGRAPH",
                      "content": "Point of Sale documents have been triggered to your customer's email, he/she can view the same in inbox (or it could have gone into the spam folder).",
                      "style": {"lineHeight": "20px"},
                      "trigger": {
                        "id": "receiveEmailFa",
                        "type": "showIfEqual",
                        "value": "Y"
                      }
                    }
                  ]
                },
                {
                  "id": "applicationSubmittedDate", 
                  "type": "LABEL",
                  "subType": "ISOString",
                  "title": "e-Submission Date and Time", 
                  "showInOneRow": true,
                  "notHidden": true
                },
                {
                  "id": "applicationForm.values.proposer.personalInfo.fullName", 
                  "type": "LABEL",
                  "title": "Proposer Name", 
                  "showInOneRow": true
                }, 
                {
                  "type": "BLOCK",
                  "id": "payment",
                  "items": [
                    {
                      "type": "table",
                      "fullWidth": true,
                      "id": "premiumDetails",
                      "allowEdit": false,
                      "planDetailLayout": true,
                      "noBottomBorder": true,
                      "zebraRow": true,
                      "thBold": true,
                      "blueHighlighter": true,
                      "items": [
                        {
                          "type": "TEXT",
                          "id": "policyNumber",
                          "planDetailLayout": true,
                          "title": "Policy number"
                        },
                        {
                          "type": "TEXT",
                          "id": "laName",
                          "planDetailLayout": true,
                          "title": "Life Assured Name"
                        },
                        {
                          "type": "HBOX",
                          "title": "Plan Name",
                          "disableTdStyle": true,
                          "presentation": "planCover@covName",
                          "items": [
                            {
                              "type": "image",
                              "id": "planCover"
                            },
                            {
                              "type": "TEXT",
                              "id": "covName"
                            }
                          ]
                        }
                      ]
                    }
                  ]
                }
              ]
            }
          ]
        }
      ]
    }
  ]
}