{
	"type": "layout",
	"items": [{
		"type": "SECTION",
		"items": [{
				"id": "tiPhoto",
				"type": "PHOTO",
				"align": "left"
			},
			{
				"type": "HBOX",
				"items": [{
						"id": "firstName",
						"title": {
							"en": "Given name (as shown in ID)"
						},
						"type": "text",
						"max": 30,
						"mandatory": true,
						"onChange": "function(i,fn='', v,rv,vrv){var ln=v.lastName||'', no=v.nameOrder!='L'; var rs=((no?fn:ln)+(fn && ln?' ':'')+(no?ln:fn)); if(rs.length>50){rs=rs.substring(0,50)}v.fullName=rs;}"
					}, {
						"id": "lastName",
						"title": {
							"en": "Surname (as shown in ID)"
						},
						"type": "text",
						"max": 30,
						"onChange": "function(i,ln='', v,rv,vrv){var fn=v.firstName||'', no=v.nameOrder!='L'; var rs=((no?fn:ln)+(fn && ln?' ':'')+(no?ln:fn)); if(rs.length>50){rs=rs.substring(0,50)}v.fullName=rs;}"
					}, {
						"id": "fullName",
						"type": "text",
						"title": {
							"en": "Name",
							"zh-Hant": "全名"
						},
						"max": 50,
						"mandatory": true,
						"validation": "function(i,v,rv,vrv){if(!v.firstName){return 603;}}"
					},
					{
						"id": "nameOrder",
						"type": "picker",
						"title": {
							"en": "Name Order"
						},
						"value": "F",
						"onChange": "function(i,no='F', v,rv,vrv){var fn=v.firstName||'', ln=v.lastName||''; var rs=((no=='F'?fn:ln)+(fn && ln?' ':'')+(no=='F'?ln:fn)); if(rs.length>50){rs=rs.substring(0,50)}v.fullName=rs;}",
						"options": [{
								"value": "F",
								"title": {
									"en": "Given name first"
								}
							},
							{
								"value": "L",
								"title": {
									"en": "Surname first"
								}
							}
						]
					},
					{
						"type": "12BOX",
						"items": [{
							"id": "relationship",
							"title": {
								"en": "Relationship"
							},
							"type": "PICKER",
							"options": "relationship",
							"mandatory": true,
							"validation": "function(i,v,vr,vrv){var a=v[i.id], g=v.gender;if((['GFA','SON','FAT','BRO','GSO'].indexOf(a)>-1 && g=='F') || (['GMO','MOT','DAU','GDA','SIS'].indexOf(a)>-1 && g=='M')){return 601;}}"
						}, {
							"id": "relationshipOther",
							"title": {
								"en": "Please Specify"
							},
							"type": "text",
							"mandatory": true,
							"trigger": {
								"id": "relationship",
								"type": "showIfContains",
								"value": "OTH"
							}
						}]
					},
					{
						"type": "HBOX",
						"shadow": true,
						"key": "mobileNoSection",
						"items": [{
								"id": "mobileCountryCode",
								"type": "picker",
								"subType": "limit",
								"placeholder": {
									"en": "Country code of Mobile"
								},
								"value": "+65",
								"options": "countryTelCode",
								"presentation": "Field25",
								"title": {
									"en": "Mobile No."
								}
							},
							{
								"id": "mobileNo",
								"title": {
									"en": "Mobile No."
								},
								"type": "text",
								"subType": "digit",
								"mandatory": true,
								"validation": "function(i,v,rv,vrv){var c=v.mobileCountryCode||'';i.maxLength=15-c.length;if(v[i.id] && v[i.id].length>i.maxLength){v[i.id]=v[i.id].substring(0,i.maxLength);}}",
								"presentation": "Field75"
							}
						]
					},
					{
						"type": "12BOX",
						"items": [{
								"id": "idDocType",
								"title": {
									"en": "ID Document Type"
								},
								"type": "picker",
								"mandatory": true,
								"validation": "function(i,v,rv,vrv){if(v.nationality=='N1' || v.nationality=='N2' || v.prstatus=='Y'){i.disabled=true;v[i.id]='nric';}else{i.disabled=false}}",
								"options": [{
										"title": {
											"en": "Birth Certificate No."
										},
										"value": "bcNo"
									},{
										"title": {
											"en": "NRIC"
										},
										"value": "nric"
									},
									{
										"title": {
											"en": "FIN"
										},
										"value": "fin"
									},
									{
										"title": {
											"en": "Passport"
										},
										"value": "passport"
									}, {
										"title": {
											"en": "Others"
										},
										"isOther": true,
										"max": 30,
										"value": "other"
									}
								]
							},
							{
								"id": "idDocTypeOther",
								"type": "text",
								"max": 30,
								"placeholder": {
									"en": "Please Specify:"
								},
								"mandatory": true,
								"trigger": {
									"id": "idDocType",
									"type": "showIfContains",
									"value": "other"
								}
							}
						]
					}, {
						"id": "idCardNo",
						"title": {
							"en": "ID Number",
							"zh-Hant": "ID 號"
						},
						"type": "text",
						"max": 20,
						"mandatory": true,
						"formula": "function(i,v,rv,vrv){v[i.id]=v[i.id]&&v[i.id].toUpperCase();}",
						"validation": "function(i, v, rv, vrv) { v[i.id] = v[i.id] ? v[i.id].toUpperCase() : \"\"; if(v.idDocType == 'nric' && v[i.id]) { var a = v[i.id]; if(a.length != 9) { return 604; } var k, icArray = []; for(k = 0; k < 9; k++) { icArray[k] = a.charAt(k); } icArray[1] = parseInt(icArray[1], 10) * 2; icArray[2] = parseInt(icArray[2], 10) * 7; icArray[3] = parseInt(icArray[3], 10) * 6; icArray[4] = parseInt(icArray[4], 10) * 5; icArray[5] = parseInt(icArray[5], 10) * 4; icArray[6] = parseInt(icArray[6], 10) * 3; icArray[7] = parseInt(icArray[7], 10) * 2; var weight = 0; for(k = 1; k < 8; k++) { weight += icArray[k]; } var offset = (icArray[0] == \"T\" || icArray[0] == \"G\") ? 4 : 0; var temp = (offset + weight) % 11; var st = [\"J\", \"Z\", \"I\", \"H\", \"G\", \"F\", \"E\", \"D\", \"C\", \"B\", \"A\"]; var fg = [\"X\", \"W\", \"U\", \"T\", \"R\", \"Q\", \"P\", \"N\", \"M\", \"L\", \"K\"]; var theAlpha; if(icArray[0] == \"S\" || icArray[0] == \"T\") { theAlpha = st[temp]; } if(icArray[8] != theAlpha) { return 604; } } else if(v.idDocType == 'fin' && v[i.id]) { var a = v[i.id]; if(a.length != 9) { return 607; } var k, icArray = []; for(k = 0; k < 9; k++) { icArray[k] = a.charAt(k); } icArray[1] = parseInt(icArray[1], 10) * 2; icArray[2] = parseInt(icArray[2], 10) * 7; icArray[3] = parseInt(icArray[3], 10) * 6; icArray[4] = parseInt(icArray[4], 10) * 5; icArray[5] = parseInt(icArray[5], 10) * 4; icArray[6] = parseInt(icArray[6], 10) * 3; icArray[7] = parseInt(icArray[7], 10) * 2; var weight = 0; for(k = 1; k < 8; k++) { weight += icArray[k]; } var offset = (icArray[0] == \"T\" || icArray[0] == \"G\") ? 4 : 0; var temp = (offset + weight) % 11; var st = [\"J\", \"Z\", \"I\", \"H\", \"G\", \"F\", \"E\", \"D\", \"C\", \"B\", \"A\"]; var fg = [\"X\", \"W\", \"U\", \"T\", \"R\", \"Q\", \"P\", \"N\", \"M\", \"L\", \"K\"]; var theAlpha; if(icArray[0] == \"F\" || icArray[0] == \"G\") { theAlpha = fg[temp]; } if(icArray[8] != theAlpha) { return 607; } } }"
					}
				]
			}
		]
	}]
}