{
	"type": "layout",
	"formId": "menu_person",
	"items": [
		{
			"title": "Proposer",
			"subType": "proposer",
			"priority":"proposer",
			"type": "tab",
			"items": [
				{
					"type": "PARAGRAPH",
					"id": "pWarning",
					"content": "<p>“Pursuant to Section 25(5) of the Insurance Act of Singapore (CAP 142), you are to disclose in this proposal form, fully and faithfully, all the facts which you know or ought to know, or the policy issued below may be void.”</p>",
					"paragraphType": "warning",
					"align": "left",
					"detailSeq": 0
        },
        {
					"type": "PARAGRAPH",
					"id": "pCrossBorderNote",
					"content": "<p>Please note that this is a Cross Border Case and a Certificate of Endorsement (COE) signed by the FSM and FSD is a mandatory requirement to be uploaded for approval of the case.</p>",
					"paragraphType": "warning",
					"align": "left",
          "detailSeq": 0,
          "trigger": {
            "id": "extra.isCrossBorder,extra.channel",
            "type": "dynamicCondition",
            "value": "#1 && #2!=='FA'"
          }
				},
				{
					"id":"personalInfo",
					"type":"Block",
					"items":[
						{
							"id": "branchInfo",
							"title": "Singpost Branch Details",
							"type": "BLOCK",
							"detailSeq": 1,
							"trigger":{
								"id":"extra/channelName",
								"type":"showIfEqual",
								"value":"SINGPOST"
							},
							"items": [
								{
									"type": "HBOX",
									"detailSeq": 1,
									"items": [
										{
											"type": "PICKER",
											"id": "branch",
											"title": "Branch",
											"subType": "limit",
											"mandatory": true,
											"detailSeq": 1,
											"options":"branches"
										},
										{
											"type": "TEXT",
											"id": "bankRefId",
											"title": "Referrer ID",
											"subType": "number_leading_zero",
											"mandatory": true,
											"min": 4,
											"max": 4,
											"detailSeq": 2
										}
									]
								}
							]
						},
						{
							"title": "Details of Proposer",
							"type": "BLOCK",
							"detailSeq": 2,
							"items": [
								{
									"type": "qtitle",
									"title":"Proposer is a Life Assured: ",
									"subTitle":"Yes",
									"trigger":{
										"id":"extra/isPhSameAsLa",
										"type":"showIfEqual",
										"value":"Y"
									}

								},
								{
									"type": "qtitle",
									"title":"Proposer is a Life Assured: ",
									"subTitle":"No",
									"trigger":{
										"id":"extra/isPhSameAsLa",
										"type":"showIfNotEqual",
										"value":"Y"
									}

								},
								{
									"type": "HBOX",
									"detailSeq": 1,
									"items": [
										{
											"type": "READONLY",
											"id": "lastName",
											"emptyValue":"-",
											"title": "Surname (as shown in ID)",
											"detailSeq": 1
										},
										{
											"type": "READONLY",
											"id": "firstName",
											"emptyValue":"-",
											"title": "Given Name (as shown in ID)",
											"detailSeq": 2
										},
										{
											"type": "READONLY",
											"id": "othName",
											"emptyValue":"-",
											"title": "English or other name",
											"detailSeq": 1
										},
										{
											"type": "READONLY",
											"id": "hanyuPinyinName",
											"emptyValue":"-",
											"title": "Han Yu Pin Yin Name",
											"detailSeq": 2
										},
										{
											"type": "READONLY",
											"id": "fullName",
											"title": "Name",
											"detailSeq": 1
										},
										{
											"type": "READONLY",
											"id": "nationality",
											"title": "Nationality",
											"detailSeq": 2,
											"options": "nationality",
											"validation": "function(i,v,rv,vrv){if(v[i.id]==='N1'){v.prStatus='Y';}}"
										},

										{
											"type": "READONLY",
											"id": "prStatus",
											"title": "Singapore PR Status",
											"detailSeq": 1,
											"options": [
												{
													"title": {
														"en": "Yes",
														"zh-Hant": "是"
													},
													"value": "Y"
												},
												{
													"title": {
														"en": "No",
														"zh-Hant": "否"
													},
													"value": "N"
												}
											],
											"trigger": {
												"id": "nationality",
												"type": "showIfNotEqual",
												"value": "N1"
											}
										},
										{
											"id": "idDocType",
											"title": {
												"en": "ID Document Type"
											},
											"trigger": [
												{
													"id": "idDocType",
													"type": "showIfNotEqual",
													"value": "other"
												},
												{
													"id": "idDocType",
													"type": "notEmpty"
												}
											],
											"type": "READONLY",
											"value": "nric",
											"validation": "function(i,v,rv,vrv){if(v.nationality=='N1' || v.prstatus=='Y'){i.disabled=true;v[i.id]='nric';}else{i.disabled=false}}",
											"options": [
												{
													"title": {
														"en": "Birth Certificate No."
													},
													"value": "bcNo"
												},
												{
													"title": {
														"en": "FIN No."
													},
													"value": "fin"
												},
												{
													"title": {
														"en": "NRIC"
													},
													"value": "nric"
												},
												{
													"title": {
														"en": "Passport"
													},
													"value": "passport"
												},
												{
													"title": {
														"en": "Others"
													},
													"isOther": true,
													"max": 30,
													"value": "other"
												}
											]
										},
										{
											"type": "READONLY",
											"id": "idDocTypeOther",
											"title": "ID Type Name",
											"trigger": {
												"id": "idDocType",
												"type": "showIfEqual",
												"value": "other"
											}
										},
										{
											"type": "READONLY",
											"id": "idCardNo",
											"title": "ID Number",
											"detailSeq": 2
										},
										{
											"id": "gender",
											"title": {
												"en": "Gender",
												"zh-Hant": "性別"
											},
											"type": "READONLY",
											"options": [
												{
													"title": {
														"en": "Male",
														"zh-Hant": "男"
													},
													"value": "M"
												},
												{
													"title": {
														"en": "Female",
														"zh-Hant": "女"
													},
													"value": "F"
												}
											],
											"condition": "existing"
										},
										{
											"id": "dob",
											"title": {
												"en": "Date of Birth(DD/MM/YYYY)",
												"zh-Hant": "出生日期(DD/MM/YYYY)"
											},
											"type": "READONLY",
											"subType": "date",
											"min": 100,
											"max": 0,
											"condition": "existing"
										},
										{
											"id": "marital",
											"title": {
												"en": "Marital status",
												"zh-Hant": "婚姻狀況"
											},
											"type": "READONLY",
											"options": "marital"
										},
										{
											"type": "READONLY",
											"id": "email",
											"title": "Email",
											"detailSeq": 1
										},
										{
											"type": "HBOX",
											"detailSeq": 2,
											"title": "Mobile",
											"trigger": {
												"id": "mobileNo",
												"type": "notEmpty"
											},
											"items": [
												{
													"id": "mobileCountryCode",
													"type": "READONLY",
													"subType": "countryCode",
													"placeholder": {
													"en": "Country code of Mobile"
													},
													"value": "+65",
													"options": "countryTelCode"
												},
												{
													"id": "mobileNo",
													"placeholder": {
													"en": "Mobile No."
													},
													"max": 15,
													"type": "READONLY",
													"subType": "phone"
												}
											]
										}
									]
								}
							]
						},
						{
							"type": "Divider"
						},
						{
							"title": "Professional Details",
							"type": "BLOCK",
							"detailSeq": 2,
							"items": [
								{
									"type": "HBOX",
									"detailSeq": 1,
									"items": [
										{
											"type": "TEXT",
											"id": "organization",
											"title": "Name of Employer/Business/School",
											"populate": {
												"module": "client"
											},
											"max": 50,
											"detailSeq": 1,
											"mandatoryTrigger":{
												"id":"occupation",
												"value":["O675", "O674", "O1132", "O1450"],
												"type":"trueIfNotContains"
											}
										},
										{
											"type": "PICKER",
											"subType": "limit",
											"id": "organizationCountry",
											"populate": {
												"module": "client"
											},
											"title": "Country of Employer/Business/School",
											"mandatory": true,
											"detailSeq": 2,
											"options": "residency"
										},
										{
											"type": "READONLY",
											"id": "pass",
											"title": "Type of Pass",
											"detailSeq": 1,
											"options": "pass",
											"triggerType":"and",
											"trigger":
											[
												{
													"id": "nationality",
													"type": "showIfNotEqual",
													"value": "N1"
												},
												{
													"id": "prStatus",
													"type": "showIfEqual",
													"value": "N"
												}
											]
										},
										{
											"type": "READONLY",
											"id": "passOther",
											"title": "Type of pass (Other)",
											"detailSeq": 4,
											"trigger": {
												"id": "pass",
												"type": "showIfEqual",
												"value": "o"
											}
										},
										{
											"type": "DATEPICKER",
											"id": "passExpDate",
											"max":100,
                      						"min":0,
											"title": "Pass Expiry Date (DD/MM/YYYY)",
											"mandatory": true,
											"detailSeq": 2,
											"populate": {
												"module": "client"
											},
											"triggerType":"and",
											"trigger":
											[
												{
													"id": "nationality",
													"type": "showIfNotEqual",
													"value": "N1"
												},
												{
													"id": "prStatus",
													"type": "showIfEqual",
													"value": "N"
												}
											]
										},
										{
											"type": "READONLY",
											"id": "industry",
											"title": "Industry",
											"subType":"picker",
											"detailSeq": 2,
											"options": "industry"
										},
										{
											"id": "occupation",
											"title": "Occupation",
											"subType":"picker",
											"type": "READONLY",
											"options": "occupation"
                    },
                    {
											"id": "occupationOther",
											"title": "Occupation (Other)",
                      "type": "READONLY",
                      "trigger": {
                        "id": "occupation",
                        "type": "showIfEqual",
                        "value": "O921"
                      }
										},
										{
											"type": "READONLY",
											"id": "allowance",
											"subType": "currency",
											"title": "Monthly Income/Allowance SGD",
											"detailSeq": 6,
											"min": 0,
											"max": 9999999999,
											"showZeroValue": true,
											"ccy": "SGD"
										}
									]
								}
							]
						},
						{
							"title": "Residential Address",
							"type": "BLOCK",
							"detailSeq": 3,
							"items": [
								{
									"type": "HBOX",
									"detailSeq": 1,
									"items": [
										{
											"id": "addrCountry",
											"title": "Country",
											"value": "R2",
											"options": "residency",
											"type": "READONLY"
										},
										{
											"id": "postalCode",
											"subType": "postalcode",
											"countryAllowed": "addrCountry",
											"mapping": {
												"bldgNo": "addrBlock,12",
												"bldgName": "addrEstate,40",
												"streetName": "addrStreet,24"
											},
											"title": {
												"en": "Postal Code"
											},
											"type": "text",
											"mandatory":true,
											"max": 10
										},
										{
											"type": "TEXT",
											"id": "addrBlock",
											"title": "Block/House Number",
											"mandatory":true,
											"detailSeq": 1,
											"max": 12,
											"populate": {
												"module": "client"
											}
										},
										{
											"type": "TEXT",
											"id": "addrStreet",
											"title": "Street/Road Name",
											"mandatory":true,
											"detailSeq": 2,
											"max": 24
										},
										{
											"id": "unitNum",
											"title": {
												"en": "Unit Number"
											},
											"emptyValue":"-",
											"type": "text",
											"subType": "unit_no",
											"max":13,
											"populate": {
												"module": "client"
											}
										},
										{
											"id": "addrEstate",
											"title": "Building/ Estate Name",
											"emptyValue":"-",
											"type": "text",
											"max": 40,
											"populate": {
												"module": "client"
											}
										},
										{
											"id": "addrCity",
											"disablePicker":{
												"id":"addrCountry",
												"value":"city",
												"type":"trueIfNotContains"
											},
											"disableTrigger":{
												"id":"addrCountry",
												"value":"city",
												"type":"trueIfContains"
											},
											"emptyValue":"-",
											"title": "City/State",
											"max":12,
											"type": "picker",
											"options":"city"
										},
										{
											"id": "otherResidenceCity",
											"title": {
												"en": "Others"
											},
											"disableTrigger":{
												"id":"addrCountry",
												"value":"city",
												"type":"trueIfContains"
											},
											"emptyValue":"-",
											"trigger": {
												"type": "dynamicCondition",
												"id": "addrCountry,addrCity",
												"value": "!_.isUndefined(#1) && ((#1 ==='R52' || #1 ==='R53' || #1 ==='R72' || #1 ==='R54' || #1 ==='R120' || #1 ==='R134' || #1 ==='R147') && (!_.isUndefined(#2) && (#2 ==='T110' || #2 ==='T120'|| #2 ==='T224'|| #2 ==='T205' || #2 ==='T207'|| #2 ==='T208'|| #2 ==='T209' )))"
											},
											"type": "text",
											"subType": "text",
											"maxLength": 50
										}
									]
								},

								{
									"type": "QRADIOGROUP",
									"id": "isSameAddr",
									"mandatory":true,
									"title": "Is your Residential Address same as mailing address?",
									"horizontal": true,
									"value":"Y",
									"align": "left",
									"options": [
										{
											"value": "Y",
											"title": "Yes"
										},
										{
											"value": "N",
											"title": "No"
										}
									]
								}
							]
						},
						{
							"type": "Divider"
						},
						{
							"title": "Mailing Address",
							"type": "BLOCK",
							"detailSeq": 3,
							"trigger": {
								"id": "isSameAddr",
								"type": "showIfEqual",
								"value": "N"
							},
							"items": [
								{
									"type": "HBOX",
									"detailSeq": 1,
									"items": [
										{
											"id": "mAddrCountry",
											"mandatory":true,
											"title": {
												"en": "Country"
											},
											"value": "R2",
											"options": "residency",
											"type": "picker",
											"subType": "limit"
										},
										{
											"id": "mPostalCode",
											"mandatory":true,
											"subType": "postalcode",
											"countryAllowed": "mAddrCountry",
											"mapping": {
												"bldgNo": "mAddrBlock,12",
												"bldgName": "mAddrEstate,40",
												"streetName": "mAddrStreet,24"
											},
											"title": {
												"en": "Postal Code"
											},
											"type": "text",
											"max": 10
										}
									]
								},
								{
									"type": "HBOX",
									"detailSeq": 2,
									"items": [
										{
											"type": "TEXT",
											"mandatory":true,
											"id": "mAddrBlock",
											"title": "Block/House Number",
											"detailSeq": 1,
											"max": 12,
											"populate": {
												"module": "client"
											}
										},
										{
											"type": "TEXT",
											"mandatory":true,
											"id": "mAddrStreet",
											"title": "Street/Road Name",
											"detailSeq": 2,
											"max": 24
										}
									]
								},
								{
									"type": "HBOX",
									"detailSeq": 3,
									"items": [
										{
											"id": "mAddrnitNum",
											"title": {
												"en": "Unit Number"
											},
											"type": "text",
											"subType": "unit_no",
											"max":13,
											"populate": {
												"module": "client"
											}
										},
										{
											"id": "mAddrEstate",
											"title": "Building/ Estate Name",
											"type": "text",
											"max": 40,
											"populate": {
												"module": "client"
											}
										}
									]
								},
								{
									"type": "HBOX",
									"detailSeq": 3,
									"items": [
										{
											"id": "mAddrCity",
											"max":12,
											"title": "City/State",
											"type": "text"
										}
									]
								}
							]
						}
					]
				}
			]
		},
		{
			"title": "Life Assured",
			"subType": "insured",
			"priority":"proposer",
			"type": "tab",
			"items": [
				{
					"type": "PARAGRAPH",
					"id": "iWarning",
					"paragraphType": "warning",
					"align": "left",
					"content": "<p>“Pursuant to Section 25(5) of the Insurance Act of Singapore (CAP 142), you are to disclose in this proposal form, fully and faithfully, all the facts which you know or ought to know, or the policy issued below may be void.”</p>",
					"detailSeq": 0
				},
				{
					"type": "BLOCK",
					"id": "personalInfo",
					"detailSeq": 1,
					"items": [
						{
						"title": "Details of Life Assured",
						"type": "BLOCK",
						"items":[
								{
									"type": "HBOX",
									"detailSeq": 1,
									"items": [
										{
											"type": "READONLY",
											"id": "relationship",
											"title": "Relationship to Proposer",
											"detailSeq": 1,
											"trigger":{
												"id":"relationship",
												"type":"showIfNotEqual",
												"value":"OTH"
											},
											"options": "relationship"
										},
										{
											"type": "READONLY",
											"id": "relationshipOther",
											"title": "Relationship to Proposer",
											"trigger":{
												"id":"relationship",
												"type":"showIfEqual",
												"value":"OTH"
											}
										},
										{
											"type": "READONLY",
											"id": "lastName",
											"emptyValue":"-",
											"title": "Surname (as shown in ID)",
											"detailSeq": 2,
											"max": 30
										},
										{
											"type": "READONLY",
											"id": "firstName",
											"title": "Given Name (as shown in ID)",
											"detailSeq": 1,
											"max": 30
										},
										{
											"type": "READONLY",
											"id": "othName",
											"emptyValue":"-",
											"title": "English or other name",
											"detailSeq": 2,
											"max": 30
										},
										{
											"type": "READONLY",
											"id": "hanyuPinyinName",
											"emptyValue":"-",
											"title": "Han Yu Pin Yin Name",
											"detailSeq": 1,
											"max": 30
										},
										{
											"type": "READONLY",
											"id": "fullName",
											"emptyValue":"-",
											"title": "Name",
											"detailSeq": 2,
											"max": 50
										},
										{
											"id": "nationality",
											"title": {
												"en": "Nationality",
												"zh-Hant": "居住國家"
											},
											"type": "READONLY",
											"options": "nationality"
										},
										{
											"id": "prStatus",
											"title": {
												"en": "Singapore PR status",
												"zh-Hant": "PR status"
											},
											"trigger": {
												"type": "showIfNotEqual",
												"id": "nationality",
												"value": "N1"
											},
											"type": "READONLY",
											"options": [
												{
													"title": {
														"en": "Yes",
														"zh-Hant": "是"
													},
													"value": "Y"
												},
												{
													"title": {
														"en": "No",
														"zh-Hant": "否"
													},
													"value": "N"
												}
											]
										},
										{
											"type": "READONLY",
											"id": "idDocType",
											"title": "ID Document Type",
											"trigger": [
                        {
                          "id": "idDocType",
                          "type": "showIfNotEqual",
                          "value": "other"
                        },
                        {
                          "id": "idDocType",
                          "type": "notEmpty"
                        }
                      ],
											"detailSeq": 1,
											"value": "nric",
											"options": [
												{
													"title": {
														"en": "Birth Certificate No."
													},
													"value": "bcNo"
												},
												{
													"title": {
														"en": "FIN No."
													},
													"value": "fin"
												},
												{
													"title": {
														"en": "NRIC"
													},
													"value": "nric"
												},
												{
													"title": {
														"en": "Passport"
													},
													"value": "passport"
												},
												{
													"title": {
														"en": "Others"
													},
													"isOther": true,
													"max": 30,
													"value": "other"
												}
											]
										},
										{
											"id": "idDocTypeOther",
											"type": "READONLY",
											"max": 30,
											"title": "ID Type Name",
											"trigger": {
												"id": "idDocType",
												"type": "showIfContains",
												"value": "other"
											}
										},
										{
											"type": "READONLY",
											"id": "idCardNo",
											"title": {
												"en": "ID Number",
												"zh-Hant": "ID 號"
											},
											"max": 20
										},
										{
											"id": "gender",
											"title": {
												"en": "Gender",
												"zh-Hant": "性別"
											},
											"type": "READONLY",
											"options": [
												{
													"title": {
														"en": "Male",
														"zh-Hant": "男"
													},
													"value": "M"
												},
												{
													"title": {
														"en": "Female",
														"zh-Hant": "女"
													},
													"value": "F"
												}
											],
											"condition": "existing"
										},
										{
											"id": "dob",
											"title": {
												"en": "Date of Birth(DD/MM/YYYY)",
												"zh-Hant": "出生日期(DD/MM/YYYY)"
											},
											"type": "READONLY",
											"subType": "date",
											"min": 100,
											"max": 0,
											"condition": "existing"
										},
										{
											"id": "marital",
											"title": {
												"en": "Marital status",
												"zh-Hant": "婚姻狀況"
											},
											"type": "READONLY",
											"options": "marital"
										},
										{
											"type": "HBOX",
											"detailSeq": 2,
											"title": "Mobile",
											"trigger": {
												"id": "mobileNo",
												"type": "notEmpty"
											},

											"items": [
												{
													"id": "mobileCountryCode",
													"type": "READONLY",
													"subType": "countryCode",
													"placeholder": {
														"en": "Country code of Mobile"
													},
													"value": "+65",
													"options": "countryTelCode"
												},
												{
													"id": "mobileNo",
													"placeholder": {
														"en": "Mobile No."
													},
													"max": 15,
													"type": "READONLY",
													"subType": "phone"
												}
											]
										}
									]
								}
							]
						},
						{
							"title": "Professional Details",
							"type": "BLOCK",
							"detailSeq": 2,
							"items": [
								{
									"type": "HBOX",
									"detailSeq": 1,
									"items": [
										{
											"type": "TEXT",
											"id": "organization",
											"title": "Name of Employer/Business/School",
											"populate": {
												"module": "client"
											},
											"max": 50,
											"detailSeq": 1,
											"mandatory":true,
											"mandatoryTrigger":{
												"id":"occupation",
												"value":["O675", "O674", "O1132", "O1450"],
												"type":"trueIfNotContains"
											}
										},
										{
											"type": "PICKER",
											"subType": "limit",
											"id": "organizationCountry",
											"populate": {
												"module": "client"
											},
											"title": "Country of Employer/Business/School",
											"detailSeq": 2,
											"options": "residency",
											"mandatory":true,
											"validation": "function(i,v,rv,vrv){if (v.organizationCountry=='na') {i.disabled=true;} else {i.disabled=false;}}"
										},
										{
											"type": "READONLY",
											"id": "pass",
											"title": "Type of Pass",
											"detailSeq": 1,
											"options": "pass",
											"trigger":
											[
												{
													"id": "nationality",
													"type": "showIfNotEqual",
													"value": "N1"
												},
												{
													"id": "prStatus",
													"type": "showIfEqual",
													"value": "N"
												}
											],
											"triggerType":"and"
										},
										{
											"type": "READONLY",
											"id": "passOther",
											"title": "Type of pass (Other)",
											"detailSeq": 4,
											"trigger": {
												"id": "pass",
												"type": "showIfEqual",
												"value": "o"
											}
										},
										{
											"type": "DATEPICKER",
											"id": "passExpDate",
											"title": "Pass Expiry Date (DD/MM/YYYY)",
											"mandatory": true,
											"detailSeq": 2,
											"max":100,
                      						"min":0,
                      						"triggerType":"and",
											"populate": {
												"module": "client"
											},
											"trigger":
											[
												{
													"id": "nationality",
													"type": "showIfNotEqual",
													"value": "N1"
												},
												{
													"id": "prStatus",
													"type": "showIfEqual",
													"value": "N"
												}
											]
										},
										{
											"type": "READONLY",
											"id": "industry",
											"subType":"picker",
											"title": "Industry",
											"detailSeq": 2,
											"options": "industry"
										},
										{
											"id": "occupation",
											"subType":"picker",
											"title": "Occupation",
											"type": "READONLY",
											"options": "occupation"
                    },
                    {
											"id": "occupationOther",
											"title": "Occupation (Other)",
                      "type": "READONLY",
                      "trigger": {
                        "id": "occupation",
                        "type": "showIfEqual",
                        "value": "O921"
                      }
										},
										{
											"type": "READONLY",
											"id": "allowance",
											"subType": "currency",
											"title": "Monthly Income/Allowance SGD",
											"detailSeq": 6,
											"min": 0,
                      "max": 9999999999,
                      "showZeroValue": true,
                      "ccy": "SGD"
										}
									]
								}
							]
						},
						{
							"type": "Divider"
						},
						{
							"title": "Residential Address",
							"type": "BLOCK",
							"laAddress":true,
							"detailSeq": 3,
							"items": [
								{
									"type": "HBOX",
									"detailSeq": 1,
									"items": [
										{
											"id": "addrCountry",
											"title": "Country",
											"value": "R2",
											"mandatory":true,
											"options": "residency",
											"type": "READONLY"
										},
										{
											"id": "postalCode",
											"subType": "postalcode",
											"countryAllowed": "addrCountry",
											"mapping": {
												"bldgNo": "addrBlock,12",
												"bldgName": "addrEstate,40",
												"streetName": "addrStreet,24"
											},
											"title": {
												"en": "Postal Code"
											},
											"mandatory":true,
											"type": "text",
											"max": 10
										}
									]
								},
								{
									"type": "HBOX",
									"detailSeq": 2,
									"items": [
										{
											"type": "TEXT",
											"id": "addrBlock",
											"title": "Block/House Number",
											"mandatory":true,
											"detailSeq": 1,
											"max": 12,
											"populate": {
												"module": "client"
											}
										},
										{
											"type": "TEXT",
											"id": "addrStreet",
											"mandatory":true,
											"title": "Street/Road Name",
											"detailSeq": 2,
											"max": 24
										}
									]
								},
								{
									"type": "HBOX",
									"detailSeq": 3,
									"items": [
										{
											"id": "unitNum",
											"title": {
												"en": "Unit Number"
											},
											"type": "text",
											"emptyValue":"-",
											"subType": "unit_no",
											"max":13,
											"populate": {
												"module": "client"
											}
										},
										{
											"id": "addrEstate",
											"title": "Building/ Estate Name",
											"emptyValue":"-",
											"type": "text",
											"max": 40,
											"populate": {
												"module": "client"
											}
										}
									]
								},
								{
									"type": "HBOX",
									"detailSeq": 3,
									"items": [
										{
											"id": "addrCity",
											"title": "City/State",
											"emptyValue":"-",
											"type": "picker",
											"options":"city",
										"max": 12,
										"disablePicker":{
												"id":"addrCountry",
												"value":"city",
												"type":"trueIfNotContains"
											},
											"disableTrigger":{
												"id":"addrCountry",
												"value":"city",
												"type":"trueIfContains"
											}
										},
										{
											"id": "otherResidenceCity",
											"title": {
												"en": "Others"
											},
											"disableTrigger":{
												"id":"addrCountry",
												"value":"city",
												"type":"trueIfContains"
											},
											"emptyValue":"-",
											"trigger": {
												"type": "dynamicCondition",
												"id": "addrCountry,addrCity",
												"value": "!_.isUndefined(#1) && ((#1 ==='R52' || #1 ==='R53' || #1 ==='R72' || #1 ==='R54' || #1 ==='R120' || #1 ==='R134' || #1 ==='R147') && (!_.isUndefined(#2) && (#2 ==='T110' || #2 ==='T120'|| #2 ==='T224'|| #2 ==='T205' || #2 ==='T207'|| #2 ==='T208'|| #2 ==='T209' )))"

											},
											"type": "text",
											"subType": "text",
											"maxLength": 50
										}
									]
								}
							]
						}
					]
				}
			]
		}
	]
}
