{
	"TYPE": "agent",
	"compCode": "AG",
	"agentCode": "011124",
	"role": "02",
	"name": "S8073125A AGENCY",
	"profileId": "S8073125A",
	"channel": "AGENCY",
	"createDate": "7/1/2017",
	"lastUpdateDate": "7/14/2017",
	"company": "AXA Insurance Pte Ltd (Co. Reg. No. 199903512M)",
	"tel": "99011124",
	"mobile": "66011124",
	"email": "clement.chew@axa.com.sg",
	"position": "Agent",
	"manager": "S8073125A AGENCY(M)",
	"managerCode": "100001",
	"achievements": "AXA Signature",
	"authorised": "M9A, M9, M5, HI, M8, M8A, IFAST"
}