
{
    "compCode"  : "08",
    "type"      : "material",
    "section"   : "NB Admin Form",
    "sectionId" : "nbadmin",
    "name"      : "CRS Self Cert form _ Controlling Person",
    "id"        : "NBform09_1",
    "effDate"   : "2017-05-22 14:10:34",
    "expDate"   : "2118-05-22 14:19:47"  
}