{
    "compCode": "08",
    "effDate": "2018-03-21 15:30:36",
    "expDate": "2019-03-21 15:31:44",
    "fHeight": "",
    "footer": {
        "en": "<div class=\"global_intro\">\n<xsl:if test=\"*/mainInfo/quickQuote='Y'\">\n<table style=\"text-align: left; table-layout: fixed; width: 100%; font-size: 10pt; margin: 0 auto;\">\n<tbody>\n<tr style=\"color: white;\">\n<td style=\"padding-left: 50px;\">\n<div style=\"border-bottom: solid 1px black; width: 80%;\">1</div>\n</td>\n<td style=\"padding-left: 50px;\">\n<div style=\"border-bottom: solid 1px black; width: 80%;\">2</div>\n</td>\n</tr>\n<tr>\n<td style=\"padding-left: 50px; padding-top: 3px;\">Adviser's Signature</td>\n<td style=\"padding-left: 50px; padding-top: 3px;\">Proposer's Signature</td>\n</tr>\n<tr>\n<td style=\"padding-left: 50px;\">Date:</td>\n<td style=\"padding-left: 50px;\">Date:</td>\n</tr>\n</tbody>\n</table>\n</xsl:if>\n<table style=\"width: 100%; font-size: 10pt;\">\n<tbody>\n<tr>\n<td style=\"width: 49.8018%;\">\n<strong>Page [[@PAGE_NO]] of [[@TOTAL_PAGE]]</strong>\n</td>\n<td style=\"text-align: right; width: 46.1982%;\">Release Version\n<xsl:value-of select=\"*/releaseVersion\"/>\n</td>\n</tr>\n</tbody>\n</table>\n<p></p>\n<div class=\"smallerfont\" style=\"text-align: center;\">\n<xsl:value-of select=\"*/footer/compName\"/> (Co. Reg. No.\n<xsl:value-of select=\"*/footer/compRegNo\"/>)</div>\n<div class=\"smallerfont\" style=\"text-align: center;\">\n<xsl:value-of select=\"*/footer/compAddr\"/>\n</div>\n<div class=\"smallerfont\" style=\"text-align: center;\">\n<xsl:value-of select=\"*/footer/compAddr2\"/> TEL:\n<xsl:value-of select=\"*/footer/compTel\"/> FAX:\n<xsl:value-of select=\"*/footer/compFax\"/>\n</div>\n<div class=\"smallerfont\" style=\"text-align: center;\">\n<xsl:value-of select=\"*/footer/compWeb\"/>\n</div>\n</div>",
        "zh-Hant": "<p></p>"
    },
    "formulas": {
        "prepareReportData": "function (quotation, planInfo, planDetails, extraPara) {return {}; }"
    },
    "hHeight": "",
    "header": {
        "en": "<table style=\"width: 100%;\">\n<tbody>\n<tr>\n<td>\n<div class=\"logo\"></div>\n</td>\n<td style=\"float: right; width: 200px;\"></td>\n</tr>\n</tbody>\n</table>",
        "zh-Hant": "<p></p>"
    },
    "launchDate": "2018-03-21 15:31:28",
    "pdfCode": "LMP_Main_BI",
    "pdfName": {
        "en": "LMP Main BI",
        "zh-Hant": "LMP Main BI",
        "zh-tw": "LMP Main BI"
    },
    "ref_no": "LMP Main BI",
    "releaseDate": "2018-06-04 12:36:10",
    "remarks": {
        "en": "LMP Main BI",
        "zh-tw": "LMP Main BI"
    },
    "status": "A",
    "style": "",
    "task_desc": "LMP_Main_BI",
    "template": {
        "en": [
            "<div class=\"global_main\">\n    <table class=\"w100\">\n        <thead>\n            <tr>\n                <th colspan=\"4\" style=\"text-align: center; width: 100%; padding-bottom: 10px;\"><strong>MAIN BENEFIT ILLUSTRATION</strong></th>\n            </tr>        \n\n            <tr style=\"\">\n                <td class=\"vtop vpd2 bold tleft\" style=\" width: 20%;\">Proposal on the life of </td>\n                <td class=\"vtop vpd2 bold tleft\" style=\" width: 40%;\">:\n                    <xsl:value-of select=\"*/life_assured_details/l_assured_name\" />\n                </td>\n                <td class=\"vtop vpd2 bold tleft\" style=\" width: 20%;\">\n                    <div>Date</div>\n                </td>\n                <td class=\"vtop vpd2 bold tleft\" style=\" width: 20%;\">\n                    <div>:\n                        <xsl:value-of select=\"*/cover/genDate\" />\n                    </div>\n                </td>\n            </tr>\n            <tr style=\"border-bottom: solid 1pt black\">\n                <td class=\"vtop vpd2 bold tleft\" style=\" width: 20%;\">Gender</td>\n                <td class=\"vtop vpd2 bold tleft\" style=\" width: 40%;\">:\n                    <xsl:value-of select=\"*/life_assured_details/l_assured_gender\" /> (<xsl:value-of select=\"*/life_assured_details/l_assured_smoke\" />)\n                </td>\n                <td class=\"vtop vpd2 bold tleft\" style=\" width: 20%;\">Age</td>\n                <td class=\"vtop vpd2 bold tleft\" style=\" width: 20%;\">:\n                    <xsl:value-of select=\"*/life_assured_details/l_assured_age\" /> (As at\n                    <xsl:value-of select=\"*/life_assured_details/l_comm_date\" />)</td>\n            </tr>\n            <tr>\n                <th colspan=\"6\" style=\"text-align: center; width: 100%; padding-bottom: 2px;\"></th>\n            </tr>   \n        </thead>\n        <tbody>\n            <tr>\n                <td colspan=\"6\">\n                    <div style=\"font-size: 10pt;padding-top: 8px;width:100%;\">\n                    \n                        <table>\n                            <thead>\n                                <tr>\n                                    <th class=\"alignleft underl\" colspan=\"3\">Summary of Basic Plan Selected\n                                    </th>\n                                </tr>\n                            </thead>\n                            <tbody>\n                                <tr>\n                                    <td class=\"vtop vpd2\" style=\"width:40%;\">Basic Policy Plan</td>\n                                    <td class=\"vtop vpd2\">\n                                        :\n                                        <xsl:value-of select=\"*/mainbi/Basic_Policy_Name\" />\n                                    </td>\n                                    <td></td>\n                                </tr>\n                                <tr>\n                                    <td class=\"vtop vpd2\"  style=\"width:40%;\">Sum Assured</td>\n                                    <td class=\"vtop vpd2\">\n                                        :\n                                        <xsl:value-of select=\"*/mainbi/Sum_Assured\" />\n                                    </td>\n                                    <td></td>\n                                </tr>\n                                <tr>\n                                    <td class=\"vtop vpd2\"  style=\"width:40%;\">Multiplying Factor</td>\n                                    <td class=\"vtop vpd2\">\n                                        :\n                                        <xsl:value-of select=\"*/mainbi/Multiplying_Factor\" />\n                                    </td>\n                                    <td></td>\n                                </tr>\n                            </tbody>\n                        </table>\n                    \n                        <div class=\"emptyspace10\"></div>\n                    \n                        <table>\n                            <tbody>\n                                <tr style=\"vertical-align: top;\" height=\"80px\">\n                                    <td class=\"vtop pd2\" style=\"width: 40%\">\n                                        <b>Multiplier Benefit (at point of sale)<br />[Choice of Multiplying Factor X Sum<br />Assured]\n                                        </b>\n                                    </td>\n                                    <td class=\"vtop pd2\" style=\"width: 30%\">\n                                        <b>On or before the Policy Anniversary nearest to the Life Assured’s 70th birthday</b>\n                                    </td>\n                                    <td class=\"vtop pd2\" style=\"width: 30%\"> \n                                        <b>Immediately following the Policy Anniversary nearest to the Life Assured’s 70th birthday until the Multiplier\n                                            Benefit Expiry Age\n                                            <sup>1</sup>\n                                        </b>\n                                    </td>\n                                </tr>\n                                <tr>\n                                    <td>Death or Terminal Illness</td>\n                                    <td>\n                                        <xsl:value-of select=\"*/mainbi/MB1_Death\" />\n                                    </td>\n                                    <td>\n                                        <xsl:value-of select=\"*/mainbi/MB2_Death\" />\n                                    </td>\n                                </tr>\n                                <tr>\n                                    <td>Total and Permanent Disability Benefit</td>\n                                    <td>\n                                        <xsl:value-of select=\"*/mainbi/MB1_TPD\" />\n                                    </td>\n                                    <td>\n                                        <xsl:value-of select=\"*/mainbi/MB2_TPD\" />\n                                    </td>\n                                </tr>\n                                <tr>\n                                    <td>Accidental Death Benefit\n                                        <sup>2</sup>\n                                    </td>\n                                    <td>\n                                        <xsl:value-of select=\"*/mainbi/MB1_ADB\" />\n                                    </td>\n                                    <td>\n                                        <xsl:value-of select=\"*/mainbi/MB2_ADB\" />\n                                    </td>\n                                </tr>\n                            </tbody>\n                        </table>\n                    \n                        <div class=\"emptyspace10\"></div>\n                    \n                        <p>The Multiplier Benefit is applicable on Death, Terminal Illness and Total and Permanent Disability Benefit. </p>\n                        <p>\n                            <sup>1</sup>Multiplier Benefit Expiry Age means on or before the Policy Anniversary nearest to Life Assured's 80th birthday.</p>\n                        <p>\n                            <sup>2</sup>Accidental Death Benefit is payable in addition to the prevailing Death Benefit. The amount shown here assumes\n                            the Multiplier Benefit^ on Death is payable. </p>\n                        <p>The benefits payable on or before the Policy Anniversary nearest to the Life Assured’s 80th birthday is the higher of:\n                            <br/>\n                            <span style=\"margin: 0 15px 0 30px\">-</span> the prevailing Multiplier Benefit; or\n                            <br/>\n                            <span style=\"margin: 0 15px 0 30px\">-</span> Sum Assured plus accumulated bonuses, if any;\n                            <br/>less any outstanding indebtedness under the policy.\n                        </p>\n                        <p>Upon expiry of the Multiplier Benefit, the benefit payable under Death or Terminal Illness is the Sum Assured of the\n                            Basic Policy plus accumulated bonuses, if any, less any outstanding indebtedness.</p>\n                        <p>^ These shall also be referred to as the “prevailing Multiplier Benefit”, where applicable.</p>\n                        \n                    \n                    </div>                    \n                    \n                    <div id=\"pageIntro\" class=\"pagebreak\">\n                        <div class=\"page_all\">                       \n                            <p>\n                                <u>INTRODUCTION</u>\n                            </p>\n                            <p>AXA Insurance Pte Ltd believes that it is important that you fully appreciate the benefits of your policy. You should\n                                also understand how the cost of your insurance cover and the expenses of administration and sales affect the\n                                benefits that you will receive. </p>\n                            <p>The illustration that follows shows how the value of your policy progresses over time and the sum(s) that would be\n                                payable. The methods used to derive the values shown follow guidelines established by the Life Insurance Association,\n                                Singapore, to ensure that a fair and consistent approach is used in preparing this illustration. </p>\n                            <p>Please note that your policy provides a combination of (1) guaranteed benefits and (2) non-guaranteed benefits in\n                                the form of bonuses / cash dividends. The bonus rates / dividend scales used in this illustration are not guaranteed\n                                and may vary according to the performance of the Participating Fund. </p>\n                            <p>Buying a life insurance policy can be a long-term commitment. An early termination of the policy usually involves\n                                high costs and the surrender value payable may be less than the total premiums paid. </p>\n                            <p>If you need clarification please do not hesitate to ask your adviser. </p>\n                            <p>This Policy is protected under the Policy Owners' Protection Scheme which is administered by the Singapore Deposit\n                                Insurance Corporation (SDIC). Coverage for your policy is automatic and no further action is required from you.\n                                For more information on the types of benefits that are covered under the scheme as well as the limits of coverage,\n                                where applicable, please contact AXA Insurance Pte Ltd or visit the LIA or SDIC web-sites (<a class=\"link\" href=\"www.lia.org.sg\">www.lia.org.sg</a> or <a class=\"link\" href=\"www.sdic.org.sg\">www.sdic.org.sg</a>).</p>\n                            <p>\n                                <u>IMPORTANT NOTES</u>\n                            </p>\n                            <p>1. The Benefit Illustration is intended for illustrative purposes only. The terms and conditions are specified in\n                                the policy contract. </p>\n                            <p>2. The quotation is applicable to standard life. </p>\n                    \n                        </div>\n                    </div>                    \n                    \n                    <div id=\"pageDeath\" class=\"pagebreak\">\n                        <div class=\"page_all\">                            \n                    \n                            <table>\n                                <tbody>\n                                    <tr>\n                                        <td class=\"vtop vpd2\" style=\"width:35%;\">Basic Policy Plan</td>\n                                        <td class=\"vtop vpd2\">\n                                            :\n                                            <xsl:value-of select=\"*/mainbi/Basic_Policy_Name\" />\n                                        </td>\n                                        <td></td>\n                                    </tr>\n                                    <tr>\n                                        <td class=\"vtop vpd2\">Sum Assured</td>\n                                        <td class=\"vtop vpd2\">\n                                            :\n                                            <xsl:value-of select=\"*/mainbi/Sum_Assured\" />\n                                        </td>\n                                        <td></td>\n                                    </tr>\n                                    <tr>\n                                        <td class=\"vtop vpd2\">Payment Frequency</td>\n                                        <td class=\"vtop vpd2\">\n                                            :\n                                            <xsl:value-of select=\"*/mainbi/Payment_Frequency\" />\n                                        </td>\n                                        <td></td>\n                                    </tr>\n                                    <tr>\n                                        <td class=\"vtop vpd2\">Annual Premium</td>\n                                        <td class=\"vtop vpd2\">\n                                            :\n                                            <xsl:value-of select=\"*/illustration/Annual_Premium\" />\n                                        </td>\n                                        <td></td>\n                                    </tr>\n                                    <tr>\n                                        <td class=\"vtop vpd2\">Multiplier Benefit*</td>\n                                        <td class=\"vtop vpd2\">\n                                            :\n                                            <xsl:value-of select=\"*/mainbi/Multiplier_Benefit_1\" />\n                                        </td>\n                                        <td></td>\n                                    </tr>\n                                    <tr>\n                                        <td class=\"vtop vpd2\">Policy Currency</td>\n                                        <td class=\"vtop vpd2\">\n                                            :\n                                            <xsl:value-of select=\"*/basic_plan/policy_currency\" />\n                                        </td>\n                                        <td></td>\n                                    </tr>\n                                </tbody>\n                            </table>\n                            <div class=\"emptyspace10\"></div>\n                            <div>* The Multiplier Benefit is applicable up to the Policy Anniversary nearest to the Life Assured’s 80th birthday.\n                                The relevant Multiplying Factor will be used in the calculation of your prevailing Multiplier Benefit at the\n                                point of claim(s).</div>\n                            <div class=\"line\"></div>\n                            <div class=\"emptyspace10\"></div>\n                    \n                            <table style=\"width:100%; text-align: center\">\n                                <thead>\n                                    <tr>\n                                        <th></th>\n                                        <th></th>\n                                        <th colspan=\"6\" class=\"bgblack white\">DEATH BENEFIT</th>\n                                    </tr>\n                                    <tr>\n                                        <td rowspan=\"2\" class=\"vtop\" style=\"width: 10%\">End of\n                                            <br/>Policy\n                                            <br/>Year/Age</td>\n                                        <td rowspan=\"2\" class=\"vtop\" style=\"width: 10%\">Total\n                                            <br/>Premiums\n                                            <br/>Paid\n                                            <br/> To-date\n                                        </td>\n                                        <td rowspan=\"2\" class=\"vtop\" style=\"width: 15%\">Multiplier\n                                            <br/>Benefit</td>\n                                        <td rowspan=\"2\" class=\"vtop\" style=\"width: 15%\">Guaranteed</td>\n                                        <td colspan=\"2\" class=\"vtop\" style=\"width: 25%\">Projected at\n                                            <br/>\n                                            <xsl:value-of select=\"*/others/lowIRR\" /> % Investment\n                                            <br/> Return\n                                        </td>\n                                        <td colspan=\"2\" class=\"vtop\" style=\"width: 25%\">Projected at\n                                            <br/>\n                                            <xsl:value-of select=\"*/others/highIRR\" /> % Investment\n                                            <br/> Return\n                                        </td>\n                                    </tr>\n                                    <tr>\n                                        <td class=\"vtop\" style=\"width: 15%\">Non-Guaranteed\n                                        </td>\n                                        <td class=\"vtop\" style=\"width: 10%\">Total<sup>3</sup>\n                                        </td>\n                                        <td class=\"vtop\" style=\"width: 15%\">Non-Guaranteed\n                                        </td>\n                                        <td class=\"vtop\" style=\"width: 10%\">Total<sup>3</sup>\n                                        </td>\n                                    </tr>\n                                    <tr>\n                                        <td class=\"vtop\"></td>\n                                        <td class=\"vtop pdDollar\">(S$)</td>\n                                        <td class=\"vtop pdDollar\">(S$)</td>\n                                        <td class=\"vtop pdDollar\">(S$)</td>\n                                        <td class=\"vtop pdDollar\">(S$)</td>\n                                        <td class=\"vtop pdDollar\">(S$)</td>\n                                        <td class=\"vtop pdDollar\">(S$)</td>\n                                        <td class=\"vtop pdDollar\">(S$)</td>\n                                    </tr>\n                                </thead>\n                                <tbody style=\"vertical-align: top;\">\n                    \n                                    <xsl:for-each select=\"*/illustration/deathBenefit\">\n                                        <tr>\n                                            <td class=\"tdCol\">\n                                                <xsl:value-of select=\"policyYearAge\" />\n                                            </td>\n                                            <td class=\"tdCol\">\n                                                <xsl:value-of select=\"totalPremiumPaidToDate\" />\n                                            </td>\n                                            <td class=\"tdCol\">\n                                                <xsl:value-of select=\"multiplierBenefit\" />\n                                            </td>\n                                            <td class=\"tdCol\">\n                                                <xsl:value-of select=\"guaranteedDeathBenefit\" />\n                                            </td>\n                                            <td class=\"tdCol\">\n                                                <xsl:value-of select=\"nonGuaranteedDeathBenefitLow\" />\n                                            </td>\n                                            <td class=\"tdCol\">\n                                                <xsl:value-of select=\"totalDeathBenefitLow\" />\n                                            </td>\n                                            <td class=\"tdCol\">\n                                                <xsl:value-of select=\"nonGuaranteedDeathBenefitHigh\" />\n                                            </td>\n                                            <td class=\"tdCol\">\n                                                <xsl:value-of select=\"totalDeathBenefitHigh\" />\n                                            </td>\n                                        </tr>\n                                    </xsl:for-each>\n                                </tbody>\n                            </table>\n\n                            <div class=\"samepage\">\n                                <p>\n                                        <sup>3</sup>On or before the Policy Anniversary nearest to the Life Assured's 80th birthday, the Total Death Benefit\n                                        payable is the higher of (a) the prevailing Multiplier Benefit or (b) the Guaranteed plus Non-Guaranteed Death\n                                        Benefit. After the Policy Anniversary nearest to the Life Assured’s 80th birthday, the Total Death Benefit payable\n                                        is the Guaranteed plus Non-Guaranteed Death Benefit. Any outstanding indebtedness will be deducted before payout.</p>\n                                    <div class=\"emptyspace20\"></div>    \n                                        \n                                    <div style=\"margin-left:3%\">\n                                        <b>Additional Notes</b>\n                                        <ol style=\"padding: 0;margin:0 0 0 16px;\">\n                                            <li>\n                                                Death Benefit for the Basic Policy is payable upon Death/ Terminal Illness/ Total and Permanent Disability (up to age 80).\n                                                The benefit payable as an advancement of the Death Benefit is subject to the applicable limits. Please\n                                                refer to the Product Summary and General Provisions for more details.\n                                            </li>\n                                            <li>\n                                                An additional Accidental Death Benefit (up to age 80) equivalent to the prevailing Death Benefit is payable in the event\n                                                of an accidental death claim.\n                                            </li>\n                                        </ol>\n                                    </div>\n                                    <p>Please refer to the Product Summary and General Provisions for more details.</p>                                \n                            </div>\n                            \n                                \n                        </div>\n                    </div>                    \n                    \n                    <div id=\"pageSV\" class=\"pagebreak\">\n                        <div class=\"page_all\">\n                            \n                            <table>\n                                <tbody>\n                                    <tr>\n                                        <td class=\"vtop vpd2\" style=\"width:35%;\">Basic Policy Plan</td>\n                                        <td class=\"vtop vpd2\">\n                                            :\n                                            <xsl:value-of select=\"*/mainbi/Basic_Policy_Name\" />\n                                        </td>\n                                        <td></td>\n                                    </tr>\n                                    <tr>\n                                        <td class=\"vtop vpd2\">Sum Assured</td>\n                                        <td class=\"vtop vpd2\">\n                                            :\n                                            <xsl:value-of select=\"*/mainbi/Sum_Assured\" />\n                                        </td>\n                                        <td></td>\n                                    </tr>\n                                    <tr>\n                                        <td class=\"vtop vpd2\">Multiplier Benefit*</td>\n                                        <td class=\"vtop vpd2\">\n                                            :\n                                            <xsl:value-of select=\"*/mainbi/Multiplier_Benefit_1\" />\n                                        </td>\n                                        <td></td>\n                                    </tr>\n                                    <tr>\n                                        <td class=\"vtop vpd2\">Policy Currency</td>\n                                        <td class=\"vtop vpd2\">\n                                            :\n                                            <xsl:value-of select=\"*/basic_plan/policy_currency\" />\n                                        </td>\n                                        <td></td>\n                                    </tr>\n                                </tbody>\n                            </table>\n                            <div class=\"emptyspace10\"></div>\n                            <div>* The Multiplier Benefit is applicable up to the Policy Anniversary nearest to the Life Assured’s 80th birthday.\n                                The relevant Multiplying Factor will be used in the calculation of your prevailing Multiplier Benefit at the\n                                point of claim(s).</div>\n                            <div class=\"line\"></div>\n                            <div class=\"emptyspace10\"></div>\n                            <table style=\"width:100%; text-align: center\">\n                                <thead>\n                                    <tr>\n                                        <th></th>\n                                        <th></th>\n                                        <th colspan=\"6\" class=\"bgblack white\">SURRENDER VALUE</th>\n                                    </tr>\n                                    <tr>\n                                        <td class=\"vtop svCol1\" rowspan=\"2\">End of Policy\n                                            <br/>Year/Age</td>\n                                        <td class=\"vtop svCol2\" rowspan=\"2\">Total\n                                            <br/>Premiums\n                                            <br/>Paid\n                                            <br/> To-date\n                                        </td>\n                                        <td class=\"vtop svCol3\" rowspan=\"2\">Guaranteed</td>\n                                        <td class=\"svCol4\" colspan=\"2\">Projected at\n                                            <br/>\n                                            <xsl:value-of select=\"*/others/lowIRR\" /> % Investment\n                                            <br/> Return\n                                        </td>\n                                        <td class=\"svCol5\" colspan=\"2\">Projected at\n                                            <br/>\n                                            <xsl:value-of select=\"*/others/highIRR\" /> % Investment\n                                            <br/> Return\n                                        </td>\n                                    </tr>\n                                    <tr>\n                                        <td class=\"svCol41\">Non-Guaranteed\n                                        </td>\n                                        <td class=\"svCol42\">Total\n                                        </td>\n                                        <td class=\"svCol51\">Non-Guaranteed\n                                        </td>\n                                        <td class=\"svCol52\">Total</td>\n                                    </tr>\n                                    <tr>\n                                        <td></td>\n                                        <td class=\"vtop pdDollar\">(S$)</td>\n                                        <td class=\"vtop pdDollar\">(S$)</td>\n                                        <td class=\"vtop pdDollar\">(S$)</td>\n                                        <td class=\"vtop pdDollar\">(S$)</td>\n                                        <td class=\"vtop pdDollar\">(S$)</td>\n                                        <td class=\"vtop pdDollar\">(S$)</td>\n                                    </tr>\n                                </thead>\n                                <tbody style=\"vertical-align: top;\">\n                    \n                                    <xsl:for-each select=\"*/illustration/surrenderValue\">\n                                        <tr>\n                                            <td class=\"tdCol\">\n                                                <xsl:value-of select=\"policyYearAge\" />\n                                            </td>\n                                            <td class=\"tdCol\">\n                                                <xsl:value-of select=\"totalPremiumPaidToDate\" />\n                                            </td>\n                                            <td class=\"tdCol\">\n                                                <xsl:value-of select=\"guaranteed\" />\n                                            </td>\n                                            <td class=\"tdCol\">\n                                                <xsl:value-of select=\"nonGuaranteedLow\" />\n                                            </td>\n                                            <td class=\"tdCol\">\n                                                <xsl:value-of select=\"totalLow\" />\n                                            </td>\n                                            <td class=\"tdCol\">\n                                                <xsl:value-of select=\"nonGuaranteedHigh\" />\n                                            </td>\n                                            <td class=\"tdCol\">\n                                                <xsl:value-of select=\"totalHigh\" />\n                                            </td>\n                                        </tr>\n                                    </xsl:for-each>\n                                </tbody>\n                            </table>\n                            <div class=\"emptyspace10\"></div>\n                            <table style=\"width:100%; text-align: center\">\n                                <thead>\n                                    <tr>\n                                        <th></th>\n                                        <th></th>\n                                        <th colspan=\"6\" class=\"bgblack white\">MATURITY VALUE</th>\n                                    </tr>                \n                                </thead>\n                                <tbody style=\"vertical-align: top;\">\n                                    <xsl:for-each select=\"*/illustration/maturityValue\">\n                                        <tr>\n                                            <td class=\"svCol1\">\n                                                <xsl:value-of select=\"policyYearAge\" />\n                                            </td>\n                                            <td class=\"svCol2\">\n                                                <xsl:value-of select=\"totalPremiumPaidToDate\" />\n                                            </td>\n                                            <td class=\"svCol3\">\n                                                <xsl:value-of select=\"guaranteed\" />\n                                            </td>\n                                            <td class=\"svCol41\">\n                                                <xsl:value-of select=\"nonGuaranteedLow\" />\n                                            </td>\n                                            <td class=\"svCol42\">\n                                                <xsl:value-of select=\"totalLow\" />\n                                            </td>\n                                            <td class=\"svCol51\">\n                                                <xsl:value-of select=\"nonGuaranteedHigh\" />\n                                            </td>\n                                            <td class=\"svCol52\">\n                                                <xsl:value-of select=\"totalHigh\" />\n                                            </td>\n                                        </tr>\n                                    </xsl:for-each>\n                                </tbody>\n                            </table>\n                            <div class=\"samepage\">\n                                <p>\n                                    <p><p>\n                                        <b>What is the significance of the Projected Investment Rate of Return?</b></p>\n                                    The illustrations have been prepared on two assumptions regarding the investment rate of return achieved by the\n                                        investments of the fund. The two rates (<xsl:value-of select=\"*/others/lowIRR\" />% p.a. and <xsl:value-of select=\"*/others/highIRR\" />% p.a.), are used purely for illustrative purposes and do not represent upper and lower limits on the investment\n                                        performance of the Participating Fund. </p>\n                                    <p>The two rates shown are net of any investment expenses. Please refer to the investment expense ratio in the Product\n                                        Summary, shown for up to the last 3 years, for an indication of the actual investment expenses incurred in\n                                        managing the Participating Fund. </p>\n                                    <p>The higher rate does not exceed the maximum best estimate of the long-term investment rate of return (currently <xsl:value-of select=\"*/others/highIRR\" />% p.a.), which has been set by the Life Insurance Association, Singapore. </p>\n                                    <p>Please note that investment performance is not the only factor that will affect the benefits that you will receive.\n                                        Other factors such as the actual level of death and disability claims on the fund and the expenses incurred\n                                        will also have a bearing upon the benefits that you will receive. </p>\n                                    <p>As the bonus rates (or cash dividends) used for the benefits illustrated above are not guaranteed, the actual\n                                        benefits payable will vary according to the future experience of the Participating Fund.</p>\n                                </p>\n                            </div>\n                    \n                        </div>\n                    </div>                   \n                    \n                    <div id=\"pageDeduce\" class=\"pagebreak\">\n                        <div class=\"page_all\">                          \n                            <table>\n                                <tbody>\n                                    <tr>\n                                        <td class=\"vtop vpd2\" style=\"width:35%;\">Basic Policy Plan</td>\n                                        <td class=\"vtop vpd2\">\n                                            :\n                                            <xsl:value-of select=\"*/mainbi/Basic_Policy_Name\" />\n                                        </td>\n                                        <td></td>\n                                    </tr>\n                                    <tr>\n                                        <td class=\"vtop vpd2\">Sum Assured</td>\n                                        <td class=\"vtop vpd2\">\n                                            :\n                                            <xsl:value-of select=\"*/mainbi/Sum_Assured\" />\n                                        </td>\n                                        <td></td>\n                                    </tr>\n                                    <tr>\n                                        <td class=\"vtop vpd2\">Multiplier Benefit*</td>\n                                        <td class=\"vtop vpd2\">\n                                            :\n                                            <xsl:value-of select=\"*/mainbi/Multiplier_Benefit_1\" />\n                                        </td>\n                                        <td></td>\n                                    </tr>\n                                    <tr>\n                                        <td class=\"vtop vpd2\">Policy Currency</td>\n                                        <td class=\"vtop vpd2\">\n                                            :\n                                            <xsl:value-of select=\"*/basic_plan/policy_currency\" />\n                                        </td>\n                                        <td></td>\n                                    </tr>\n                                </tbody>\n                            </table>\n                            <div class=\"emptyspace10\"></div>\n                    \n                            <div>* The Multiplier Benefit is applicable up to the Policy Anniversary nearest to the Life Assured’s 80th birthday.\n                                The relevant Multiplying Factor will be used in the calculation of your prevailing Multiplier Benefit at the\n                                point of claim(s).</div>\n                            <div class=\"emptyspace10\"></div>\n                            <div class=\"line\"></div>    \n                            <div class=\"emptyspace10\"></div> \n                            <div>\n                                <div>\n                                    <b>What is the impact of deductions on what you might get back?</b>\n                                </div>\n                                <p>The following table illustrates the effect that deductions will have on the amount you get back on surrender\n                                    or maturity. It also highlights the cost of surrendering the policy early.</p>\n                            </div>\n                    \n                            <div class=\"emptyspace10\"></div>\n                            <table style=\"width:100%; text-align: center\">\n                                <thead>\n                                    <tr>\n                                        <th colspan=\"8\" class=\"bgblack white\">TABLE OF DEDUCTIONS</th>\n                                    </tr>\n                                    <tr>\n                                        <th class=\"vtop pd2\"></th>\n                                    </tr>\n                                    <tr>\n                                        <th></th>\n                                        <th></th>\n                                        <th colspan=\"6\" class=\"bgblack white\">DEDUCTIONS</th>\n                                    </tr>\n                                    <tr>\n                                        <td class=\"vtop\" rowspan=\"2\">End of<br/>Policy<br/>Year/Age</td>\n                                        <td class=\"vtop\" rowspan=\"2\">Total\n                                            <br/>Premiums\n                                            <br/>Paid\n                                            <br/> To-date\n                                        </td>\n                                        <td class=\"vtop\" colspan=\"3\">Projected at\n                                            <br/>\n                                            <xsl:value-of select=\"*/others/lowIRR\" /> % Investment Return\n                                        </td>\n                                        <td class=\"vtop\" colspan=\"3\">Projected at\n                                            <br/>\n                                            <xsl:value-of select=\"*/others/highIRR\" /> % Investment Return\n                                        </td>\n                                    </tr>\n                                    <tr>\n                                        <td class=\"vtop\">Value of\n                                            <br/> Premiums<br/>Paid\n                                            <br/> To-date\n                                        </td>\n                                        <td class=\"vtop\">Effect of\n                                            <br/>Deductions\n                                            <br/>To-date\n                                        </td>\n                                        <td class=\"vtop\">Total\n                                            <br/>Surrender\n                                            <br/>value\n                                        </td>\n                                        <td class=\"vtop\">Value of\n                                            <br/> Premiums<br/>Paid\n                                            <br/> To-date\n                                        </td>\n                                        <td class=\"vtop\">Effect of\n                                            <br/>Deductions\n                                            <br/>To-date\n                                        </td>\n                                        <td class=\"vtop\">Total\n                                            <br/>Surrender\n                                            <br/>value\n                                        </td>\n                                    </tr>\n                                    <tr>\n                                        <td class=\"vtop pdDollar\"></td>\n                                        <td class=\"vtop pdDollar\">(S$)</td>\n                                        <td class=\"vtop pdDollar\">(S$)</td>\n                                        <td class=\"vtop pdDollar\">(S$)</td>\n                                        <td class=\"vtop pdDollar\">(S$)</td>\n                                        <td class=\"vtop pdDollar\">(S$)</td>\n                                        <td class=\"vtop pdDollar\">(S$)</td>\n                                        <td class=\"vtop pdDollar\">(S$)</td>\n                                    </tr>\n                                    <tr></tr>\n                                </thead>\n                                <tbody style=\"vertical-align: top;\">\n                    \n                                    <xsl:for-each select=\"*/illustration/deduction\">\n                                        <tr>\n                                            <td class=\"tdCol\">\n                                                <xsl:value-of select=\"policyYearAge\" />\n                                            </td>\n                                            <td class=\"tdCol\">\n                                                <xsl:value-of select=\"totalPremiumPaidToDate\" />\n                                            </td>\n                                            <td class=\"tdCol\">\n                                                <xsl:value-of select=\"valueOfPremiumPaidToDateLow\" />\n                                            </td>\n                                            <td class=\"tdCol\">\n                                                <xsl:value-of select=\"effectOfDeductionToDateLow\" />\n                                            </td>\n                                            <td class=\"tdCol\">\n                                                <xsl:value-of select=\"totalSurrenderValueLow\" />\n                                            </td>\n                                            <td class=\"tdCol\">\n                                                <xsl:value-of select=\"valueOfPremiumPaidToDateHigh\" />\n                                            </td>\n                                            <td class=\"tdCol\">\n                                                <xsl:value-of select=\"effectOfDeductionToDateHigh\" />\n                                            </td>\n                                            <td class=\"tdCol\">\n                                                <xsl:value-of select=\"totalSurrenderValueHigh\" />\n                                            </td>\n                                        </tr>\n                                    </xsl:for-each>\n                                </tbody>\n                            </table>\n                    \n                            \n                            <div class=\"samepage\">\n                                <div class=\"emptyspace20\"></div>\n                                <div>\n                                    <b>What do the columns in the table of deductions mean?</b>\n                                </div>\n                                <div>1 \"Value of Premiums Paid To-date\" is obtained by accumulating the premiums paid to date at the Projected Investment\n                                    Rate of Return, assuming that you were able to invest all of your premiums without deduction for the cost\n                                    of insurance and without incurring any expenses.</div>\n                                <p>2 The difference between \"Value of Premiums Paid To-date\" and \"Total Surrender Value\" represents \"Effect of Deductions\n                                    To-date\". This is the accumulated value of the deductions for the cost of insurance, distribution cost, expenses,\n                                    surrender charges, expected tax payments and expected transfers to shareholders (for participating policies).</p>\n                                \n                            </div>    \n                    \n                    \n                        </div>\n                    </div>   \n\n                    <div id=\"pageTDC\" class=\"pagebreak\">\n                        <div class=\"page_all\">\n                            \n                            <table>\n                                <tbody>\n                                    <tr>\n                                        <td class=\"vtop vpd2\" style=\"width:35%;\">Basic Policy Plan</td>\n                                        <td class=\"vtop vpd2\">\n                                            :\n                                            <xsl:value-of select=\"*/mainbi/Basic_Policy_Name\" />\n                                        </td>\n                                        <td></td>\n                                    </tr>\n                                    <tr>\n                                        <td class=\"vtop vpd2\">Sum Assured</td>\n                                        <td class=\"vtop vpd2\">\n                                            :\n                                            <xsl:value-of select=\"*/mainbi/Sum_Assured\" />\n                                        </td>\n                                        <td></td>\n                                    </tr>\n                                    <tr>\n                                        <td class=\"vtop vpd2\">Multiplier Benefit*</td>\n                                        <td class=\"vtop vpd2\">\n                                            :\n                                            <xsl:value-of select=\"*/mainbi/Multiplier_Benefit_1\" />\n                                        </td>\n                                        <td></td>\n                                    </tr>\n                                    <tr>\n                                        <td class=\"vtop vpd2\">Policy Currency</td>\n                                        <td class=\"vtop vpd2\">\n                                            :\n                                            <xsl:value-of select=\"*/basic_plan/policy_currency\" />\n                                        </td>\n                                        <td></td>\n                                    </tr>\n                                </tbody>\n                            </table>\n                            <div class=\"emptyspace10\"></div>\n                    \n                            <div>* The Multiplier Benefit is applicable up to the Policy Anniversary nearest to the Life Assured’s 80th birthday.\n                                The relevant Multiplying Factor will be used in the calculation of your prevailing Multiplier Benefit at the\n                                point of claim(s).</div>\n                            <div class=\"line\"></div>\n                            <div class=\"emptyspace10\"></div>\n                            <div>\n                                <p>\n                                    <b>How much are you paying for distribution costs?</b>\n                                </p>\n                                <p>This table shows the total costs of distribution that AXA expects to incur in relation to your policy, including\n                                    the cost of any financial advice provided to you. </p>\n                            </div>\n                    \n                            <div class=\"emptyspace10\"></div>\n                            <table style=\"width: 80%; margin: auto;text-align: center\">\n                                <thead>\n                                    <tr>\n                                        <th></th>\n                                        <th colspan=\"2\" class=\"bgblack white\">TOTAL DISTRIBUTION COST</th>\n                                    </tr>\n                                    <tr>\n                                        <td class=\"vtop\" style=\"width:33%\">\n                                            End of\n                                            <br/>Policy\n                                            <br/>Year/Age</td>\n                                        <td class=\"vtop\" style=\"width:33%\">\n                                            Total Premiums\n                                            <br/>Paid To-date\n                                            <br/><span class='notbold aligncenter'>(<xsl:value-of select=\"*/basic_plan/currency_symbol\" />)</span>\n                    \n                                        </td>\n                                        <td class=\"vtop\">\n                                            Total Distribution\n                                            <br/>Cost To-date\n                                            <br/><span class='notbold aligncenter'>(<xsl:value-of select=\"*/basic_plan/currency_symbol\" />)</span>\n                                        </td>\n                                    </tr>                \n                                </thead>\n                                <tbody style=\"vertical-align: top;\">\n                                    \n                                    <xsl:for-each select=\"*/illustration/totalDistributionCostMainBi\">\n                                        <tr>\n                                            <td class=\"tdCol\">\n                                                <xsl:value-of select=\"policyYearAge\" />\n                                            </td>\n                                            <td class=\"tdCol\">\n                                                <xsl:value-of select=\"totalPremiumPaidToDate\" />\n                                            </td>\n                                            <td class=\"tdCol\">\n                                                <xsl:value-of select=\"totalDistributionCostToDate\" />\n                                            </td>\n                                        </tr>\n                                    </xsl:for-each>\n                                </tbody>\n                            </table>                  \n                    \n                            <div class=\"samepage\">\n                                <div class=\"emptyspace20\"></div>\n                                <div>\n                                    <b>What does the last column represent?</b>\n                                </div>\n                                <div>1 The Total Distribution Cost To-date is the sum of each year's expected distribution-related costs, without\n                                    interest. Such costs include cash payments in the form of commission, costs of benefits and services paid\n                                    to the distribution channel.</div>\n                                <p>2 Please note that the Total Distribution Cost is not an additional cost to you; it has already been allowed\n                                    for in calculating your premium.</p>\n                                <p>3 You can obtain the Total Distribution Cost of each of the supplementary benefits (if applicable) from your\n                                    Financial Adviser or its representatives.</p>\n                                <p>4 The illustration above is inclusive of Packaged Riders.</p>\n                            </div>\n                            \n                        </div>\n                    </div>\n                    \n                </td>\n            </tr>\n        </tbody>\n    </table>\n</div>"
        ],
        "zh-Hant": []
    },
    "type": "pdfTemplate",
    "version": 1
}