{
  "keys": ["adviserName", "submissionDate", "proposalNumber", "proposerName", "caseNumber", "productName", "agentName"],
  "sms": "Case from adviserName submitted on submissionDate, proposalNumber for proposerName has expired.",
  "email": {
    "subject": "Case Expired: caseNumber, productName",
    "template": "Dear agentName,<br /><br />caseNumber for proposerName submitted on submissionDate has expired.<br /><br />Please recreate a new case if you wish to submit again.<br /><br />AXA Insurance Pte Ltd<p><img src='cid:part1.1234.56789' height='70' width='75'></p>"
  }
}
