{
  "keys": ["productName", "proposalNumber", "proposerName", "supervisorName", "rejectionDate", "adviserName", "reasonForRejection", "rejectionCommentText"],
  "sms": "productName proposalNumber proposerName has been rejected by supervisorName on rejectionDate. Please refer to email for more information.",
  "email": {
    "subject": "Case proposalNumber, productName rejected",
    "template": "Dear adviserName,<br /><br />The case proposalNumber for proposerName has been rejected by supervisorName on rejectionDate.<br /><br /><b>Reason for Rejection: </b>reasonForRejection<br />rejectionCommentText<br /><br />AXA Insurance Pte Ltd<p><img src='cid:part1.1234.56789' height='70' width='75'></p>"
  }
}
