{
  "dateFormat": "dd/mm/yyyy",
  "compTel": "2576 6000",
  "compWeb": "www.eabsystems.com",
  "compFax": "2576 6828",
  "_rev": "1-63579ce177d3d51676dafe723395d336",
  "compAddr2": "",
  "_id": "companyInfo",
  "compAddr": "Suite 2101, 21/F, Exchange Tower No. 33 Wang Chiu Road",
  "fromEmail": "mail@eabsystems.com",
  "compRegNo": "123456789M",
  "datetimeFormat": "dd/mm/yyyy HH:MM:ss",
  "compName": "EAB Systems Ltd",
  "companyCD": "005",
  "companyIntro": "AXA Insurance is part of the AXA group, a worldwide leader in insurance and asset management, with 166,000 employees serving 103 million clients in 64 countries. Since its inception in 1969, AXA Insurance has been serving the general and life insurance needs of individuals and companies in Singapore through a wide range of innovative products. As one of the world's leading insurance companies, and one of the top global insurers in Singapore, AXA Insurance protects more than a quarter of a million of customers in Singapore. As a company whose business is about protecting people, AXA Insurance is committed to building a stronger and safer society, empowering customers to live better lives."
}