{
  "platform": "ios",
  "loginTime": 1548995233918,
  "lang": "en",
  "loginToken": "952d4f3e-9767-418e-9d64-f00d349fdd87",
  "agent": {
    "position": "Financial Planner",
    "rawData": {
      "upline1Code": "085143",
      "distribCode": "037403-04-086938",
      "fullName": "Your Financial Advisor",
      "position": "FP",
      "userStatus": "A",
      "unitCode": "037403",
      "agentCode": "086938",
      "rank": "FP",
      "authorizedM8A": "N",
      "mobilePhone": "+85225766000",
      "authorizedHI": "Y",
      "authorizedIFAST": "N",
      "userType": "AGENT",
      "authorizedM8": "N",
      "email": "xxxx@gmail.com",
      "userRole": "A",
      "userCat": "AGENT-A",
      "directorOrFirm": "QUEK WEE TZIANG ALEXANDER",
      "upline2Code": "085364",
      "authGroup": "AG001",
      "userId": "AG90010A"
    },
    "agentCode": "086938",
    "managerDisp": "037403-03-085285",
    "company": "QUEK WEE TZIANG ALEXANDER",
    "managerCode": "085285",
    "lstChgDate": 1548814290551,
    "authorised": ["M9A", "M9", "M5", "HI"],
    "channel": {
      "title": "Agency",
      "type": "AGENCY",
      "code": "AGENCY"
    },
    "_id": "UX_AG90010A",
    "authorisedDes": "Investment Linked Plan, Life Insurance, Health Insurance",
    "compCode": "01",
    "name": "Your Financial Advisor",
    "type": "agent",
    "email": "sales@eabsystems.com",
    "lastUpdateDate": "2018-02-22T07:37:22.017Z",
    "mobile": "+85225766000",
    "_rev": "1-1ceec6313dfc01f915a44cbff34eff56",
    "role": "A",
    "acceptDate": "2019-01-17T05:58:19.256Z",
    "createDate": "2017-10-09T07:28:56.805Z",
    "manager": "CHIA HAN WEI, ALPHONSUS",
    "agentCodeDisp": "037403-04-086938",
    "acceptTermVersion": "1.0",
    "profileId": "AG90010A",
    "notifications": [],
    "eligProducts": ["*"],
    "features": ["CP", "FNA", "QQ", "FQ", "EAPP"],
    "allowToEnterApproval": false
  },
  "agentCode": "086938",
  "quotation": {
    "type": "quotation",
    "baseProductCode": "SAV",
    "baseProductId": "08_product_SAV_3",
    "baseProductName": {
      "zh-Hant": "EAB Endowment",
      "en": "EAB Endowment"
    },
    "productLine": "WLE",
    "budgetRules": ["RP"],
    "productVersion": "2.0",
    "compCode": "01",
    "agentCode": "086938",
    "dealerGroup": "AGENCY",
    "agent": {
      "agentCode": "086938",
      "name": "Your Financial Advisor",
      "dealerGroup": "AGENCY",
      "company": "EAB Systems Ltd",
      "mobile": "+85225766000",
      "email": "sales@eabsystems.com"
    },
    "pCid": "CP201502-00001",
    "pFullName": "Your Client",
    "pFirstName": "Your Client",
    "pLastName": "",
    "pGender": "M",
    "pDob": "1989-01-30",
    "pAge": 30,
    "pResidence": "R2",
    "pSmoke": "N",
    "pEmail": "",
    "pOccupation": "O3",
    "pOccupationClass": "1",
    "sameAs": "Y",
    "ccy": "SGD",
    "policyOptions": {},
    "iCid": "CP201502-00001",
    "iFullName": "Your Client",
    "iFirstName": "Your Client",
    "iLastName": "",
    "iGender": "M",
    "iDob": "1989-01-30",
    "iAge": 30,
    "iResidence": "R2",
    "iSmoke": "N",
    "iEmail": "",
    "iOccupation": "O3",
    "iOccupationClass": "1",
    "quickQuote": true,
    "fund": null,
    "extraFlags": {
      "nationalityResidence": {
        "iCategory": "A1",
        "iRejected": "N",
        "pCategory": "A1",
        "pRejected": "N"
      }
    },
    "isBackDate": "N",
    "riskCommenDate": "2019-02-01",
    "createDate": "2019-02-01T08:58:14.342Z",
    "lastUpdateDate": "2019-02-01T08:58:14.342Z",
    "iAttainedAge": 30,
    "pAttainedAge": 30,
    "plans": [{
      "covCode": "SAV",
      "covName": {
        "zh-Hant": "EAB Endowment",
        "en": "EAB Endowment"
      },
      "productLine": "WLE",
      "version": 3,
      "saViewInd": "Y"
    }, {
      "covCode": "PET",
      "covName": {
        "zh-Hant": "EAB Premium Total",
        "en": "EAB Premium Total"
      },
      "version": 2,
      "productLine": "WLE",
      "saViewInd": "N",
      "sumInsured": null,
      "premRate": 0,
      "yearPrem": null,
      "halfYearPrem": null,
      "quarterPrem": null,
      "monthPrem": null
    }],
    "policyOptionsDesc": {},
    "premium": 0,
    "totYearPrem": null,
    "totHalfyearPrem": null,
    "totQuarterPrem": null,
    "totMonthPrem": null
  }
}