{
  "_id": "CP201502-00001",
  "lastName": "",
  "marital": "S",
  "education": "below",
  "addrBlock": "",
  "_rev": "1-cf9e6d74d8d27cd4fa2e05b1fcc7b0e8",
  "employStatus": "ft",
  "idDocType": "nric",
  "addrCity": "",
  "firstName": "EAB Client",
  "nameOrder": "L",
  "isSmoker": "N",
  "addrCountry": "R2",
  "nearAge": 30,
  "dob": "1989-01-30",
  "organizationCountry": "R2",
  "dealerGroup": "AGENCY",
  "type": "cust",
  "bundle": [{
    "isValid": true,
    "id": "FN201502-00001"
  }],
  "industry": "I15",
  "photo": {},
  "agentId": "086938",
  "postalCode": "",
  "fnaRecordIdArray": "",
  "mobileCountryCode": "+65",
  "hanyuPinyinName": "",
  "email": "",
  "residenceCountry": "R2",
  "lstChgDate": 1548814432913,
  "nationality": "N1",
  "othName": "",
  "organization": "",
  "compCode": "01",
  "fullName": "EAB Client",
  "occupation": "O3",
  "otherNo": "",
  "cid": "CP201502-00001",
  "agentCode": "086938",
  "unitNum": "",
  "gender": "M",
  "referrals": "",
  "dependants": [],
  "allowance": 12345,
  "otherMobileCountryCode": "+65",
  "addrStreet": "",
  "age": 30,
  "mobileNo": "12345678",
  "title": "Mr",
  "language": "en",
  "addrEstate": "",
  "otherCityOfResidence": "",
  "idCardNo": "S1234567D"
}