{
  "cmsComponentType": "LABEL",
  "style": [],
  "cmsProps": [
    {
      "key": "value",
      "value": {
        "title": "Value",
        "type": "string"
      }
    }
  ],
  "muiProps": [
    {
      "key": "algin",
      "value": {
        "title": "Align",
        "type": "dropdown",
        "options": [
          "inherit",
          "left",
          "center",
          "right",
          "justify"
        ]
      }
    },
    {
      "key": "color",
      "value": {
        "title": "Color",
        "type": "dropdown",
        "options": [
          "initial",
          "inherit",
          "primary",
          "secondary",
          "textPrimary",
          "textSecondary",
          "error"
        ]
      }
    },
    {
      "key": "display",
      "value": {
        "title": "Display",
        "type": "dropdown",
        "options": [
          "initial",
          "block",
          "inline"
        ]
      }
    },
    {
      "key": "noWrap",
      "value": {
        "title": "No Wrap",
        "type": "boolean"
      }
    }
  ]
}