{
  "cmsComponentType": "BUTTON_LINK",
  "style": [],
  "muiProps": [
    {
      "key": "alignItems",
      "value": {
        "title": "Align Items",
        "type": "dropdown",
        "options": [
          "flex-start",
          "center"
        ]
      }
    }
  ],
  "cmsProps": [
    {
      "key": "displayText",
      "value": {
        "title": "Display Text",
        "type": "string"
      }
    },
    {
      "key": "iconName",
      "value": {
        "title": "Icon Name",
        "type": "string"
      }
    },
    {
      "key": "actionUrl",
      "value": {
        "title": "Action Url",
        "type": "string"
      }
    }
  ]
}