{
  "cmsComponentType": "GRID_ROW",
  "style": [],
  "cmsProps": [],
  "muiProps": [
    {
      "key": "direction",
      "value": {
        "title": "Direction",
        "type": "dropdown",
        "options": [
          "row",
          "row-reverse",
          "column",
          "column-reverse"
        ]
      }
    },
    {
      "key": "justify",
      "value": {
        "title": "Justify",
        "type": "dropdown",
        "options": [
          "flex-start",
          "flex-end",
          "center",
          "space-between",
          "space-around",
          "space-evenly"
        ]
      }
    },
    {
      "key": "alignItems",
      "value": {
        "title": "Align Items",
        "type": "dropdown",
        "options": [
          "flex-start",
          "flex-end",
          "center",
          "stretch",
          "baseline"
        ]
      }
    },
    {
      "key": "spacing",
      "value": {
        "title": "Spacing",
        "type": "dropdown",
        "optons": [
          1,
          2,
          3,
          4,
          5,
          6,
          7,
          8,
          9,
          10
        ]
      }
    }
  ]
}