{
    "_id" : ObjectId("5e1e87ee9106f1fe736a8163"),
    "type" : "CAFEFORM",
    "pageOrComponent" : "component",
    "cssClass" : "H1-Theme",
    "displayName" : {
        "en" : "Cafe Form",
        "zh-hant" : "Cafe表單"
    },
    "style" : {
        "width" : "100%",
        "height" : "100%"
    },
    "structure" : {
        "formId" : ""
    },
    "displayImage" : {
        "bucket" : "cms-admin-cicd-component",
        "key" : "Cafe Form.svg"
    },
    "property" : {
        "docType" : "clientProfile",
        "formId" : "1234567"
    },
    "system" : {
        "userComponent" : false,
        "group" : "inputs",
        "createdDate" : "2019-12-17 15:10:10",
        "createdBy" : "admin",
        "updatedDate" : "2019-12-18 14:12:12",
        "updatedBy" : "admin",
        "version" : 1
    },
    "cmsProperty" : {
        "cssClass" : {
            "title" : "CSS Style Class",
            "input" : "string",
            "length" : 100,
            "checking" : "#css-class-regex",
            "default" : "",
            "mandatory" : false
        },
        "style" : [ 
            {
                "key" : "width",
                "value" : {
                    "title" : "Width",
                    "input" : "number",
                    "length" : 3,
                    "checking" : "#px-percentage-regex",
                    "default" : "100%",
                    "mandatory" : false
                }
            }, 
            {
                "key" : "height",
                "value" : {
                    "title" : "Height",
                    "input" : "number",
                    "length" : 3,
                    "checking" : "#px-percentage-regex",
                    "default" : "100%",
                    "mandatory" : false
                }
            }
        ],
        "structure" : [ 
            {
                "key" : "formId",
                "value" : {
                    "title" : "Cafe Form ID",
                    "input" : "string",
                    "length" : 100,
                    "default" : "",
                    "mandatory" : false
                }
            }, 
            {
                "key" : "docType",
                "value" : {
                    "title" : "Doc Type",
                    "input" : "string",
                    "length" : 100,
                    "default" : "",
                    "mandatory" : false
                }
            }
        ]
    }
}