{
    "$schema": "http://json-schema.org/draft-07/schema#",
    "title": "EaaSI - Content Environment",
    "description": "Properties of a content environment configured and available for use in the EaaSI system",
    "type": "object",
    "required": [
        "identifier",
        "contentObjects",
        "computingEnvironment",
        "relatedEvent"
    ],
    "properties": {
        "identifier": {
            "description": "Unique identifier issued by EaaSI",
            "type": "string"
        },
        "name": {
            "description": "The name given to a content environment",
            "type": "string"
        },
        "description": {
            "description": "Short description of the content environment's purpose",
            "type": "string"
        },
        "helpText": {
            "description": "Text providing instructions or general guidance for use of the environment",
            "type": "string"
        },
        "contentObjects": {
            "description": "Content objects associated with content environment",
            "type": "array",
            "uniqueItems": true,
            "minItems": 1,
            "items": {
                "contentObject": {"$ref": "contentObject.json#/properties/identifier/value"}
            }
        },
        "computingEnvironment": {
            "description": "Identifier of computing environment used by content environment to operate content object(s)",
            "$ref": "computingEnvironment.json#/properties/identifier"
        },
        "relatedEvent": {
            "description": "Event featuring the content environment (e.g., creation)",
            "type": "array",
            "items": {"$ref": "system.json#/properties/event"},
            "uniqueItems": true
        }
    }
}