{
    "identifier": "72e101d0-955f-43ba-906e-fa90b544d954",
    "alternativeIDs": [
        {
            "alternativeID": "123456788",
            "source": "Catalog System",
            "local": true
        }
    ],
    "source": {
        "identifier": "e64793e6-d493-4304-9eab-600d02f7ee33",
        "name": "Yale University Library"
    },
    "name": "Network environment name",
    "description": "Web server setup for whatever site",
    "helpText": "Run this in environment x to make operable in environment y",
    "emulatedServices": [
        {
            "networkService": "https://www.wikidata.org/wiki/Q44484",
            "servicePort": [443]
        }
    ],
    "networkedEnvironments": [
        {
            "computingEnvironment": "e722a7b6-bf55-4ddd-aafc-f2558d2fd4b1",
            "bootOrder": 1,
            "staticIpAddress": "192.168.1.1",
            "expectedServices": [
                {
                    "networkService": "https://www.wikidata.org/wiki/Q332211",
                    "servicePort": [223]
                },
                {
                    "networkService": "https://www.wikidata.org/wiki/Q3344556",
                    "servicePort": [843]
                }
            ],
            "providedServices": [
                {
                    "networkService": "https://www.wikidata.org/wiki/Q77543",
                    "servicePort": [888]
                },
                {
                    "networkService": "https://www.wikidata.org/wiki/Q233445",
                    "servicePort": [543]
                }
            ]
        },
        {
            "computingEnvironment": "e722a7b6-bf55-4ddd-aafc-f2558d2fd4b1",
            "bootOrder": 2,
            "staticIpAddress": "192.168.1.2",
            "expectedServices": [
                {
                    "networkService": "https://www.wikidata.org/wiki/Q23411",
                    "servicePort": [532]
                },
                {
                    "networkService": "https://www.wikidata.org/wiki/Q988",
                    "servicePort": [755]
                }
            ],
            "providedServices": [
                {
                    "networkService": "https://www.wikidata.org/wiki/Q333",
                    "servicePort": [111]
                },
                {
                    "networkService": "https://www.wikidata.org/wiki/Q1123",
                    "servicePort": [543]
                }
            ]
        }
    ]
}