%!PS-Adobe-3.0 EPSF-3.0
%%Title: uniform_convergence.eps
%%Creator: Matplotlib v3.5.3, https://matplotlib.org/
%%CreationDate: Thu May  4 14:28:35 2023
%%Orientation: portrait
%%BoundingBox: 58 239 554 553
%%HiResBoundingBox: 58.120592 239.383438 553.879408 552.616562
%%EndComments
%%BeginProlog
/mpldict 12 dict def
mpldict begin
/_d { bind def } bind def
/m { moveto } _d
/l { lineto } _d
/r { rlineto } _d
/c { curveto } _d
/cl { closepath } _d
/ce { closepath eofill } _d
/box {
      m
      1 index 0 r
      0 exch r
      neg 0 r
      cl
    } _d
/clipbox {
      box
      clip
      newpath
    } _d
/sc { setcachedevice } _d
%!PS-Adobe-3.0 Resource-Font
%%Creator: Converted from TrueType to Type 3 by Matplotlib.
10 dict begin
/FontName /STIXGeneral-Regular def
/PaintType 0 def
/FontMatrix [0.001 0 0 0.001 0 0] def
/FontBBox [-970 -443 2000 1023] def
/FontType 3 def
/Encoding [/minus /uni221E /space /zero /one /two /three /four /five /six /seven /eight /equal /E /I /M /X /e /i /l /n /o /r /s /t /u] def
/CharStrings 27 dict dup begin
/.notdef 0 def
/minus{685 0 64 220 621 286 sc
621 220 m
64 220 l
64 286 l
621 286 l
621 220 l

ce} _d
/uni221E{926 0 70 0 854 430 sc
854 222 m
854 168 836 117 799 70 c
762 23 715 0 656 0 c
617 0 582 12 551 35 c
520 59 488 96 455 145 c
407 48 337 0 246 0 c
199 0 157 17 122 51 c
87 86 70 135 70 200 c
70 235 75 266 84 294 c
94 322 106 344 120 360 c
135 377 151 390 169 401 c
187 412 203 420 218 424 c
233 428 248 430 261 430 c
301 430 336 420 366 401 c
397 382 434 343 479 283 c
506 332 534 369 561 393 c
589 418 626 430 672 430 c
721 430 763 411 799 373 c
836 336 854 285 854 222 c

499 245 m
499 242 l
538 179 572 132 601 103 c
630 74 661 59 694 59 c
722 59 746 71 765 94 c
784 118 794 146 794 178 c
794 225 781 265 756 297 c
731 330 698 346 655 346 c
634 346 615 343 598 337 c
581 332 566 323 553 310 c
540 297 530 287 524 280 c
518 273 510 261 499 245 c

433 181 m
433 184 l
395 247 360 293 327 324 c
295 355 263 371 230 371 c
202 371 178 359 159 335 c
140 312 130 284 130 252 c
130 207 143 167 168 134 c
193 101 227 84 269 84 c
290 84 309 87 327 93 c
345 99 361 108 375 119 c
389 131 400 141 407 149 c
415 158 424 168 433 181 c

ce} _d
/space{250 0 0 0 0 0 sc
ce} _d
/zero{500 0 24 -14 476 676 sc
476 330 m
476 285 472 243 463 203 c
454 164 441 127 424 94 c
407 61 384 34 354 15 c
324 -4 289 -14 250 -14 c
209 -14 174 -4 143 17 c
112 38 89 65 72 100 c
55 135 43 172 35 211 c
28 250 24 292 24 336 c
24 398 32 454 47 503 c
62 553 88 594 123 627 c
159 660 203 676 254 676 c
319 676 373 644 414 580 c
455 516 476 433 476 330 c

380 325 m
380 430 369 511 346 566 c
324 622 291 650 248 650 c
207 650 175 622 153 566 c
131 510 120 431 120 329 c
120 226 131 148 153 93 c
175 39 207 12 250 12 c
292 12 324 39 346 93 c
369 148 380 225 380 325 c

ce} _d
/one{500 0 111 0 394 676 sc
394 0 m
118 0 l
118 15 l
155 17 180 24 193 35 c
206 47 213 67 213 95 c
213 544 l
213 577 203 593 183 593 c
174 593 159 589 138 581 c
111 571 l
111 585 l
290 676 l
299 673 l
299 76 l
299 54 306 38 319 29 c
332 20 357 15 394 15 c
394 0 l

ce} _d
/two{500 0 29 0 474 676 sc
474 137 m
420 0 l
29 0 l
29 12 l
207 201 l
254 250 287 294 307 335 c
327 376 337 418 337 461 c
337 506 325 540 300 565 c
275 590 241 602 198 602 c
162 602 133 593 112 574 c
91 555 71 521 51 472 c
30 477 l
41 539 64 588 98 623 c
133 658 179 676 238 676 c
293 676 338 659 372 626 c
406 593 423 551 423 500 c
423 425 380 342 295 252 c
130 76 l
364 76 l
386 76 403 80 416 89 c
429 98 444 116 460 143 c
474 137 l

ce} _d
/three{500 0 41 -14 431 676 sc
61 510 m
45 514 l
60 564 84 603 117 632 c
150 661 191 676 241 676 c
288 676 325 663 354 638 c
383 613 397 580 397 539 c
397 484 366 438 304 401 c
341 385 368 367 387 348 c
416 315 431 272 431 219 c
431 166 416 119 385 79 c
362 48 330 25 287 9 c
245 -6 200 -14 153 -14 c
78 -14 41 5 41 43 c
41 54 45 62 53 69 c
61 76 71 79 82 79 c
99 79 119 70 143 53 c
172 32 201 22 229 22 c
266 22 296 37 321 66 c
346 96 359 132 359 175 c
359 252 324 300 255 320 c
234 327 200 330 153 330 c
153 344 l
190 357 218 369 237 380 c
291 411 318 455 318 514 c
318 547 308 573 289 590 c
270 607 244 616 210 616 c
150 616 100 581 61 510 c

ce} _d
/four{500 0 12 0 473 676 sc
473 167 m
370 167 l
370 0 l
292 0 l
292 167 l
12 167 l
12 231 l
326 676 l
370 676 l
370 231 l
473 231 l
473 167 l

292 231 m
292 574 l
52 231 l
292 231 l

ce} _d
/five{500 0 31 -14 438 688 sc
438 681 m
402 596 l
398 587 389 583 375 583 c
181 583 l
141 498 l
214 484 267 469 300 452 c
333 436 363 409 391 370 c
414 338 426 296 426 243 c
426 195 418 155 402 122 c
387 89 362 60 328 35 c
283 2 226 -14 158 -14 c
120 -14 89 -8 66 3 c
43 14 31 29 31 48 c
31 73 46 86 76 86 c
100 86 125 76 150 55 c
176 34 200 23 221 23 c
256 23 287 40 314 75 c
342 110 356 149 356 192 c
356 256 334 306 289 342 c
231 389 160 412 76 412 c
68 412 64 415 64 420 c
65 425 l
174 662 l
381 662 l
392 662 401 664 407 667 c
414 670 421 677 429 688 c
438 681 l

ce} _d
/six{500 0 34 -14 468 684 sc
446 684 m
448 668 l
369 655 304 623 251 572 c
198 521 165 458 152 383 c
191 413 233 428 279 428 c
338 428 384 409 417 372 c
451 335 468 284 468 219 c
468 154 451 100 417 59 c
378 10 325 -14 258 -14 c
177 -14 118 20 81 87 c
50 144 34 208 34 279 c
34 388 70 480 143 555 c
184 598 227 628 270 645 c
314 663 373 676 446 684 c

378 188 m
378 317 333 382 243 382 c
210 382 182 373 160 355 c
138 338 127 308 127 266 c
127 188 139 126 163 81 c
188 36 223 14 269 14 c
304 14 331 30 350 61 c
369 93 378 135 378 188 c

ce} _d
/seven{500 0 20 -8 449 662 sc
449 646 m
237 -8 l
172 -8 l
370 588 l
155 588 l
126 588 105 583 91 573 c
77 563 59 541 38 506 c
20 515 l
80 662 l
449 662 l
449 646 l

ce} _d
/eight{500 0 56 -14 445 676 sc
445 155 m
445 104 427 63 391 32 c
356 1 308 -14 248 -14 c
192 -14 146 1 110 32 c
74 63 56 102 56 149 c
56 184 65 214 82 239 c
99 264 134 295 186 332 c
136 373 103 407 86 432 c
70 457 62 487 62 520 c
62 567 80 605 116 633 c
153 662 199 676 256 676 c
305 676 345 662 376 634 c
408 607 424 573 424 533 c
424 496 414 467 395 445 c
376 423 341 398 290 371 c
350 331 391 295 412 264 c
434 233 445 196 445 155 c

355 533 m
355 568 345 595 326 616 c
307 637 280 648 246 648 c
212 648 185 639 165 621 c
146 604 136 580 136 549 c
136 518 146 490 165 465 c
185 440 217 415 261 389 c
295 409 319 430 333 452 c
348 475 355 502 355 533 c

271 272 m
212 312 l
183 288 162 264 150 241 c
138 218 132 191 132 158 c
132 113 143 77 166 52 c
189 27 220 14 259 14 c
292 14 318 24 338 44 c
359 65 369 91 369 124 c
369 154 361 180 346 203 c
331 226 306 249 271 272 c

ce} _d
/equal{685 0 48 120 637 386 sc
637 320 m
48 320 l
48 386 l
637 386 l
637 320 l

637 120 m
48 120 l
48 186 l
637 186 l
637 120 l

ce} _d
/E{611 0 12 0 597 662 sc
597 169 m
551 0 l
12 0 l
12 19 l
50 22 74 28 84 39 c
94 50 99 75 99 114 c
99 550 l
99 587 94 612 83 623 c
73 634 49 641 12 643 c
12 662 l
542 662 l
546 519 l
521 519 l
514 564 501 592 482 605 c
463 618 425 624 367 624 c
236 624 l
221 624 212 622 207 617 c
203 613 201 603 201 588 c
201 368 l
352 368 l
394 368 422 374 435 386 c
449 398 459 424 465 464 c
488 464 l
488 230 l
465 230 l
459 272 449 299 436 310 c
423 321 395 327 352 327 c
201 327 l
201 84 l
201 64 208 51 222 45 c
236 40 263 37 302 37 c
338 37 l
409 37 460 46 490 63 c
520 80 546 116 569 169 c
597 169 l

ce} _d
/I{333 0 18 0 315 662 sc
315 0 m
18 0 l
18 19 l
60 20 87 26 98 37 c
109 48 115 73 115 112 c
115 551 l
115 590 110 614 99 624 c
88 634 61 640 18 643 c
18 662 l
315 662 l
315 643 l
273 641 246 635 234 624 c
223 613 217 589 217 551 c
217 112 l
217 75 223 50 235 38 c
247 27 274 20 315 19 c
315 0 l

ce} _d
/M{889 0 12 0 864 662 sc
864 0 m
584 0 l
584 19 l
623 22 648 29 658 41 c
669 54 674 81 674 123 c
674 572 l
419 0 l
405 0 l
153 549 l
153 151 l
153 97 159 62 170 46 c
181 30 207 21 246 19 c
246 0 l
12 0 l
12 19 l
41 21 62 25 75 32 c
88 39 96 50 101 67 c
106 84 109 112 109 151 c
109 549 l
109 587 103 611 92 622 c
81 633 55 640 14 643 c
14 662 l
212 662 l
443 160 l
664 662 l
863 662 l
863 643 l
827 642 803 636 792 624 c
781 612 776 587 776 550 c
776 112 l
776 77 781 53 792 41 c
803 29 827 22 864 19 c
864 0 l

ce} _d
/X{722 0 10 0 704 662 sc
704 0 m
408 0 l
408 19 l
434 21 l
467 23 484 33 484 50 c
484 65 467 97 433 148 c
338 289 l
219 140 l
184 96 166 66 166 51 c
166 41 171 34 182 29 c
193 24 213 21 242 19 c
242 0 l
10 0 l
10 19 l
36 22 57 29 73 42 c
90 55 117 85 155 133 c
311 328 l
205 483 l
158 551 125 594 104 611 c
83 629 56 640 22 643 c
22 662 l
323 662 l
323 643 l
294 642 l
279 641 267 639 259 635 c
252 631 248 624 248 613 c
248 609 248 605 249 600 c
250 596 252 591 255 585 c
258 579 261 573 264 568 c
267 563 271 557 276 548 c
282 539 287 532 291 526 c
295 520 301 511 310 498 c
319 486 326 476 331 468 c
375 404 l
487 544 l
514 577 527 599 527 611 c
527 622 522 630 513 635 c
504 640 486 642 459 643 c
459 662 l
696 662 l
696 643 l
664 641 639 634 620 621 c
601 609 576 583 544 544 c
401 367 l
593 93 l
612 65 629 46 643 37 c
657 28 677 22 704 19 c
704 0 l

ce} _d
/e{444 0 25 -10 424 460 sc
408 164 m
424 157 l
384 46 314 -10 215 -10 c
156 -10 110 10 76 51 c
42 92 25 148 25 217 c
25 288 44 347 82 392 c
120 437 170 460 232 460 c
292 460 338 437 371 391 c
390 364 402 326 405 277 c
97 277 l
100 235 104 203 109 181 c
115 159 126 137 143 114 c
171 77 208 59 254 59 c
287 59 314 67 336 83 c
359 99 383 126 408 164 c

99 309 m
303 309 l
297 351 287 381 273 398 c
260 415 237 424 205 424 c
177 424 154 414 135 394 c
116 375 104 346 99 309 c

ce} _d
/i{278 0 16 0 253 683 sc
180 632 m
180 617 175 605 165 595 c
155 586 143 581 128 581 c
114 581 102 586 92 595 c
83 605 78 617 78 632 c
78 646 83 658 93 668 c
103 678 115 683 129 683 c
144 683 156 678 165 668 c
175 658 180 646 180 632 c

253 0 m
16 0 l
16 15 l
51 17 72 23 81 33 c
90 43 95 67 95 104 c
95 331 l
95 354 93 371 88 380 c
83 389 75 394 62 394 c
46 394 32 392 20 389 c
20 405 l
175 460 l
179 456 l
179 105 l
179 68 183 44 191 34 c
200 24 220 18 253 15 c
253 0 l

ce} _d
/l{278 0 19 0 257 683 sc
257 0 m
21 0 l
21 15 l
52 18 73 24 83 34 c
93 45 98 64 98 92 c
98 561 l
98 585 95 602 89 611 c
83 620 72 625 56 625 c
42 625 30 624 19 623 c
19 639 l
82 654 135 669 177 683 c
182 679 l
182 87 l
182 59 187 40 196 31 c
205 22 226 17 257 15 c
257 0 l

ce} _d
/n{500 0 16 0 485 460 sc
485 0 m
277 0 l
278 15 l
303 17 319 24 327 36 c
336 49 340 72 340 105 c
340 304 l
340 371 316 405 267 405 c
250 405 235 401 220 393 c
205 385 187 370 164 348 c
164 72 l
164 52 168 38 177 30 c
186 22 204 17 229 15 c
229 0 l
18 0 l
18 15 l
43 17 60 23 68 33 c
76 44 80 64 80 94 c
80 337 l
80 362 78 379 73 388 c
68 397 59 402 45 402 c
32 402 22 401 16 398 c
16 415 l
63 428 108 443 153 460 c
161 457 l
161 379 l
162 379 l
209 433 257 460 306 460 c
344 460 373 447 393 420 c
414 393 424 355 424 306 c
424 85 l
424 58 428 41 436 32 c
444 23 460 18 485 15 c
485 0 l

ce} _d
/o{500 0 29 -10 470 460 sc
470 231 m
470 161 449 103 407 58 c
366 13 312 -10 245 -10 c
184 -10 132 12 91 57 c
50 102 29 159 29 228 c
29 297 50 353 91 396 c
132 439 187 460 254 460 c
316 460 367 439 408 396 c
449 354 470 299 470 231 c

380 204 m
380 280 363 339 330 382 c
303 415 272 432 235 432 c
200 432 172 418 151 389 c
130 361 119 322 119 273 c
119 188 137 119 172 68 c
195 35 225 18 262 18 c
299 18 327 34 348 67 c
369 100 380 146 380 204 c

ce} _d
/r{333 0 5 0 335 460 sc
160 458 m
160 366 l
185 402 206 427 223 440 c
240 453 259 460 280 460 c
297 460 311 455 320 446 c
330 437 335 424 335 407 c
335 393 331 382 324 374 c
317 366 308 362 296 362 c
283 362 270 369 256 382 c
245 392 237 397 230 397 c
216 397 201 387 184 368 c
168 349 160 331 160 315 c
160 90 l
160 61 166 42 177 32 c
188 22 211 16 245 15 c
245 0 l
5 0 l
5 15 l
37 21 57 28 64 35 c
72 42 76 59 76 84 c
76 334 l
76 356 73 371 68 380 c
63 389 55 394 42 394 c
31 394 20 393 7 390 c
7 406 l
49 419 98 437 155 460 c
160 458 l

ce} _d
/s{389 0 51 -10 348 459 sc
156 301 m
260 238 l
293 218 316 199 329 182 c
342 165 348 142 348 115 c
348 82 334 52 306 27 c
279 2 246 -10 208 -10 c
177 -10 152 -7 135 -1 c
117 5 102 8 89 8 c
78 8 70 4 65 -4 c
52 -4 l
52 153 l
68 153 l
79 104 94 69 114 46 c
134 23 161 12 195 12 c
220 12 240 19 255 33 c
270 47 278 65 278 86 c
278 117 260 142 225 161 c
171 191 l
91 236 51 284 51 336 c
51 375 63 405 88 426 c
113 448 147 459 189 459 c
218 459 241 455 256 448 c
268 443 277 440 284 440 c
289 440 294 443 300 450 c
311 450 l
316 314 l
301 314 l
290 359 275 391 258 409 c
241 428 218 437 188 437 c
165 437 147 431 133 420 c
120 409 113 392 113 369 c
113 358 117 345 124 332 c
132 319 143 309 156 301 c

ce} _d
/t{278 0 13 -10 279 579 sc
266 77 m
279 66 l
247 15 207 -10 158 -10 c
99 -10 70 32 70 117 c
70 418 l
17 418 l
14 420 13 422 13 425 c
13 430 19 437 30 444 c
55 459 88 494 127 551 c
128 553 131 557 136 563 c
141 570 145 575 147 579 c
152 579 154 575 154 566 c
154 450 l
255 450 l
255 418 l
154 418 l
154 132 l
154 100 158 77 166 63 c
174 49 187 42 206 42 c
226 42 246 54 266 77 c

ce} _d
/u{500 0 9 -10 480 450 sc
480 50 m
480 36 l
428 22 382 7 343 -9 c
338 -6 l
338 76 l
336 76 l
294 19 246 -10 193 -10 c
155 -10 125 2 103 25 c
82 48 71 79 71 118 c
71 369 l
71 394 67 411 58 420 c
49 429 33 435 9 436 c
9 450 l
155 450 l
155 127 l
155 104 162 85 175 70 c
189 55 206 48 226 48 c
259 48 287 58 310 79 c
319 87 325 94 328 101 c
331 108 333 120 333 137 c
333 368 l
333 394 328 411 319 418 c
310 426 290 431 259 433 c
259 450 l
417 450 l
417 107 l
417 84 421 68 428 61 c
436 54 451 50 474 50 c
480 50 l

ce} _d
end readonly def

/BuildGlyph {
 exch begin
 CharStrings exch
 2 copy known not {pop /.notdef} if
 true 3 1 roll get exec
 end
} _d

/BuildChar {
 1 index /Encoding get exch get
 1 index /BuildGlyph get exec
} _d

FontName currentdict end definefont pop
%!PS-Adobe-3.0 Resource-Font
%%Creator: Converted from TrueType to Type 3 by Matplotlib.
10 dict begin
/FontName /STIXGeneral-Italic def
/PaintType 0 def
/FontMatrix [0.001 0 0 0.001 0 0] def
/FontBBox [-970 -305 1429 1023] def
/FontType 3 def
/Encoding [/m /e /N] def
/CharStrings 4 dict dup begin
/.notdef 0 def
/m{722 0 12 -9 704 441 sc
704 105 m
699 98 l
648 27 600 -9 555 -9 c
528 -9 515 6 515 37 c
515 47 519 69 528 103 c
586 330 l
591 349 593 361 593 368 c
593 374 591 379 587 383 c
583 387 578 389 573 389 c
542 389 498 350 442 272 c
417 237 398 202 384 167 c
370 132 353 77 334 0 c
259 0 l
286 93 l
331 250 354 340 354 364 c
354 381 347 389 332 389 c
315 389 293 376 266 349 c
239 323 211 289 183 246 c
166 220 152 192 140 163 c
129 134 111 79 87 0 c
12 0 l
55 144 l
92 266 110 342 110 372 c
110 387 96 394 69 394 c
44 394 l
44 410 l
206 441 l
209 439 l
151 230 l
238 371 311 441 371 441 c
390 441 405 436 415 425 c
426 414 431 400 431 381 c
431 356 418 305 391 229 c
426 285 456 327 479 355 c
503 384 527 406 551 421 c
572 434 593 441 614 441 c
632 441 646 435 656 423 c
667 412 672 397 672 378 c
672 369 671 360 669 350 c
601 99 l
594 74 591 59 591 54 c
591 43 595 38 603 38 c
618 38 639 56 668 91 c
689 117 l
704 105 l

ce} _d
/e{444 0 31 -11 412 441 sc
358 109 m
370 97 l
311 25 243 -11 166 -11 c
125 -11 93 1 68 26 c
43 51 31 85 31 126 c
31 204 62 276 124 342 c
187 408 255 441 330 441 c
356 441 376 435 390 423 c
405 411 412 394 412 373 c
412 329 386 290 335 255 c
284 220 215 197 128 186 c
121 173 118 152 118 125 c
118 98 126 76 143 59 c
160 42 183 34 211 34 c
233 34 254 39 274 49 c
294 60 322 80 358 109 c

152 252 m
135 208 l
210 226 263 251 296 282 c
329 314 346 346 346 379 c
346 405 334 418 311 418 c
283 418 254 402 223 369 c
193 337 169 298 152 252 c

ce} _d
/N{667 0 -20 -15 727 653 sc
727 653 m
727 637 l
709 633 696 630 689 627 c
682 625 675 618 666 606 c
658 595 652 582 647 568 c
643 554 636 529 625 492 c
479 -15 l
461 -15 l
231 535 l
117 113 l
111 92 108 74 108 59 c
108 45 113 35 123 28 c
134 22 152 18 178 16 c
178 0 l
-20 0 l
-20 16 l
9 20 29 30 41 47 c
53 64 68 105 86 168 c
203 583 l
188 619 159 637 117 637 c
117 653 l
277 653 l
484 154 l
590 542 l
595 561 598 575 598 586 c
598 604 593 616 584 623 c
575 630 557 634 529 637 c
529 653 l
727 653 l

ce} _d
end readonly def

/BuildGlyph {
 exch begin
 CharStrings exch
 2 copy known not {pop /.notdef} if
 true 3 1 roll get exec
 end
} _d

/BuildChar {
 1 index /Encoding get exch get
 1 index /BuildGlyph get exec
} _d

FontName currentdict end definefont pop
end
%%EndProlog
mpldict begin
58.121 239.383 translate
495.759 313.233 0 0 clipbox
gsave
0 0 m
495.758816 0 l
495.758816 313.233125 l
0 313.233125 l
cl
1.000 setgray
fill
grestore
gsave
52.0125 41.0125 m
241.958816 41.0125 l
241.958816 291.83 l
52.0125 291.83 l
cl
1.000 setgray
fill
grestore
0.800 setlinewidth
1 setlinejoin
2 setlinecap
[] 0 setdash
0.690 setgray
gsave
189.946 250.818 52.013 41.013 clipbox
67.746864 41.0125 m
67.746864 291.83 l
stroke
grestore
0 setlinecap
0.000 setgray
gsave
/o {
gsave
newpath
translate
0.8 setlinewidth
1 setlinejoin

0 setlinecap

0 0 m
0 -3.5 l

gsave
0.000 setgray
fill
grestore
stroke
grestore
} bind def
67.7469 41.0125 o
grestore
gsave
59.246864 24.621875 translate
0.000000 rotate
/STIXGeneral-Regular 12.0 selectfont
0.000000 0.998438 moveto
/one glyphshow
5.999985 0.998438 moveto
/zero glyphshow
/STIXGeneral-Regular 8.399999999999999 selectfont
12.189188 5.323438 moveto
/three glyphshow
grestore
2 setlinecap
0.690 setgray
gsave
189.946 250.818 52.013 41.013 clipbox
142.741645 41.0125 m
142.741645 291.83 l
stroke
grestore
0 setlinecap
0.000 setgray
gsave
/o {
gsave
newpath
translate
0.8 setlinewidth
1 setlinejoin

0 setlinecap

0 0 m
0 -3.5 l

gsave
0.000 setgray
fill
grestore
stroke
grestore
} bind def
142.742 41.0125 o
grestore
gsave
134.241645 24.621875 translate
0.000000 rotate
/STIXGeneral-Regular 12.0 selectfont
0.000000 0.998438 moveto
/one glyphshow
5.999985 0.998438 moveto
/zero glyphshow
/STIXGeneral-Regular 8.399999999999999 selectfont
12.189188 5.323438 moveto
/four glyphshow
grestore
2 setlinecap
0.690 setgray
gsave
189.946 250.818 52.013 41.013 clipbox
217.736426 41.0125 m
217.736426 291.83 l
stroke
grestore
0 setlinecap
0.000 setgray
gsave
/o {
gsave
newpath
translate
0.8 setlinewidth
1 setlinejoin

0 setlinecap

0 0 m
0 -3.5 l

gsave
0.000 setgray
fill
grestore
stroke
grestore
} bind def
217.736 41.0125 o
grestore
gsave
209.236426 24.621875 translate
0.000000 rotate
/STIXGeneral-Regular 12.0 selectfont
0.000000 0.900000 moveto
/one glyphshow
5.999985 0.900000 moveto
/zero glyphshow
/STIXGeneral-Regular 8.399999999999999 selectfont
12.189188 5.225000 moveto
/five glyphshow
grestore
0.600 setlinewidth
gsave
/o {
gsave
newpath
translate
0.6 setlinewidth
1 setlinejoin

0 setlinecap

0 0 m
0 -2 l

gsave
0.000 setgray
fill
grestore
stroke
grestore
} bind def
56.13 41.0125 o
grestore
gsave
/o {
gsave
newpath
translate
0.6 setlinewidth
1 setlinejoin

0 setlinecap

0 0 m
0 -2 l

gsave
0.000 setgray
fill
grestore
stroke
grestore
} bind def
60.4791 41.0125 o
grestore
gsave
/o {
gsave
newpath
translate
0.6 setlinewidth
1 setlinejoin

0 setlinecap

0 0 m
0 -2 l

gsave
0.000 setgray
fill
grestore
stroke
grestore
} bind def
64.3153 41.0125 o
grestore
gsave
/o {
gsave
newpath
translate
0.6 setlinewidth
1 setlinejoin

0 setlinecap

0 0 m
0 -2 l

gsave
0.000 setgray
fill
grestore
stroke
grestore
} bind def
90.3225 41.0125 o
grestore
gsave
/o {
gsave
newpath
translate
0.6 setlinewidth
1 setlinejoin

0 setlinecap

0 0 m
0 -2 l

gsave
0.000 setgray
fill
grestore
stroke
grestore
} bind def
103.528 41.0125 o
grestore
gsave
/o {
gsave
newpath
translate
0.6 setlinewidth
1 setlinejoin

0 setlinecap

0 0 m
0 -2 l

gsave
0.000 setgray
fill
grestore
stroke
grestore
} bind def
112.898 41.0125 o
grestore
gsave
/o {
gsave
newpath
translate
0.6 setlinewidth
1 setlinejoin

0 setlinecap

0 0 m
0 -2 l

gsave
0.000 setgray
fill
grestore
stroke
grestore
} bind def
120.166 41.0125 o
grestore
gsave
/o {
gsave
newpath
translate
0.6 setlinewidth
1 setlinejoin

0 setlinecap

0 0 m
0 -2 l

gsave
0.000 setgray
fill
grestore
stroke
grestore
} bind def
126.104 41.0125 o
grestore
gsave
/o {
gsave
newpath
translate
0.6 setlinewidth
1 setlinejoin

0 setlinecap

0 0 m
0 -2 l

gsave
0.000 setgray
fill
grestore
stroke
grestore
} bind def
131.125 41.0125 o
grestore
gsave
/o {
gsave
newpath
translate
0.6 setlinewidth
1 setlinejoin

0 setlinecap

0 0 m
0 -2 l

gsave
0.000 setgray
fill
grestore
stroke
grestore
} bind def
135.474 41.0125 o
grestore
gsave
/o {
gsave
newpath
translate
0.6 setlinewidth
1 setlinejoin

0 setlinecap

0 0 m
0 -2 l

gsave
0.000 setgray
fill
grestore
stroke
grestore
} bind def
139.31 41.0125 o
grestore
gsave
/o {
gsave
newpath
translate
0.6 setlinewidth
1 setlinejoin

0 setlinecap

0 0 m
0 -2 l

gsave
0.000 setgray
fill
grestore
stroke
grestore
} bind def
165.317 41.0125 o
grestore
gsave
/o {
gsave
newpath
translate
0.6 setlinewidth
1 setlinejoin

0 setlinecap

0 0 m
0 -2 l

gsave
0.000 setgray
fill
grestore
stroke
grestore
} bind def
178.523 41.0125 o
grestore
gsave
/o {
gsave
newpath
translate
0.6 setlinewidth
1 setlinejoin

0 setlinecap

0 0 m
0 -2 l

gsave
0.000 setgray
fill
grestore
stroke
grestore
} bind def
187.893 41.0125 o
grestore
gsave
/o {
gsave
newpath
translate
0.6 setlinewidth
1 setlinejoin

0 setlinecap

0 0 m
0 -2 l

gsave
0.000 setgray
fill
grestore
stroke
grestore
} bind def
195.161 41.0125 o
grestore
gsave
/o {
gsave
newpath
translate
0.6 setlinewidth
1 setlinejoin

0 setlinecap

0 0 m
0 -2 l

gsave
0.000 setgray
fill
grestore
stroke
grestore
} bind def
201.099 41.0125 o
grestore
gsave
/o {
gsave
newpath
translate
0.6 setlinewidth
1 setlinejoin

0 setlinecap

0 0 m
0 -2 l

gsave
0.000 setgray
fill
grestore
stroke
grestore
} bind def
206.12 41.0125 o
grestore
gsave
/o {
gsave
newpath
translate
0.6 setlinewidth
1 setlinejoin

0 setlinecap

0 0 m
0 -2 l

gsave
0.000 setgray
fill
grestore
stroke
grestore
} bind def
210.469 41.0125 o
grestore
gsave
/o {
gsave
newpath
translate
0.6 setlinewidth
1 setlinejoin

0 setlinecap

0 0 m
0 -2 l

gsave
0.000 setgray
fill
grestore
stroke
grestore
} bind def
214.305 41.0125 o
grestore
gsave
/o {
gsave
newpath
translate
0.6 setlinewidth
1 setlinejoin

0 setlinecap

0 0 m
0 -2 l

gsave
0.000 setgray
fill
grestore
stroke
grestore
} bind def
240.312 41.0125 o
grestore
gsave
142.485658 9.809375 translate
0.000000 rotate
/STIXGeneral-Italic 12.0 selectfont
0.000000 0.156250 moveto
/N glyphshow
grestore
0.800 setlinewidth
2 setlinecap
0.690 setgray
gsave
189.946 250.818 52.013 41.013 clipbox
52.0125 46.585432 m
241.958816 46.585432 l
stroke
grestore
0 setlinecap
0.000 setgray
gsave
/o {
gsave
newpath
translate
0.8 setlinewidth
1 setlinejoin

0 setlinecap

-0 0 m
-3.5 0 l

gsave
0.000 setgray
fill
grestore
stroke
grestore
} bind def
52.0125 46.5854 o
grestore
gsave
22.012500 42.390120 translate
0.000000 rotate
/STIXGeneral-Regular 12.0 selectfont
0.000000 0.118750 moveto
/one glyphshow
5.999985 0.118750 moveto
/zero glyphshow
/STIXGeneral-Regular 8.399999999999999 selectfont
12.189188 4.443750 moveto
/minus glyphshow
17.943178 4.443750 moveto
/seven glyphshow
grestore
2 setlinecap
0.690 setgray
gsave
189.946 250.818 52.013 41.013 clipbox
52.0125 80.185035 m
241.958816 80.185035 l
stroke
grestore
0 setlinecap
0.000 setgray
gsave
/o {
gsave
newpath
translate
0.8 setlinewidth
1 setlinejoin

0 setlinecap

-0 0 m
-3.5 0 l

gsave
0.000 setgray
fill
grestore
stroke
grestore
} bind def
52.0125 80.185 o
grestore
gsave
22.012500 75.489722 translate
0.000000 rotate
/STIXGeneral-Regular 12.0 selectfont
0.000000 0.932813 moveto
/one glyphshow
5.999985 0.932813 moveto
/zero glyphshow
/STIXGeneral-Regular 8.399999999999999 selectfont
12.189188 5.257813 moveto
/minus glyphshow
17.943178 5.257813 moveto
/six glyphshow
grestore
2 setlinecap
0.690 setgray
gsave
189.946 250.818 52.013 41.013 clipbox
52.0125 113.784637 m
241.958816 113.784637 l
stroke
grestore
0 setlinecap
0.000 setgray
gsave
/o {
gsave
newpath
translate
0.8 setlinewidth
1 setlinejoin

0 setlinecap

-0 0 m
-3.5 0 l

gsave
0.000 setgray
fill
grestore
stroke
grestore
} bind def
52.0125 113.785 o
grestore
gsave
22.012500 109.089324 translate
0.000000 rotate
/STIXGeneral-Regular 12.0 selectfont
0.000000 0.900000 moveto
/one glyphshow
5.999985 0.900000 moveto
/zero glyphshow
/STIXGeneral-Regular 8.399999999999999 selectfont
12.189188 5.225000 moveto
/minus glyphshow
17.943178 5.225000 moveto
/five glyphshow
grestore
2 setlinecap
0.690 setgray
gsave
189.946 250.818 52.013 41.013 clipbox
52.0125 147.384239 m
241.958816 147.384239 l
stroke
grestore
0 setlinecap
0.000 setgray
gsave
/o {
gsave
newpath
translate
0.8 setlinewidth
1 setlinejoin

0 setlinecap

-0 0 m
-3.5 0 l

gsave
0.000 setgray
fill
grestore
stroke
grestore
} bind def
52.0125 147.384 o
grestore
gsave
22.012500 142.688927 translate
0.000000 rotate
/STIXGeneral-Regular 12.0 selectfont
0.000000 0.998438 moveto
/one glyphshow
5.999985 0.998438 moveto
/zero glyphshow
/STIXGeneral-Regular 8.399999999999999 selectfont
12.189188 5.323438 moveto
/minus glyphshow
17.943178 5.323438 moveto
/four glyphshow
grestore
2 setlinecap
0.690 setgray
gsave
189.946 250.818 52.013 41.013 clipbox
52.0125 180.983841 m
241.958816 180.983841 l
stroke
grestore
0 setlinecap
0.000 setgray
gsave
/o {
gsave
newpath
translate
0.8 setlinewidth
1 setlinejoin

0 setlinecap

-0 0 m
-3.5 0 l

gsave
0.000 setgray
fill
grestore
stroke
grestore
} bind def
52.0125 180.984 o
grestore
gsave
22.012500 176.288529 translate
0.000000 rotate
/STIXGeneral-Regular 12.0 selectfont
0.000000 0.998438 moveto
/one glyphshow
5.999985 0.998438 moveto
/zero glyphshow
/STIXGeneral-Regular 8.399999999999999 selectfont
12.189188 5.323438 moveto
/minus glyphshow
17.943178 5.323438 moveto
/three glyphshow
grestore
2 setlinecap
0.690 setgray
gsave
189.946 250.818 52.013 41.013 clipbox
52.0125 214.583444 m
241.958816 214.583444 l
stroke
grestore
0 setlinecap
0.000 setgray
gsave
/o {
gsave
newpath
translate
0.8 setlinewidth
1 setlinejoin

0 setlinecap

-0 0 m
-3.5 0 l

gsave
0.000 setgray
fill
grestore
stroke
grestore
} bind def
52.0125 214.583 o
grestore
gsave
22.012500 209.888131 translate
0.000000 rotate
/STIXGeneral-Regular 12.0 selectfont
0.000000 0.998438 moveto
/one glyphshow
5.999985 0.998438 moveto
/zero glyphshow
/STIXGeneral-Regular 8.399999999999999 selectfont
12.189188 5.323438 moveto
/minus glyphshow
17.943178 5.323438 moveto
/two glyphshow
grestore
2 setlinecap
0.690 setgray
gsave
189.946 250.818 52.013 41.013 clipbox
52.0125 248.183046 m
241.958816 248.183046 l
stroke
grestore
0 setlinecap
0.000 setgray
gsave
/o {
gsave
newpath
translate
0.8 setlinewidth
1 setlinejoin

0 setlinecap

-0 0 m
-3.5 0 l

gsave
0.000 setgray
fill
grestore
stroke
grestore
} bind def
52.0125 248.183 o
grestore
gsave
22.012500 243.487734 translate
0.000000 rotate
/STIXGeneral-Regular 12.0 selectfont
0.000000 0.998438 moveto
/one glyphshow
5.999985 0.998438 moveto
/zero glyphshow
/STIXGeneral-Regular 8.399999999999999 selectfont
12.189188 5.323438 moveto
/minus glyphshow
17.943178 5.323438 moveto
/one glyphshow
grestore
2 setlinecap
0.690 setgray
gsave
189.946 250.818 52.013 41.013 clipbox
52.0125 281.782648 m
241.958816 281.782648 l
stroke
grestore
0 setlinecap
0.000 setgray
gsave
/o {
gsave
newpath
translate
0.8 setlinewidth
1 setlinejoin

0 setlinecap

-0 0 m
-3.5 0 l

gsave
0.000 setgray
fill
grestore
stroke
grestore
} bind def
52.0125 281.783 o
grestore
gsave
28.012500 277.087336 translate
0.000000 rotate
/STIXGeneral-Regular 12.0 selectfont
0.000000 0.998438 moveto
/one glyphshow
5.999985 0.998438 moveto
/zero glyphshow
/STIXGeneral-Regular 8.399999999999999 selectfont
12.189188 5.323438 moveto
/zero glyphshow
grestore
0.600 setlinewidth
gsave
/o {
gsave
newpath
translate
0.6 setlinewidth
1 setlinejoin

0 setlinecap

-0 0 m
-2 0 l

gsave
0.000 setgray
fill
grestore
stroke
grestore
} bind def
52.0125 41.3808 o
grestore
gsave
/o {
gsave
newpath
translate
0.6 setlinewidth
1 setlinejoin

0 setlinecap

-0 0 m
-2 0 l

gsave
0.000 setgray
fill
grestore
stroke
grestore
} bind def
52.0125 43.3293 o
grestore
gsave
/o {
gsave
newpath
translate
0.6 setlinewidth
1 setlinejoin

0 setlinecap

-0 0 m
-2 0 l

gsave
0.000 setgray
fill
grestore
stroke
grestore
} bind def
52.0125 45.048 o
grestore
gsave
/o {
gsave
newpath
translate
0.6 setlinewidth
1 setlinejoin

0 setlinecap

-0 0 m
-2 0 l

gsave
0.000 setgray
fill
grestore
stroke
grestore
} bind def
52.0125 56.6999 o
grestore
gsave
/o {
gsave
newpath
translate
0.6 setlinewidth
1 setlinejoin

0 setlinecap

-0 0 m
-2 0 l

gsave
0.000 setgray
fill
grestore
stroke
grestore
} bind def
52.0125 62.6165 o
grestore
gsave
/o {
gsave
newpath
translate
0.6 setlinewidth
1 setlinejoin

0 setlinecap

-0 0 m
-2 0 l

gsave
0.000 setgray
fill
grestore
stroke
grestore
} bind def
52.0125 66.8144 o
grestore
gsave
/o {
gsave
newpath
translate
0.6 setlinewidth
1 setlinejoin

0 setlinecap

-0 0 m
-2 0 l

gsave
0.000 setgray
fill
grestore
stroke
grestore
} bind def
52.0125 70.0705 o
grestore
gsave
/o {
gsave
newpath
translate
0.6 setlinewidth
1 setlinejoin

0 setlinecap

-0 0 m
-2 0 l

gsave
0.000 setgray
fill
grestore
stroke
grestore
} bind def
52.0125 72.731 o
grestore
gsave
/o {
gsave
newpath
translate
0.6 setlinewidth
1 setlinejoin

0 setlinecap

-0 0 m
-2 0 l

gsave
0.000 setgray
fill
grestore
stroke
grestore
} bind def
52.0125 74.9804 o
grestore
gsave
/o {
gsave
newpath
translate
0.6 setlinewidth
1 setlinejoin

0 setlinecap

-0 0 m
-2 0 l

gsave
0.000 setgray
fill
grestore
stroke
grestore
} bind def
52.0125 76.9289 o
grestore
gsave
/o {
gsave
newpath
translate
0.6 setlinewidth
1 setlinejoin

0 setlinecap

-0 0 m
-2 0 l

gsave
0.000 setgray
fill
grestore
stroke
grestore
} bind def
52.0125 78.6476 o
grestore
gsave
/o {
gsave
newpath
translate
0.6 setlinewidth
1 setlinejoin

0 setlinecap

-0 0 m
-2 0 l

gsave
0.000 setgray
fill
grestore
stroke
grestore
} bind def
52.0125 90.2995 o
grestore
gsave
/o {
gsave
newpath
translate
0.6 setlinewidth
1 setlinejoin

0 setlinecap

-0 0 m
-2 0 l

gsave
0.000 setgray
fill
grestore
stroke
grestore
} bind def
52.0125 96.2161 o
grestore
gsave
/o {
gsave
newpath
translate
0.6 setlinewidth
1 setlinejoin

0 setlinecap

-0 0 m
-2 0 l

gsave
0.000 setgray
fill
grestore
stroke
grestore
} bind def
52.0125 100.414 o
grestore
gsave
/o {
gsave
newpath
translate
0.6 setlinewidth
1 setlinejoin

0 setlinecap

-0 0 m
-2 0 l

gsave
0.000 setgray
fill
grestore
stroke
grestore
} bind def
52.0125 103.67 o
grestore
gsave
/o {
gsave
newpath
translate
0.6 setlinewidth
1 setlinejoin

0 setlinecap

-0 0 m
-2 0 l

gsave
0.000 setgray
fill
grestore
stroke
grestore
} bind def
52.0125 106.331 o
grestore
gsave
/o {
gsave
newpath
translate
0.6 setlinewidth
1 setlinejoin

0 setlinecap

-0 0 m
-2 0 l

gsave
0.000 setgray
fill
grestore
stroke
grestore
} bind def
52.0125 108.58 o
grestore
gsave
/o {
gsave
newpath
translate
0.6 setlinewidth
1 setlinejoin

0 setlinecap

-0 0 m
-2 0 l

gsave
0.000 setgray
fill
grestore
stroke
grestore
} bind def
52.0125 110.528 o
grestore
gsave
/o {
gsave
newpath
translate
0.6 setlinewidth
1 setlinejoin

0 setlinecap

-0 0 m
-2 0 l

gsave
0.000 setgray
fill
grestore
stroke
grestore
} bind def
52.0125 112.247 o
grestore
gsave
/o {
gsave
newpath
translate
0.6 setlinewidth
1 setlinejoin

0 setlinecap

-0 0 m
-2 0 l

gsave
0.000 setgray
fill
grestore
stroke
grestore
} bind def
52.0125 123.899 o
grestore
gsave
/o {
gsave
newpath
translate
0.6 setlinewidth
1 setlinejoin

0 setlinecap

-0 0 m
-2 0 l

gsave
0.000 setgray
fill
grestore
stroke
grestore
} bind def
52.0125 129.816 o
grestore
gsave
/o {
gsave
newpath
translate
0.6 setlinewidth
1 setlinejoin

0 setlinecap

-0 0 m
-2 0 l

gsave
0.000 setgray
fill
grestore
stroke
grestore
} bind def
52.0125 134.014 o
grestore
gsave
/o {
gsave
newpath
translate
0.6 setlinewidth
1 setlinejoin

0 setlinecap

-0 0 m
-2 0 l

gsave
0.000 setgray
fill
grestore
stroke
grestore
} bind def
52.0125 137.27 o
grestore
gsave
/o {
gsave
newpath
translate
0.6 setlinewidth
1 setlinejoin

0 setlinecap

-0 0 m
-2 0 l

gsave
0.000 setgray
fill
grestore
stroke
grestore
} bind def
52.0125 139.93 o
grestore
gsave
/o {
gsave
newpath
translate
0.6 setlinewidth
1 setlinejoin

0 setlinecap

-0 0 m
-2 0 l

gsave
0.000 setgray
fill
grestore
stroke
grestore
} bind def
52.0125 142.18 o
grestore
gsave
/o {
gsave
newpath
translate
0.6 setlinewidth
1 setlinejoin

0 setlinecap

-0 0 m
-2 0 l

gsave
0.000 setgray
fill
grestore
stroke
grestore
} bind def
52.0125 144.128 o
grestore
gsave
/o {
gsave
newpath
translate
0.6 setlinewidth
1 setlinejoin

0 setlinecap

-0 0 m
-2 0 l

gsave
0.000 setgray
fill
grestore
stroke
grestore
} bind def
52.0125 145.847 o
grestore
gsave
/o {
gsave
newpath
translate
0.6 setlinewidth
1 setlinejoin

0 setlinecap

-0 0 m
-2 0 l

gsave
0.000 setgray
fill
grestore
stroke
grestore
} bind def
52.0125 157.499 o
grestore
gsave
/o {
gsave
newpath
translate
0.6 setlinewidth
1 setlinejoin

0 setlinecap

-0 0 m
-2 0 l

gsave
0.000 setgray
fill
grestore
stroke
grestore
} bind def
52.0125 163.415 o
grestore
gsave
/o {
gsave
newpath
translate
0.6 setlinewidth
1 setlinejoin

0 setlinecap

-0 0 m
-2 0 l

gsave
0.000 setgray
fill
grestore
stroke
grestore
} bind def
52.0125 167.613 o
grestore
gsave
/o {
gsave
newpath
translate
0.6 setlinewidth
1 setlinejoin

0 setlinecap

-0 0 m
-2 0 l

gsave
0.000 setgray
fill
grestore
stroke
grestore
} bind def
52.0125 170.869 o
grestore
gsave
/o {
gsave
newpath
translate
0.6 setlinewidth
1 setlinejoin

0 setlinecap

-0 0 m
-2 0 l

gsave
0.000 setgray
fill
grestore
stroke
grestore
} bind def
52.0125 173.53 o
grestore
gsave
/o {
gsave
newpath
translate
0.6 setlinewidth
1 setlinejoin

0 setlinecap

-0 0 m
-2 0 l

gsave
0.000 setgray
fill
grestore
stroke
grestore
} bind def
52.0125 175.779 o
grestore
gsave
/o {
gsave
newpath
translate
0.6 setlinewidth
1 setlinejoin

0 setlinecap

-0 0 m
-2 0 l

gsave
0.000 setgray
fill
grestore
stroke
grestore
} bind def
52.0125 177.728 o
grestore
gsave
/o {
gsave
newpath
translate
0.6 setlinewidth
1 setlinejoin

0 setlinecap

-0 0 m
-2 0 l

gsave
0.000 setgray
fill
grestore
stroke
grestore
} bind def
52.0125 179.446 o
grestore
gsave
/o {
gsave
newpath
translate
0.6 setlinewidth
1 setlinejoin

0 setlinecap

-0 0 m
-2 0 l

gsave
0.000 setgray
fill
grestore
stroke
grestore
} bind def
52.0125 191.098 o
grestore
gsave
/o {
gsave
newpath
translate
0.6 setlinewidth
1 setlinejoin

0 setlinecap

-0 0 m
-2 0 l

gsave
0.000 setgray
fill
grestore
stroke
grestore
} bind def
52.0125 197.015 o
grestore
gsave
/o {
gsave
newpath
translate
0.6 setlinewidth
1 setlinejoin

0 setlinecap

-0 0 m
-2 0 l

gsave
0.000 setgray
fill
grestore
stroke
grestore
} bind def
52.0125 201.213 o
grestore
gsave
/o {
gsave
newpath
translate
0.6 setlinewidth
1 setlinejoin

0 setlinecap

-0 0 m
-2 0 l

gsave
0.000 setgray
fill
grestore
stroke
grestore
} bind def
52.0125 204.469 o
grestore
gsave
/o {
gsave
newpath
translate
0.6 setlinewidth
1 setlinejoin

0 setlinecap

-0 0 m
-2 0 l

gsave
0.000 setgray
fill
grestore
stroke
grestore
} bind def
52.0125 207.129 o
grestore
gsave
/o {
gsave
newpath
translate
0.6 setlinewidth
1 setlinejoin

0 setlinecap

-0 0 m
-2 0 l

gsave
0.000 setgray
fill
grestore
stroke
grestore
} bind def
52.0125 209.379 o
grestore
gsave
/o {
gsave
newpath
translate
0.6 setlinewidth
1 setlinejoin

0 setlinecap

-0 0 m
-2 0 l

gsave
0.000 setgray
fill
grestore
stroke
grestore
} bind def
52.0125 211.327 o
grestore
gsave
/o {
gsave
newpath
translate
0.6 setlinewidth
1 setlinejoin

0 setlinecap

-0 0 m
-2 0 l

gsave
0.000 setgray
fill
grestore
stroke
grestore
} bind def
52.0125 213.046 o
grestore
gsave
/o {
gsave
newpath
translate
0.6 setlinewidth
1 setlinejoin

0 setlinecap

-0 0 m
-2 0 l

gsave
0.000 setgray
fill
grestore
stroke
grestore
} bind def
52.0125 224.698 o
grestore
gsave
/o {
gsave
newpath
translate
0.6 setlinewidth
1 setlinejoin

0 setlinecap

-0 0 m
-2 0 l

gsave
0.000 setgray
fill
grestore
stroke
grestore
} bind def
52.0125 230.615 o
grestore
gsave
/o {
gsave
newpath
translate
0.6 setlinewidth
1 setlinejoin

0 setlinecap

-0 0 m
-2 0 l

gsave
0.000 setgray
fill
grestore
stroke
grestore
} bind def
52.0125 234.812 o
grestore
gsave
/o {
gsave
newpath
translate
0.6 setlinewidth
1 setlinejoin

0 setlinecap

-0 0 m
-2 0 l

gsave
0.000 setgray
fill
grestore
stroke
grestore
} bind def
52.0125 238.069 o
grestore
gsave
/o {
gsave
newpath
translate
0.6 setlinewidth
1 setlinejoin

0 setlinecap

-0 0 m
-2 0 l

gsave
0.000 setgray
fill
grestore
stroke
grestore
} bind def
52.0125 240.729 o
grestore
gsave
/o {
gsave
newpath
translate
0.6 setlinewidth
1 setlinejoin

0 setlinecap

-0 0 m
-2 0 l

gsave
0.000 setgray
fill
grestore
stroke
grestore
} bind def
52.0125 242.978 o
grestore
gsave
/o {
gsave
newpath
translate
0.6 setlinewidth
1 setlinejoin

0 setlinecap

-0 0 m
-2 0 l

gsave
0.000 setgray
fill
grestore
stroke
grestore
} bind def
52.0125 244.927 o
grestore
gsave
/o {
gsave
newpath
translate
0.6 setlinewidth
1 setlinejoin

0 setlinecap

-0 0 m
-2 0 l

gsave
0.000 setgray
fill
grestore
stroke
grestore
} bind def
52.0125 246.646 o
grestore
gsave
/o {
gsave
newpath
translate
0.6 setlinewidth
1 setlinejoin

0 setlinecap

-0 0 m
-2 0 l

gsave
0.000 setgray
fill
grestore
stroke
grestore
} bind def
52.0125 258.298 o
grestore
gsave
/o {
gsave
newpath
translate
0.6 setlinewidth
1 setlinejoin

0 setlinecap

-0 0 m
-2 0 l

gsave
0.000 setgray
fill
grestore
stroke
grestore
} bind def
52.0125 264.214 o
grestore
gsave
/o {
gsave
newpath
translate
0.6 setlinewidth
1 setlinejoin

0 setlinecap

-0 0 m
-2 0 l

gsave
0.000 setgray
fill
grestore
stroke
grestore
} bind def
52.0125 268.412 o
grestore
gsave
/o {
gsave
newpath
translate
0.6 setlinewidth
1 setlinejoin

0 setlinecap

-0 0 m
-2 0 l

gsave
0.000 setgray
fill
grestore
stroke
grestore
} bind def
52.0125 271.668 o
grestore
gsave
/o {
gsave
newpath
translate
0.6 setlinewidth
1 setlinejoin

0 setlinecap

-0 0 m
-2 0 l

gsave
0.000 setgray
fill
grestore
stroke
grestore
} bind def
52.0125 274.329 o
grestore
gsave
/o {
gsave
newpath
translate
0.6 setlinewidth
1 setlinejoin

0 setlinecap

-0 0 m
-2 0 l

gsave
0.000 setgray
fill
grestore
stroke
grestore
} bind def
52.0125 276.578 o
grestore
gsave
/o {
gsave
newpath
translate
0.6 setlinewidth
1 setlinejoin

0 setlinecap

-0 0 m
-2 0 l

gsave
0.000 setgray
fill
grestore
stroke
grestore
} bind def
52.0125 278.527 o
grestore
gsave
/o {
gsave
newpath
translate
0.6 setlinewidth
1 setlinejoin

0 setlinecap

-0 0 m
-2 0 l

gsave
0.000 setgray
fill
grestore
stroke
grestore
} bind def
52.0125 280.245 o
grestore
gsave
15.403125 159.421250 translate
90.000000 rotate
/STIXGeneral-Italic 12.0 selectfont
0.000000 0.703125 moveto
/e glyphshow
/STIXGeneral-Regular 8.399999999999999 selectfont
5.327988 -0.885937 moveto
/uni221E glyphshow
grestore
1.500 setlinewidth
2 setlinecap
0.122 0.467 0.706 setrgbcolor
gsave
189.946 250.818 52.013 41.013 clipbox
60.646423 276.299255 m
64.192017 276.512393 l
69.118092 273.310312 l
73.724105 275.475711 l
77.954992 271.036102 l
83.31028 272.443658 l
88.18508 268.032192 l
92.737343 265.636227 l
96.995507 266.430089 l
101.918367 268.930707 l
106.540192 261.366375 l
110.88503 260.114094 l
115.690518 260.684813 l
120.892703 260.015072 l
125.065502 258.58203 l
130.199362 253.070258 l
134.377425 257.157069 l
139.428411 248.817678 l
144.093006 248.280247 l
148.419368 246.185794 l
153.398986 242.537936 l
158.01149 240.297888 l
162.681475 238.343166 l
167.39903 239.476708 l
172.120319 235.137423 l
176.832196 235.296458 l
181.506534 228.684002 l
186.122194 229.970185 l
190.928976 226.901247 l
195.628334 224.652194 l
200.438203 220.394479 l
205.119592 218.998589 l
209.660932 217.474193 l
214.42397 215.255046 l
219.175171 213.524518 l
223.895153 211.768886 l
228.581505 207.08805 l
233.324892 206.002438 l
stroke
grestore
1.000 setlinewidth
0 setlinecap
gsave
189.946 250.818 52.013 41.013 clipbox
/o {
gsave
newpath
translate
1.0 setlinewidth
1 setlinejoin

0 setlinecap

0 -1.5 m
0.397805 -1.5 0.77937 -1.341951 1.06066 -1.06066 c
1.341951 -0.77937 1.5 -0.397805 1.5 0 c
1.5 0.397805 1.341951 0.77937 1.06066 1.06066 c
0.77937 1.341951 0.397805 1.5 0 1.5 c
-0.397805 1.5 -0.77937 1.341951 -1.06066 1.06066 c
-1.341951 0.77937 -1.5 0.397805 -1.5 0 c
-1.5 -0.397805 -1.341951 -0.77937 -1.06066 -1.06066 c
-0.77937 -1.341951 -0.397805 -1.5 0 -1.5 c
cl

gsave
0.122 0.467 0.706 setrgbcolor
fill
grestore
stroke
grestore
} bind def
60.6464 276.299 o
64.192 276.512 o
69.1181 273.31 o
73.7241 275.476 o
77.955 271.036 o
83.3103 272.444 o
88.1851 268.032 o
92.7373 265.636 o
96.9955 266.43 o
101.918 268.931 o
106.54 261.366 o
110.885 260.114 o
115.691 260.685 o
120.893 260.015 o
125.066 258.582 o
130.199 253.07 o
134.377 257.157 o
139.428 248.818 o
144.093 248.28 o
148.419 246.186 o
153.399 242.538 o
158.011 240.298 o
162.681 238.343 o
167.399 239.477 o
172.12 235.137 o
176.832 235.296 o
181.507 228.684 o
186.122 229.97 o
190.929 226.901 o
195.628 224.652 o
200.438 220.394 o
205.12 218.999 o
209.661 217.474 o
214.424 215.255 o
219.175 213.525 o
223.895 211.769 o
228.582 207.088 o
233.325 206.002 o
grestore
1.500 setlinewidth
2 setlinecap
1.000 0.498 0.055 setrgbcolor
gsave
189.946 250.818 52.013 41.013 clipbox
60.68852 275.89813 m
64.178937 267.942916 l
69.165523 273.588006 l
73.735489 269.31772 l
77.991634 265.104412 l
83.266626 264.058002 l
88.161073 259.927267 l
92.741274 261.281629 l
96.98436 256.57047 l
101.961228 252.259633 l
106.588062 249.668551 l
110.863368 243.174327 l
115.686781 244.331251 l
120.913591 242.005841 l
125.059225 236.95751 l
130.194958 235.244506 l
134.397377 229.351936 l
139.425166 231.010071 l
144.098942 223.776231 l
148.458141 218.691591 l
153.414573 213.980335 l
157.999504 213.12026 l
162.686206 206.795654 l
167.389863 206.123116 l
172.130995 200.328615 l
176.823916 193.659114 l
181.496012 192.918552 l
186.131959 184.891654 l
190.932299 182.11434 l
195.635371 178.183022 l
200.44125 173.704772 l
205.117413 171.671915 l
209.657936 163.002239 l
214.42123 159.006603 l
219.172304 154.469729 l
223.899962 149.935044 l
228.57713 149.654456 l
233.32331 144.862904 l
stroke
grestore
1.000 setlinewidth
2 setlinejoin
0 setlinecap
gsave
189.946 250.818 52.013 41.013 clipbox
/o {
gsave
newpath
translate
1.0 setlinewidth
2 setlinejoin

0 setlinecap

0 3 m
-0.673542 0.927051 l
-2.85317 0.927051 l
-1.089814 -0.354102 l
-1.763356 -2.427051 l
-0 -1.145898 l
1.763356 -2.427051 l
1.089814 -0.354102 l
2.85317 0.927051 l
0.673542 0.927051 l
cl

gsave
1.000 0.498 0.055 setrgbcolor
fill
grestore
stroke
grestore
} bind def
60.6885 275.898 o
64.1789 267.943 o
69.1655 273.588 o
73.7355 269.318 o
77.9916 265.104 o
83.2666 264.058 o
88.1611 259.927 o
92.7413 261.282 o
96.9844 256.57 o
101.961 252.26 o
106.588 249.669 o
110.863 243.174 o
115.687 244.331 o
120.914 242.006 o
125.059 236.958 o
130.195 235.245 o
134.397 229.352 o
139.425 231.01 o
144.099 223.776 o
148.458 218.692 o
153.415 213.98 o
158 213.12 o
162.686 206.796 o
167.39 206.123 o
172.131 200.329 o
176.824 193.659 o
181.496 192.919 o
186.132 184.892 o
190.932 182.114 o
195.635 178.183 o
200.441 173.705 o
205.117 171.672 o
209.658 163.002 o
214.421 159.007 o
219.172 154.47 o
223.9 149.935 o
228.577 149.654 o
233.323 144.863 o
grestore
1.500 setlinewidth
1 setlinejoin
2 setlinecap
0.173 0.627 0.173 setrgbcolor
gsave
189.946 250.818 52.013 41.013 clipbox
60.682047 278.855226 m
64.181844 273.67759 l
69.099975 271.024732 l
73.670928 268.554434 l
77.921169 264.489455 l
83.294523 260.691256 l
88.138791 259.565735 l
92.731294 250.51724 l
97.010363 248.806511 l
101.973529 245.417302 l
106.565125 239.013874 l
110.865795 237.165465 l
115.680054 230.997702 l
120.899073 224.944992 l
125.03803 221.586916 l
130.207595 217.15843 l
134.380119 209.496177 l
139.420838 205.267924 l
144.102566 197.853544 l
148.446716 192.363541 l
153.400865 188.519368 l
158.012998 183.899898 l
162.684335 177.743965 l
167.396036 171.016804 l
172.133717 168.064982 l
176.831967 159.296257 l
181.501502 152.273233 l
186.130051 148.805481 l
190.934272 143.731194 l
195.634819 134.739777 l
200.441239 122.048781 l
205.112951 120.327043 l
209.663303 114.290957 l
214.423278 110.36124 l
219.177041 102.502394 l
223.899536 99.25473 l
228.578671 94.086974 l
233.324307 93.401298 l
stroke
grestore
1.000 setlinewidth
0 setlinecap
gsave
189.946 250.818 52.013 41.013 clipbox
/o {
gsave
newpath
translate
1.0 setlinewidth
1 setlinejoin

0 setlinecap

-2 -2 m
2 2 l
-2 2 m
2 -2 l

gsave
0.173 0.627 0.173 setrgbcolor
fill
grestore
stroke
grestore
} bind def
60.682 278.855 o
64.1818 273.678 o
69.1 271.025 o
73.6709 268.554 o
77.9212 264.489 o
83.2945 260.691 o
88.1388 259.566 o
92.7313 250.517 o
97.0104 248.807 o
101.974 245.417 o
106.565 239.014 o
110.866 237.165 o
115.68 230.998 o
120.899 224.945 o
125.038 221.587 o
130.208 217.158 o
134.38 209.496 o
139.421 205.268 o
144.103 197.854 o
148.447 192.364 o
153.401 188.519 o
158.013 183.9 o
162.684 177.744 o
167.396 171.017 o
172.134 168.065 o
176.832 159.296 o
181.502 152.273 o
186.13 148.805 o
190.934 143.731 o
195.635 134.74 o
200.441 122.049 o
205.113 120.327 o
209.663 114.291 o
214.423 110.361 o
219.177 102.502 o
223.9 99.2547 o
228.579 94.087 o
233.324 93.4013 o
grestore
1.500 setlinewidth
2 setlinecap
0.839 0.153 0.157 setrgbcolor
gsave
189.946 250.818 52.013 41.013 clipbox
60.673145 280.429205 m
64.187658 277.236358 l
69.128083 269.686138 l
73.713802 267.883814 l
77.992109 267.306155 l
83.259749 264.087622 l
88.170469 255.288598 l
92.728269 254.735874 l
97.005058 250.499418 l
101.966924 243.698091 l
106.567499 236.809722 l
110.891265 233.188 l
115.691116 226.718383 l
120.899583 221.785816 l
125.035113 215.121354 l
130.189499 208.406251 l
134.404951 199.904778 l
139.428844 193.016721 l
144.071752 185.618537 l
148.443873 181.474411 l
153.407908 171.576823 l
158.004152 163.345985 l
162.680097 155.551402 l
167.400833 148.345864 l
172.122354 140.182695 l
176.828262 128.69724 l
181.509189 124.257124 l
186.128057 117.22336 l
190.929689 111.617866 l
195.633445 100.663564 l
200.444606 91.186325 l
205.118699 85.135044 l
209.661417 78.20989 l
214.418287 69.839613 l
219.170072 62.863927 l
223.894139 54.700464 l
228.577126 58.238288 l
233.323879 52.413295 l
stroke
grestore
1.000 setlinewidth
0 setlinejoin
0 setlinecap
gsave
189.946 250.818 52.013 41.013 clipbox
/o {
gsave
newpath
translate
1.0 setlinewidth
0 setlinejoin

0 setlinecap

2 -0 m
-2 2 l
-2 -2 l
cl

gsave
0.839 0.153 0.157 setrgbcolor
fill
grestore
stroke
grestore
} bind def
60.6731 280.429 o
64.1877 277.236 o
69.1281 269.686 o
73.7138 267.884 o
77.9921 267.306 o
83.2597 264.088 o
88.1705 255.289 o
92.7283 254.736 o
97.0051 250.499 o
101.967 243.698 o
106.567 236.81 o
110.891 233.188 o
115.691 226.718 o
120.9 221.786 o
125.035 215.121 o
130.189 208.406 o
134.405 199.905 o
139.429 193.017 o
144.072 185.619 o
148.444 181.474 o
153.408 171.577 o
158.004 163.346 o
162.68 155.551 o
167.401 148.346 o
172.122 140.183 o
176.828 128.697 o
181.509 124.257 o
186.128 117.223 o
190.93 111.618 o
195.633 100.664 o
200.445 91.1863 o
205.119 85.135 o
209.661 78.2099 o
214.418 69.8396 o
219.17 62.8639 o
223.894 54.7005 o
228.577 58.2383 o
233.324 52.4133 o
grestore
0.800 setlinewidth
2 setlinecap
0.000 setgray
gsave
52.0125 41.0125 m
52.0125 291.83 l
stroke
grestore
gsave
241.958816 41.0125 m
241.958816 291.83 l
stroke
grestore
gsave
52.0125 41.0125 m
241.958816 41.0125 l
stroke
grestore
gsave
52.0125 291.83 m
241.958816 291.83 l
stroke
grestore
/STIXGeneral-Regular 12.000 selectfont
gsave

114.470033 297.830000 translate
0.000000 rotate
0.000000 0 m /s glyphshow
4.667984 0 m /o glyphshow
10.667969 0 m /l glyphshow
14.003967 0 m /u glyphshow
20.003952 0 m /t glyphshow
23.339951 0 m /i glyphshow
26.675949 0 m /o glyphshow
32.675934 0 m /n glyphshow
38.675919 0 m /space glyphshow
41.675903 0 m /e glyphshow
47.003891 0 m /r glyphshow
50.999878 0 m /r glyphshow
54.995865 0 m /o glyphshow
60.995850 0 m /r glyphshow
grestore
1.000 setlinewidth
0 setlinecap
0.800 setgray
gsave
59.0125 46.0125 m
113.0125 46.0125 l
114.345833 46.0125 115.0125 46.679167 115.0125 48.0125 c
115.0125 103.7 l
115.0125 105.033333 114.345833 105.7 113.0125 105.7 c
59.0125 105.7 l
57.679167 105.7 57.0125 105.033333 57.0125 103.7 c
57.0125 48.0125 l
57.0125 46.679167 57.679167 46.0125 59.0125 46.0125 c
cl
gsave
1.000 setgray
fill
grestore
stroke
grestore
1.500 setlinewidth
1 setlinejoin
2 setlinecap
0.122 0.467 0.706 setrgbcolor
gsave
61.0125 98.2 m
71.0125 98.2 l
81.0125 98.2 l
stroke
grestore
1.000 setlinewidth
0 setlinecap
gsave
/o {
gsave
newpath
translate
1.0 setlinewidth
1 setlinejoin

0 setlinecap

0 -1.5 m
0.397805 -1.5 0.77937 -1.341951 1.06066 -1.06066 c
1.341951 -0.77937 1.5 -0.397805 1.5 0 c
1.5 0.397805 1.341951 0.77937 1.06066 1.06066 c
0.77937 1.341951 0.397805 1.5 0 1.5 c
-0.397805 1.5 -0.77937 1.341951 -1.06066 1.06066 c
-1.341951 0.77937 -1.5 0.397805 -1.5 0 c
-1.5 -0.397805 -1.341951 -0.77937 -1.06066 -1.06066 c
-0.77937 -1.341951 -0.397805 -1.5 0 -1.5 c
cl

gsave
0.122 0.467 0.706 setrgbcolor
fill
grestore
stroke
grestore
} bind def
71.0125 98.2 o
grestore
0.000 setgray
gsave
89.012500 94.700000 translate
0.000000 rotate
/STIXGeneral-Italic 10.0 selectfont
0.000000 0.234375 moveto
/m glyphshow
/STIXGeneral-Regular 10.0 selectfont
8.663983 0.234375 moveto
/equal glyphshow
16.957971 0.234375 moveto
/two glyphshow
grestore
1.500 setlinewidth
2 setlinecap
1.000 0.498 0.055 setrgbcolor
gsave
61.0125 84.028125 m
71.0125 84.028125 l
81.0125 84.028125 l
stroke
grestore
1.000 setlinewidth
2 setlinejoin
0 setlinecap
gsave
/o {
gsave
newpath
translate
1.0 setlinewidth
2 setlinejoin

0 setlinecap

0 3 m
-0.673542 0.927051 l
-2.85317 0.927051 l
-1.089814 -0.354102 l
-1.763356 -2.427051 l
-0 -1.145898 l
1.763356 -2.427051 l
1.089814 -0.354102 l
2.85317 0.927051 l
0.673542 0.927051 l
cl

gsave
1.000 0.498 0.055 setrgbcolor
fill
grestore
stroke
grestore
} bind def
71.0125 84.0281 o
grestore
0.000 setgray
gsave
89.012500 80.528125 translate
0.000000 rotate
/STIXGeneral-Italic 10.0 selectfont
0.000000 0.234375 moveto
/m glyphshow
/STIXGeneral-Regular 10.0 selectfont
8.663983 0.234375 moveto
/equal glyphshow
16.957971 0.234375 moveto
/four glyphshow
grestore
1.500 setlinewidth
1 setlinejoin
2 setlinecap
0.173 0.627 0.173 setrgbcolor
gsave
61.0125 69.85625 m
71.0125 69.85625 l
81.0125 69.85625 l
stroke
grestore
1.000 setlinewidth
0 setlinecap
gsave
/o {
gsave
newpath
translate
1.0 setlinewidth
1 setlinejoin

0 setlinecap

-2 -2 m
2 2 l
-2 2 m
2 -2 l

gsave
0.173 0.627 0.173 setrgbcolor
fill
grestore
stroke
grestore
} bind def
71.0125 69.8563 o
grestore
0.000 setgray
gsave
89.012500 66.356250 translate
0.000000 rotate
/STIXGeneral-Italic 10.0 selectfont
0.000000 0.156250 moveto
/m glyphshow
/STIXGeneral-Regular 10.0 selectfont
8.663983 0.156250 moveto
/equal glyphshow
16.957971 0.156250 moveto
/six glyphshow
grestore
1.500 setlinewidth
2 setlinecap
0.839 0.153 0.157 setrgbcolor
gsave
61.0125 55.684375 m
71.0125 55.684375 l
81.0125 55.684375 l
stroke
grestore
1.000 setlinewidth
0 setlinejoin
0 setlinecap
gsave
/o {
gsave
newpath
translate
1.0 setlinewidth
0 setlinejoin

0 setlinecap

2 -0 m
-2 2 l
-2 -2 l
cl

gsave
0.839 0.153 0.157 setrgbcolor
fill
grestore
stroke
grestore
} bind def
71.0125 55.6844 o
grestore
0.000 setgray
gsave
89.012500 52.184375 translate
0.000000 rotate
/STIXGeneral-Italic 10.0 selectfont
0.000000 0.234375 moveto
/m glyphshow
/STIXGeneral-Regular 10.0 selectfont
8.663983 0.234375 moveto
/equal glyphshow
16.957971 0.234375 moveto
/eight glyphshow
grestore
gsave
298.6125 41.0125 m
488.558816 41.0125 l
488.558816 291.83 l
298.6125 291.83 l
cl
1.000 setgray
fill
grestore
0.800 setlinewidth
1 setlinejoin
2 setlinecap
0.690 setgray
gsave
189.946 250.818 298.613 41.013 clipbox
314.346864 41.0125 m
314.346864 291.83 l
stroke
grestore
0 setlinecap
0.000 setgray
gsave
/o {
gsave
newpath
translate
0.8 setlinewidth
1 setlinejoin

0 setlinecap

0 0 m
0 -3.5 l

gsave
0.000 setgray
fill
grestore
stroke
grestore
} bind def
314.347 41.0125 o
grestore
gsave
305.846864 24.621875 translate
0.000000 rotate
/STIXGeneral-Regular 12.0 selectfont
0.000000 0.998438 moveto
/one glyphshow
5.999985 0.998438 moveto
/zero glyphshow
/STIXGeneral-Regular 8.399999999999999 selectfont
12.189188 5.323438 moveto
/three glyphshow
grestore
2 setlinecap
0.690 setgray
gsave
189.946 250.818 298.613 41.013 clipbox
389.341645 41.0125 m
389.341645 291.83 l
stroke
grestore
0 setlinecap
0.000 setgray
gsave
/o {
gsave
newpath
translate
0.8 setlinewidth
1 setlinejoin

0 setlinecap

0 0 m
0 -3.5 l

gsave
0.000 setgray
fill
grestore
stroke
grestore
} bind def
389.342 41.0125 o
grestore
gsave
380.841645 24.621875 translate
0.000000 rotate
/STIXGeneral-Regular 12.0 selectfont
0.000000 0.998438 moveto
/one glyphshow
5.999985 0.998438 moveto
/zero glyphshow
/STIXGeneral-Regular 8.399999999999999 selectfont
12.189188 5.323438 moveto
/four glyphshow
grestore
2 setlinecap
0.690 setgray
gsave
189.946 250.818 298.613 41.013 clipbox
464.336426 41.0125 m
464.336426 291.83 l
stroke
grestore
0 setlinecap
0.000 setgray
gsave
/o {
gsave
newpath
translate
0.8 setlinewidth
1 setlinejoin

0 setlinecap

0 0 m
0 -3.5 l

gsave
0.000 setgray
fill
grestore
stroke
grestore
} bind def
464.336 41.0125 o
grestore
gsave
455.836426 24.621875 translate
0.000000 rotate
/STIXGeneral-Regular 12.0 selectfont
0.000000 0.900000 moveto
/one glyphshow
5.999985 0.900000 moveto
/zero glyphshow
/STIXGeneral-Regular 8.399999999999999 selectfont
12.189188 5.225000 moveto
/five glyphshow
grestore
0.600 setlinewidth
gsave
/o {
gsave
newpath
translate
0.6 setlinewidth
1 setlinejoin

0 setlinecap

0 0 m
0 -2 l

gsave
0.000 setgray
fill
grestore
stroke
grestore
} bind def
302.73 41.0125 o
grestore
gsave
/o {
gsave
newpath
translate
0.6 setlinewidth
1 setlinejoin

0 setlinecap

0 0 m
0 -2 l

gsave
0.000 setgray
fill
grestore
stroke
grestore
} bind def
307.079 41.0125 o
grestore
gsave
/o {
gsave
newpath
translate
0.6 setlinewidth
1 setlinejoin

0 setlinecap

0 0 m
0 -2 l

gsave
0.000 setgray
fill
grestore
stroke
grestore
} bind def
310.915 41.0125 o
grestore
gsave
/o {
gsave
newpath
translate
0.6 setlinewidth
1 setlinejoin

0 setlinecap

0 0 m
0 -2 l

gsave
0.000 setgray
fill
grestore
stroke
grestore
} bind def
336.923 41.0125 o
grestore
gsave
/o {
gsave
newpath
translate
0.6 setlinewidth
1 setlinejoin

0 setlinecap

0 0 m
0 -2 l

gsave
0.000 setgray
fill
grestore
stroke
grestore
} bind def
350.128 41.0125 o
grestore
gsave
/o {
gsave
newpath
translate
0.6 setlinewidth
1 setlinejoin

0 setlinecap

0 0 m
0 -2 l

gsave
0.000 setgray
fill
grestore
stroke
grestore
} bind def
359.498 41.0125 o
grestore
gsave
/o {
gsave
newpath
translate
0.6 setlinewidth
1 setlinejoin

0 setlinecap

0 0 m
0 -2 l

gsave
0.000 setgray
fill
grestore
stroke
grestore
} bind def
366.766 41.0125 o
grestore
gsave
/o {
gsave
newpath
translate
0.6 setlinewidth
1 setlinejoin

0 setlinecap

0 0 m
0 -2 l

gsave
0.000 setgray
fill
grestore
stroke
grestore
} bind def
372.704 41.0125 o
grestore
gsave
/o {
gsave
newpath
translate
0.6 setlinewidth
1 setlinejoin

0 setlinecap

0 0 m
0 -2 l

gsave
0.000 setgray
fill
grestore
stroke
grestore
} bind def
377.725 41.0125 o
grestore
gsave
/o {
gsave
newpath
translate
0.6 setlinewidth
1 setlinejoin

0 setlinecap

0 0 m
0 -2 l

gsave
0.000 setgray
fill
grestore
stroke
grestore
} bind def
382.074 41.0125 o
grestore
gsave
/o {
gsave
newpath
translate
0.6 setlinewidth
1 setlinejoin

0 setlinecap

0 0 m
0 -2 l

gsave
0.000 setgray
fill
grestore
stroke
grestore
} bind def
385.91 41.0125 o
grestore
gsave
/o {
gsave
newpath
translate
0.6 setlinewidth
1 setlinejoin

0 setlinecap

0 0 m
0 -2 l

gsave
0.000 setgray
fill
grestore
stroke
grestore
} bind def
411.917 41.0125 o
grestore
gsave
/o {
gsave
newpath
translate
0.6 setlinewidth
1 setlinejoin

0 setlinecap

0 0 m
0 -2 l

gsave
0.000 setgray
fill
grestore
stroke
grestore
} bind def
425.123 41.0125 o
grestore
gsave
/o {
gsave
newpath
translate
0.6 setlinewidth
1 setlinejoin

0 setlinecap

0 0 m
0 -2 l

gsave
0.000 setgray
fill
grestore
stroke
grestore
} bind def
434.493 41.0125 o
grestore
gsave
/o {
gsave
newpath
translate
0.6 setlinewidth
1 setlinejoin

0 setlinecap

0 0 m
0 -2 l

gsave
0.000 setgray
fill
grestore
stroke
grestore
} bind def
441.761 41.0125 o
grestore
gsave
/o {
gsave
newpath
translate
0.6 setlinewidth
1 setlinejoin

0 setlinecap

0 0 m
0 -2 l

gsave
0.000 setgray
fill
grestore
stroke
grestore
} bind def
447.699 41.0125 o
grestore
gsave
/o {
gsave
newpath
translate
0.6 setlinewidth
1 setlinejoin

0 setlinecap

0 0 m
0 -2 l

gsave
0.000 setgray
fill
grestore
stroke
grestore
} bind def
452.72 41.0125 o
grestore
gsave
/o {
gsave
newpath
translate
0.6 setlinewidth
1 setlinejoin

0 setlinecap

0 0 m
0 -2 l

gsave
0.000 setgray
fill
grestore
stroke
grestore
} bind def
457.069 41.0125 o
grestore
gsave
/o {
gsave
newpath
translate
0.6 setlinewidth
1 setlinejoin

0 setlinecap

0 0 m
0 -2 l

gsave
0.000 setgray
fill
grestore
stroke
grestore
} bind def
460.905 41.0125 o
grestore
gsave
/o {
gsave
newpath
translate
0.6 setlinewidth
1 setlinejoin

0 setlinecap

0 0 m
0 -2 l

gsave
0.000 setgray
fill
grestore
stroke
grestore
} bind def
486.912 41.0125 o
grestore
gsave
389.085658 9.809375 translate
0.000000 rotate
/STIXGeneral-Italic 12.0 selectfont
0.000000 0.156250 moveto
/N glyphshow
grestore
0.800 setlinewidth
2 setlinecap
0.690 setgray
gsave
189.946 250.818 298.613 41.013 clipbox
298.6125 58.011872 m
488.558816 58.011872 l
stroke
grestore
0 setlinecap
0.000 setgray
gsave
/o {
gsave
newpath
translate
0.8 setlinewidth
1 setlinejoin

0 setlinecap

-0 0 m
-3.5 0 l

gsave
0.000 setgray
fill
grestore
stroke
grestore
} bind def
298.613 58.0119 o
grestore
gsave
268.612500 53.316560 translate
0.000000 rotate
/STIXGeneral-Regular 12.0 selectfont
0.000000 0.932813 moveto
/one glyphshow
5.999985 0.932813 moveto
/zero glyphshow
/STIXGeneral-Regular 8.399999999999999 selectfont
12.189188 5.257813 moveto
/minus glyphshow
17.943178 5.257813 moveto
/six glyphshow
grestore
2 setlinecap
0.690 setgray
gsave
189.946 250.818 298.613 41.013 clipbox
298.6125 99.006501 m
488.558816 99.006501 l
stroke
grestore
0 setlinecap
0.000 setgray
gsave
/o {
gsave
newpath
translate
0.8 setlinewidth
1 setlinejoin

0 setlinecap

-0 0 m
-3.5 0 l

gsave
0.000 setgray
fill
grestore
stroke
grestore
} bind def
298.613 99.0065 o
grestore
gsave
268.612500 94.311188 translate
0.000000 rotate
/STIXGeneral-Regular 12.0 selectfont
0.000000 0.900000 moveto
/one glyphshow
5.999985 0.900000 moveto
/zero glyphshow
/STIXGeneral-Regular 8.399999999999999 selectfont
12.189188 5.225000 moveto
/minus glyphshow
17.943178 5.225000 moveto
/five glyphshow
grestore
2 setlinecap
0.690 setgray
gsave
189.946 250.818 298.613 41.013 clipbox
298.6125 140.001129 m
488.558816 140.001129 l
stroke
grestore
0 setlinecap
0.000 setgray
gsave
/o {
gsave
newpath
translate
0.8 setlinewidth
1 setlinejoin

0 setlinecap

-0 0 m
-3.5 0 l

gsave
0.000 setgray
fill
grestore
stroke
grestore
} bind def
298.613 140.001 o
grestore
gsave
268.612500 135.305817 translate
0.000000 rotate
/STIXGeneral-Regular 12.0 selectfont
0.000000 0.998438 moveto
/one glyphshow
5.999985 0.998438 moveto
/zero glyphshow
/STIXGeneral-Regular 8.399999999999999 selectfont
12.189188 5.323438 moveto
/minus glyphshow
17.943178 5.323438 moveto
/four glyphshow
grestore
2 setlinecap
0.690 setgray
gsave
189.946 250.818 298.613 41.013 clipbox
298.6125 180.995757 m
488.558816 180.995757 l
stroke
grestore
0 setlinecap
0.000 setgray
gsave
/o {
gsave
newpath
translate
0.8 setlinewidth
1 setlinejoin

0 setlinecap

-0 0 m
-3.5 0 l

gsave
0.000 setgray
fill
grestore
stroke
grestore
} bind def
298.613 180.996 o
grestore
gsave
268.612500 176.300445 translate
0.000000 rotate
/STIXGeneral-Regular 12.0 selectfont
0.000000 0.998438 moveto
/one glyphshow
5.999985 0.998438 moveto
/zero glyphshow
/STIXGeneral-Regular 8.399999999999999 selectfont
12.189188 5.323438 moveto
/minus glyphshow
17.943178 5.323438 moveto
/three glyphshow
grestore
2 setlinecap
0.690 setgray
gsave
189.946 250.818 298.613 41.013 clipbox
298.6125 221.990386 m
488.558816 221.990386 l
stroke
grestore
0 setlinecap
0.000 setgray
gsave
/o {
gsave
newpath
translate
0.8 setlinewidth
1 setlinejoin

0 setlinecap

-0 0 m
-3.5 0 l

gsave
0.000 setgray
fill
grestore
stroke
grestore
} bind def
298.613 221.99 o
grestore
gsave
268.612500 217.295073 translate
0.000000 rotate
/STIXGeneral-Regular 12.0 selectfont
0.000000 0.998438 moveto
/one glyphshow
5.999985 0.998438 moveto
/zero glyphshow
/STIXGeneral-Regular 8.399999999999999 selectfont
12.189188 5.323438 moveto
/minus glyphshow
17.943178 5.323438 moveto
/two glyphshow
grestore
2 setlinecap
0.690 setgray
gsave
189.946 250.818 298.613 41.013 clipbox
298.6125 262.985014 m
488.558816 262.985014 l
stroke
grestore
0 setlinecap
0.000 setgray
gsave
/o {
gsave
newpath
translate
0.8 setlinewidth
1 setlinejoin

0 setlinecap

-0 0 m
-3.5 0 l

gsave
0.000 setgray
fill
grestore
stroke
grestore
} bind def
298.613 262.985 o
grestore
gsave
268.612500 258.289702 translate
0.000000 rotate
/STIXGeneral-Regular 12.0 selectfont
0.000000 0.998438 moveto
/one glyphshow
5.999985 0.998438 moveto
/zero glyphshow
/STIXGeneral-Regular 8.399999999999999 selectfont
12.189188 5.323438 moveto
/minus glyphshow
17.943178 5.323438 moveto
/one glyphshow
grestore
0.600 setlinewidth
gsave
/o {
gsave
newpath
translate
0.6 setlinewidth
1 setlinejoin

0 setlinecap

-0 0 m
-2 0 l

gsave
0.000 setgray
fill
grestore
stroke
grestore
} bind def
298.613 41.6985 o
grestore
gsave
/o {
gsave
newpath
translate
0.6 setlinewidth
1 setlinejoin

0 setlinecap

-0 0 m
-2 0 l

gsave
0.000 setgray
fill
grestore
stroke
grestore
} bind def
298.613 45.6713 o
grestore
gsave
/o {
gsave
newpath
translate
0.6 setlinewidth
1 setlinejoin

0 setlinecap

-0 0 m
-2 0 l

gsave
0.000 setgray
fill
grestore
stroke
grestore
} bind def
298.613 48.9173 o
grestore
gsave
/o {
gsave
newpath
translate
0.6 setlinewidth
1 setlinejoin

0 setlinecap

-0 0 m
-2 0 l

gsave
0.000 setgray
fill
grestore
stroke
grestore
} bind def
298.613 51.6617 o
grestore
gsave
/o {
gsave
newpath
translate
0.6 setlinewidth
1 setlinejoin

0 setlinecap

-0 0 m
-2 0 l

gsave
0.000 setgray
fill
grestore
stroke
grestore
} bind def
298.613 54.0391 o
grestore
gsave
/o {
gsave
newpath
translate
0.6 setlinewidth
1 setlinejoin

0 setlinecap

-0 0 m
-2 0 l

gsave
0.000 setgray
fill
grestore
stroke
grestore
} bind def
298.613 56.1361 o
grestore
gsave
/o {
gsave
newpath
translate
0.6 setlinewidth
1 setlinejoin

0 setlinecap

-0 0 m
-2 0 l

gsave
0.000 setgray
fill
grestore
stroke
grestore
} bind def
298.613 70.3525 o
grestore
gsave
/o {
gsave
newpath
translate
0.6 setlinewidth
1 setlinejoin

0 setlinecap

-0 0 m
-2 0 l

gsave
0.000 setgray
fill
grestore
stroke
grestore
} bind def
298.613 77.5713 o
grestore
gsave
/o {
gsave
newpath
translate
0.6 setlinewidth
1 setlinejoin

0 setlinecap

-0 0 m
-2 0 l

gsave
0.000 setgray
fill
grestore
stroke
grestore
} bind def
298.613 82.6931 o
grestore
gsave
/o {
gsave
newpath
translate
0.6 setlinewidth
1 setlinejoin

0 setlinecap

-0 0 m
-2 0 l

gsave
0.000 setgray
fill
grestore
stroke
grestore
} bind def
298.613 86.6659 o
grestore
gsave
/o {
gsave
newpath
translate
0.6 setlinewidth
1 setlinejoin

0 setlinecap

-0 0 m
-2 0 l

gsave
0.000 setgray
fill
grestore
stroke
grestore
} bind def
298.613 89.9119 o
grestore
gsave
/o {
gsave
newpath
translate
0.6 setlinewidth
1 setlinejoin

0 setlinecap

-0 0 m
-2 0 l

gsave
0.000 setgray
fill
grestore
stroke
grestore
} bind def
298.613 92.6564 o
grestore
gsave
/o {
gsave
newpath
translate
0.6 setlinewidth
1 setlinejoin

0 setlinecap

-0 0 m
-2 0 l

gsave
0.000 setgray
fill
grestore
stroke
grestore
} bind def
298.613 95.0337 o
grestore
gsave
/o {
gsave
newpath
translate
0.6 setlinewidth
1 setlinejoin

0 setlinecap

-0 0 m
-2 0 l

gsave
0.000 setgray
fill
grestore
stroke
grestore
} bind def
298.613 97.1307 o
grestore
gsave
/o {
gsave
newpath
translate
0.6 setlinewidth
1 setlinejoin

0 setlinecap

-0 0 m
-2 0 l

gsave
0.000 setgray
fill
grestore
stroke
grestore
} bind def
298.613 111.347 o
grestore
gsave
/o {
gsave
newpath
translate
0.6 setlinewidth
1 setlinejoin

0 setlinecap

-0 0 m
-2 0 l

gsave
0.000 setgray
fill
grestore
stroke
grestore
} bind def
298.613 118.566 o
grestore
gsave
/o {
gsave
newpath
translate
0.6 setlinewidth
1 setlinejoin

0 setlinecap

-0 0 m
-2 0 l

gsave
0.000 setgray
fill
grestore
stroke
grestore
} bind def
298.613 123.688 o
grestore
gsave
/o {
gsave
newpath
translate
0.6 setlinewidth
1 setlinejoin

0 setlinecap

-0 0 m
-2 0 l

gsave
0.000 setgray
fill
grestore
stroke
grestore
} bind def
298.613 127.661 o
grestore
gsave
/o {
gsave
newpath
translate
0.6 setlinewidth
1 setlinejoin

0 setlinecap

-0 0 m
-2 0 l

gsave
0.000 setgray
fill
grestore
stroke
grestore
} bind def
298.613 130.907 o
grestore
gsave
/o {
gsave
newpath
translate
0.6 setlinewidth
1 setlinejoin

0 setlinecap

-0 0 m
-2 0 l

gsave
0.000 setgray
fill
grestore
stroke
grestore
} bind def
298.613 133.651 o
grestore
gsave
/o {
gsave
newpath
translate
0.6 setlinewidth
1 setlinejoin

0 setlinecap

-0 0 m
-2 0 l

gsave
0.000 setgray
fill
grestore
stroke
grestore
} bind def
298.613 136.028 o
grestore
gsave
/o {
gsave
newpath
translate
0.6 setlinewidth
1 setlinejoin

0 setlinecap

-0 0 m
-2 0 l

gsave
0.000 setgray
fill
grestore
stroke
grestore
} bind def
298.613 138.125 o
grestore
gsave
/o {
gsave
newpath
translate
0.6 setlinewidth
1 setlinejoin

0 setlinecap

-0 0 m
-2 0 l

gsave
0.000 setgray
fill
grestore
stroke
grestore
} bind def
298.613 152.342 o
grestore
gsave
/o {
gsave
newpath
translate
0.6 setlinewidth
1 setlinejoin

0 setlinecap

-0 0 m
-2 0 l

gsave
0.000 setgray
fill
grestore
stroke
grestore
} bind def
298.613 159.561 o
grestore
gsave
/o {
gsave
newpath
translate
0.6 setlinewidth
1 setlinejoin

0 setlinecap

-0 0 m
-2 0 l

gsave
0.000 setgray
fill
grestore
stroke
grestore
} bind def
298.613 164.682 o
grestore
gsave
/o {
gsave
newpath
translate
0.6 setlinewidth
1 setlinejoin

0 setlinecap

-0 0 m
-2 0 l

gsave
0.000 setgray
fill
grestore
stroke
grestore
} bind def
298.613 168.655 o
grestore
gsave
/o {
gsave
newpath
translate
0.6 setlinewidth
1 setlinejoin

0 setlinecap

-0 0 m
-2 0 l

gsave
0.000 setgray
fill
grestore
stroke
grestore
} bind def
298.613 171.901 o
grestore
gsave
/o {
gsave
newpath
translate
0.6 setlinewidth
1 setlinejoin

0 setlinecap

-0 0 m
-2 0 l

gsave
0.000 setgray
fill
grestore
stroke
grestore
} bind def
298.613 174.646 o
grestore
gsave
/o {
gsave
newpath
translate
0.6 setlinewidth
1 setlinejoin

0 setlinecap

-0 0 m
-2 0 l

gsave
0.000 setgray
fill
grestore
stroke
grestore
} bind def
298.613 177.023 o
grestore
gsave
/o {
gsave
newpath
translate
0.6 setlinewidth
1 setlinejoin

0 setlinecap

-0 0 m
-2 0 l

gsave
0.000 setgray
fill
grestore
stroke
grestore
} bind def
298.613 179.12 o
grestore
gsave
/o {
gsave
newpath
translate
0.6 setlinewidth
1 setlinejoin

0 setlinecap

-0 0 m
-2 0 l

gsave
0.000 setgray
fill
grestore
stroke
grestore
} bind def
298.613 193.336 o
grestore
gsave
/o {
gsave
newpath
translate
0.6 setlinewidth
1 setlinejoin

0 setlinecap

-0 0 m
-2 0 l

gsave
0.000 setgray
fill
grestore
stroke
grestore
} bind def
298.613 200.555 o
grestore
gsave
/o {
gsave
newpath
translate
0.6 setlinewidth
1 setlinejoin

0 setlinecap

-0 0 m
-2 0 l

gsave
0.000 setgray
fill
grestore
stroke
grestore
} bind def
298.613 205.677 o
grestore
gsave
/o {
gsave
newpath
translate
0.6 setlinewidth
1 setlinejoin

0 setlinecap

-0 0 m
-2 0 l

gsave
0.000 setgray
fill
grestore
stroke
grestore
} bind def
298.613 209.65 o
grestore
gsave
/o {
gsave
newpath
translate
0.6 setlinewidth
1 setlinejoin

0 setlinecap

-0 0 m
-2 0 l

gsave
0.000 setgray
fill
grestore
stroke
grestore
} bind def
298.613 212.896 o
grestore
gsave
/o {
gsave
newpath
translate
0.6 setlinewidth
1 setlinejoin

0 setlinecap

-0 0 m
-2 0 l

gsave
0.000 setgray
fill
grestore
stroke
grestore
} bind def
298.613 215.64 o
grestore
gsave
/o {
gsave
newpath
translate
0.6 setlinewidth
1 setlinejoin

0 setlinecap

-0 0 m
-2 0 l

gsave
0.000 setgray
fill
grestore
stroke
grestore
} bind def
298.613 218.018 o
grestore
gsave
/o {
gsave
newpath
translate
0.6 setlinewidth
1 setlinejoin

0 setlinecap

-0 0 m
-2 0 l

gsave
0.000 setgray
fill
grestore
stroke
grestore
} bind def
298.613 220.115 o
grestore
gsave
/o {
gsave
newpath
translate
0.6 setlinewidth
1 setlinejoin

0 setlinecap

-0 0 m
-2 0 l

gsave
0.000 setgray
fill
grestore
stroke
grestore
} bind def
298.613 234.331 o
grestore
gsave
/o {
gsave
newpath
translate
0.6 setlinewidth
1 setlinejoin

0 setlinecap

-0 0 m
-2 0 l

gsave
0.000 setgray
fill
grestore
stroke
grestore
} bind def
298.613 241.55 o
grestore
gsave
/o {
gsave
newpath
translate
0.6 setlinewidth
1 setlinejoin

0 setlinecap

-0 0 m
-2 0 l

gsave
0.000 setgray
fill
grestore
stroke
grestore
} bind def
298.613 246.672 o
grestore
gsave
/o {
gsave
newpath
translate
0.6 setlinewidth
1 setlinejoin

0 setlinecap

-0 0 m
-2 0 l

gsave
0.000 setgray
fill
grestore
stroke
grestore
} bind def
298.613 250.644 o
grestore
gsave
/o {
gsave
newpath
translate
0.6 setlinewidth
1 setlinejoin

0 setlinecap

-0 0 m
-2 0 l

gsave
0.000 setgray
fill
grestore
stroke
grestore
} bind def
298.613 253.89 o
grestore
gsave
/o {
gsave
newpath
translate
0.6 setlinewidth
1 setlinejoin

0 setlinecap

-0 0 m
-2 0 l

gsave
0.000 setgray
fill
grestore
stroke
grestore
} bind def
298.613 256.635 o
grestore
gsave
/o {
gsave
newpath
translate
0.6 setlinewidth
1 setlinejoin

0 setlinecap

-0 0 m
-2 0 l

gsave
0.000 setgray
fill
grestore
stroke
grestore
} bind def
298.613 259.012 o
grestore
gsave
/o {
gsave
newpath
translate
0.6 setlinewidth
1 setlinejoin

0 setlinecap

-0 0 m
-2 0 l

gsave
0.000 setgray
fill
grestore
stroke
grestore
} bind def
298.613 261.109 o
grestore
gsave
/o {
gsave
newpath
translate
0.6 setlinewidth
1 setlinejoin

0 setlinecap

-0 0 m
-2 0 l

gsave
0.000 setgray
fill
grestore
stroke
grestore
} bind def
298.613 275.326 o
grestore
gsave
/o {
gsave
newpath
translate
0.6 setlinewidth
1 setlinejoin

0 setlinecap

-0 0 m
-2 0 l

gsave
0.000 setgray
fill
grestore
stroke
grestore
} bind def
298.613 282.544 o
grestore
gsave
/o {
gsave
newpath
translate
0.6 setlinewidth
1 setlinejoin

0 setlinecap

-0 0 m
-2 0 l

gsave
0.000 setgray
fill
grestore
stroke
grestore
} bind def
298.613 287.666 o
grestore
gsave
/o {
gsave
newpath
translate
0.6 setlinewidth
1 setlinejoin

0 setlinecap

-0 0 m
-2 0 l

gsave
0.000 setgray
fill
grestore
stroke
grestore
} bind def
298.613 291.639 o
grestore
gsave
262.003125 159.421250 translate
90.000000 rotate
/STIXGeneral-Italic 12.0 selectfont
0.000000 0.703125 moveto
/e glyphshow
/STIXGeneral-Regular 8.399999999999999 selectfont
5.327988 -0.885937 moveto
/uni221E glyphshow
grestore
1.500 setlinewidth
2 setlinecap
0.122 0.467 0.706 setrgbcolor
gsave
189.946 250.818 298.613 41.013 clipbox
307.246423 276.410963 m
310.792017 278.326513 l
315.718092 276.278843 l
320.324105 279.231871 l
324.554992 278.10366 l
329.91028 276.766347 l
334.78508 277.835966 l
339.337343 277.084757 l
343.595507 280.429205 l
348.518367 279.552781 l
353.140192 278.19369 l
357.48503 278.709607 l
362.290518 279.469332 l
367.492703 278.800173 l
371.665502 279.005626 l
376.799362 279.459168 l
380.977425 279.147993 l
386.028411 279.001444 l
390.693006 277.192212 l
395.019368 277.611868 l
399.998986 276.731288 l
404.61149 275.813542 l
409.281475 277.053644 l
413.99903 275.638658 l
418.720319 275.299777 l
423.432196 273.977324 l
428.106534 273.524476 l
432.722194 272.204198 l
437.528976 272.285423 l
442.228334 270.248129 l
447.038203 269.787486 l
451.719592 268.679867 l
456.260932 267.599519 l
461.02397 266.646128 l
465.775171 265.289303 l
470.495153 265.425246 l
475.181505 264.290429 l
479.924892 263.6903 l
stroke
grestore
1.000 setlinewidth
0 setlinecap
gsave
189.946 250.818 298.613 41.013 clipbox
/o {
gsave
newpath
translate
1.0 setlinewidth
1 setlinejoin

0 setlinecap

0 -1.5 m
0.397805 -1.5 0.77937 -1.341951 1.06066 -1.06066 c
1.341951 -0.77937 1.5 -0.397805 1.5 0 c
1.5 0.397805 1.341951 0.77937 1.06066 1.06066 c
0.77937 1.341951 0.397805 1.5 0 1.5 c
-0.397805 1.5 -0.77937 1.341951 -1.06066 1.06066 c
-1.341951 0.77937 -1.5 0.397805 -1.5 0 c
-1.5 -0.397805 -1.341951 -0.77937 -1.06066 -1.06066 c
-0.77937 -1.341951 -0.397805 -1.5 0 -1.5 c
cl

gsave
0.122 0.467 0.706 setrgbcolor
fill
grestore
stroke
grestore
} bind def
307.246 276.411 o
310.792 278.327 o
315.718 276.279 o
320.324 279.232 o
324.555 278.104 o
329.91 276.766 o
334.785 277.836 o
339.337 277.085 o
343.596 280.429 o
348.518 279.553 o
353.14 278.194 o
357.485 278.71 o
362.291 279.469 o
367.493 278.8 o
371.666 279.006 o
376.799 279.459 o
380.977 279.148 o
386.028 279.001 o
390.693 277.192 o
395.019 277.612 o
399.999 276.731 o
404.611 275.814 o
409.281 277.054 o
413.999 275.639 o
418.72 275.3 o
423.432 273.977 o
428.107 273.524 o
432.722 272.204 o
437.529 272.285 o
442.228 270.248 o
447.038 269.787 o
451.72 268.68 o
456.261 267.6 o
461.024 266.646 o
465.775 265.289 o
470.495 265.425 o
475.182 264.29 o
479.925 263.69 o
grestore
1.500 setlinewidth
2 setlinecap
1.000 0.498 0.055 setrgbcolor
gsave
189.946 250.818 298.613 41.013 clipbox
307.28852 252.334648 m
310.778937 252.100824 l
315.765523 250.513332 l
320.335489 251.784598 l
324.591634 254.121895 l
329.866626 252.547532 l
334.761073 253.325603 l
339.341274 254.929964 l
343.58436 254.290572 l
348.561228 254.575875 l
353.188062 252.770714 l
357.463368 251.61626 l
362.286781 251.9912 l
367.513591 248.783059 l
371.659225 246.588433 l
376.794958 245.425764 l
380.997377 241.947774 l
386.025166 240.7601 l
390.698942 238.071218 l
395.058141 234.494198 l
400.014573 233.233163 l
404.599504 230.305749 l
409.286206 226.207746 l
413.989863 223.142761 l
418.730995 220.5344 l
423.423916 216.809263 l
428.096012 213.883493 l
432.731959 211.259558 l
437.532299 207.435548 l
442.235371 204.909085 l
447.04125 200.578885 l
451.717413 198.535806 l
456.257936 194.858197 l
461.02123 190.067252 l
465.772304 187.467479 l
470.499962 184.51029 l
475.17713 181.393124 l
479.92331 177.900618 l
stroke
grestore
1.000 setlinewidth
2 setlinejoin
0 setlinecap
gsave
189.946 250.818 298.613 41.013 clipbox
/o {
gsave
newpath
translate
1.0 setlinewidth
2 setlinejoin

0 setlinecap

0 3 m
-0.673542 0.927051 l
-2.85317 0.927051 l
-1.089814 -0.354102 l
-1.763356 -2.427051 l
-0 -1.145898 l
1.763356 -2.427051 l
1.089814 -0.354102 l
2.85317 0.927051 l
0.673542 0.927051 l
cl

gsave
1.000 0.498 0.055 setrgbcolor
fill
grestore
stroke
grestore
} bind def
307.289 252.335 o
310.779 252.101 o
315.766 250.513 o
320.335 251.785 o
324.592 254.122 o
329.867 252.548 o
334.761 253.326 o
339.341 254.93 o
343.584 254.291 o
348.561 254.576 o
353.188 252.771 o
357.463 251.616 o
362.287 251.991 o
367.514 248.783 o
371.659 246.588 o
376.795 245.426 o
380.997 241.948 o
386.025 240.76 o
390.699 238.071 o
395.058 234.494 o
400.015 233.233 o
404.6 230.306 o
409.286 226.208 o
413.99 223.143 o
418.731 220.534 o
423.424 216.809 o
428.096 213.883 o
432.732 211.26 o
437.532 207.436 o
442.235 204.909 o
447.041 200.579 o
451.717 198.536 o
456.258 194.858 o
461.021 190.067 o
465.772 187.467 o
470.5 184.51 o
475.177 181.393 o
479.923 177.901 o
grestore
1.500 setlinewidth
1 setlinejoin
2 setlinecap
0.173 0.627 0.173 setrgbcolor
gsave
189.946 250.818 298.613 41.013 clipbox
307.282047 232.873058 m
310.781844 232.053471 l
315.699975 232.215995 l
320.270928 233.143483 l
324.521169 235.333095 l
329.894523 232.863314 l
334.738791 235.891454 l
339.331294 235.638807 l
343.610363 235.409106 l
348.573529 236.361668 l
353.165125 232.857321 l
357.465795 233.94305 l
362.280054 229.957001 l
367.499073 227.36072 l
371.63803 226.055771 l
376.807595 221.79026 l
380.980119 218.564102 l
386.020838 213.060393 l
390.702566 209.31763 l
395.046716 205.032238 l
400.000865 200.076092 l
404.612998 195.715182 l
409.284335 189.751761 l
413.996036 183.967991 l
418.733717 179.406246 l
423.431967 174.130423 l
428.101502 168.756781 l
432.730051 163.454231 l
437.534272 157.146725 l
442.234819 150.99876 l
447.041239 144.22057 l
451.712951 139.821168 l
456.263303 134.216663 l
461.023278 127.802147 l
465.777041 123.187627 l
470.499536 117.650179 l
475.178671 111.793592 l
479.924307 107.878817 l
stroke
grestore
1.000 setlinewidth
0 setlinecap
gsave
189.946 250.818 298.613 41.013 clipbox
/o {
gsave
newpath
translate
1.0 setlinewidth
1 setlinejoin

0 setlinecap

-2 -2 m
2 2 l
-2 2 m
2 -2 l

gsave
0.173 0.627 0.173 setrgbcolor
fill
grestore
stroke
grestore
} bind def
307.282 232.873 o
310.782 232.053 o
315.7 232.216 o
320.271 233.143 o
324.521 235.333 o
329.895 232.863 o
334.739 235.891 o
339.331 235.639 o
343.61 235.409 o
348.574 236.362 o
353.165 232.857 o
357.466 233.943 o
362.28 229.957 o
367.499 227.361 o
371.638 226.056 o
376.808 221.79 o
380.98 218.564 o
386.021 213.06 o
390.703 209.318 o
395.047 205.032 o
400.001 200.076 o
404.613 195.715 o
409.284 189.752 o
413.996 183.968 o
418.734 179.406 o
423.432 174.13 o
428.102 168.757 o
432.73 163.454 o
437.534 157.147 o
442.235 150.999 o
447.041 144.221 o
451.713 139.821 o
456.263 134.217 o
461.023 127.802 o
465.777 123.188 o
470.5 117.65 o
475.179 111.794 o
479.924 107.879 o
grestore
1.500 setlinewidth
2 setlinecap
0.839 0.153 0.157 setrgbcolor
gsave
189.946 250.818 298.613 41.013 clipbox
307.273145 245.70474 m
310.787658 231.967474 l
315.728083 220.206183 l
320.313802 220.972232 l
324.592109 222.021026 l
329.859749 223.545859 l
334.770469 221.866026 l
339.328269 222.664201 l
343.605058 221.914148 l
348.566924 221.471954 l
353.167499 219.787532 l
357.491265 218.332923 l
362.291116 216.253842 l
367.499583 214.602825 l
371.635113 210.48072 l
376.789499 206.749928 l
381.004951 202.354838 l
386.028844 195.540069 l
390.671752 190.955685 l
395.043873 184.517825 l
400.007908 178.668025 l
404.604152 172.299082 l
409.280097 164.626864 l
414.000833 156.966324 l
418.722354 150.304236 l
423.428262 141.577644 l
428.109189 135.729922 l
432.728057 126.727335 l
437.529689 118.717789 l
442.233445 110.880162 l
447.044606 102.133299 l
451.718699 94.946445 l
456.261417 86.315379 l
461.018287 77.760744 l
465.770072 71.220159 l
470.494139 62.114729 l
475.177126 58.775348 l
479.923879 52.413295 l
stroke
grestore
1.000 setlinewidth
0 setlinejoin
0 setlinecap
gsave
189.946 250.818 298.613 41.013 clipbox
/o {
gsave
newpath
translate
1.0 setlinewidth
0 setlinejoin

0 setlinecap

2 -0 m
-2 2 l
-2 -2 l
cl

gsave
0.839 0.153 0.157 setrgbcolor
fill
grestore
stroke
grestore
} bind def
307.273 245.705 o
310.788 231.967 o
315.728 220.206 o
320.314 220.972 o
324.592 222.021 o
329.86 223.546 o
334.77 221.866 o
339.328 222.664 o
343.605 221.914 o
348.567 221.472 o
353.167 219.788 o
357.491 218.333 o
362.291 216.254 o
367.5 214.603 o
371.635 210.481 o
376.789 206.75 o
381.005 202.355 o
386.029 195.54 o
390.672 190.956 o
395.044 184.518 o
400.008 178.668 o
404.604 172.299 o
409.28 164.627 o
414.001 156.966 o
418.722 150.304 o
423.428 141.578 o
428.109 135.73 o
432.728 126.727 o
437.53 118.718 o
442.233 110.88 o
447.045 102.133 o
451.719 94.9464 o
456.261 86.3154 o
461.018 77.7607 o
465.77 71.2202 o
470.494 62.1147 o
475.177 58.7753 o
479.924 52.4133 o
grestore
0.800 setlinewidth
2 setlinecap
0.000 setgray
gsave
298.6125 41.0125 m
298.6125 291.83 l
stroke
grestore
gsave
488.558816 41.0125 m
488.558816 291.83 l
stroke
grestore
gsave
298.6125 41.0125 m
488.558816 41.0125 l
stroke
grestore
gsave
298.6125 291.83 m
488.558816 291.83 l
stroke
grestore
gsave

378.249720 297.830000 translate
0.000000 rotate
0.000000 0 m /I glyphshow
3.995987 0 m /M glyphshow
14.663971 0 m /E glyphshow
21.995956 0 m /X glyphshow
grestore
1.000 setlinewidth
0 setlinecap
0.800 setgray
gsave
305.6125 46.0125 m
359.6125 46.0125 l
360.945833 46.0125 361.6125 46.679167 361.6125 48.0125 c
361.6125 103.7 l
361.6125 105.033333 360.945833 105.7 359.6125 105.7 c
305.6125 105.7 l
304.279167 105.7 303.6125 105.033333 303.6125 103.7 c
303.6125 48.0125 l
303.6125 46.679167 304.279167 46.0125 305.6125 46.0125 c
cl
gsave
1.000 setgray
fill
grestore
stroke
grestore
1.500 setlinewidth
1 setlinejoin
2 setlinecap
0.122 0.467 0.706 setrgbcolor
gsave
307.6125 98.2 m
317.6125 98.2 l
327.6125 98.2 l
stroke
grestore
1.000 setlinewidth
0 setlinecap
gsave
/o {
gsave
newpath
translate
1.0 setlinewidth
1 setlinejoin

0 setlinecap

0 -1.5 m
0.397805 -1.5 0.77937 -1.341951 1.06066 -1.06066 c
1.341951 -0.77937 1.5 -0.397805 1.5 0 c
1.5 0.397805 1.341951 0.77937 1.06066 1.06066 c
0.77937 1.341951 0.397805 1.5 0 1.5 c
-0.397805 1.5 -0.77937 1.341951 -1.06066 1.06066 c
-1.341951 0.77937 -1.5 0.397805 -1.5 0 c
-1.5 -0.397805 -1.341951 -0.77937 -1.06066 -1.06066 c
-0.77937 -1.341951 -0.397805 -1.5 0 -1.5 c
cl

gsave
0.122 0.467 0.706 setrgbcolor
fill
grestore
stroke
grestore
} bind def
317.613 98.2 o
grestore
0.000 setgray
gsave
335.612500 94.700000 translate
0.000000 rotate
/STIXGeneral-Italic 10.0 selectfont
0.000000 0.234375 moveto
/m glyphshow
/STIXGeneral-Regular 10.0 selectfont
8.663983 0.234375 moveto
/equal glyphshow
16.957971 0.234375 moveto
/two glyphshow
grestore
1.500 setlinewidth
2 setlinecap
1.000 0.498 0.055 setrgbcolor
gsave
307.6125 84.028125 m
317.6125 84.028125 l
327.6125 84.028125 l
stroke
grestore
1.000 setlinewidth
2 setlinejoin
0 setlinecap
gsave
/o {
gsave
newpath
translate
1.0 setlinewidth
2 setlinejoin

0 setlinecap

0 3 m
-0.673542 0.927051 l
-2.85317 0.927051 l
-1.089814 -0.354102 l
-1.763356 -2.427051 l
-0 -1.145898 l
1.763356 -2.427051 l
1.089814 -0.354102 l
2.85317 0.927051 l
0.673542 0.927051 l
cl

gsave
1.000 0.498 0.055 setrgbcolor
fill
grestore
stroke
grestore
} bind def
317.613 84.0281 o
grestore
0.000 setgray
gsave
335.612500 80.528125 translate
0.000000 rotate
/STIXGeneral-Italic 10.0 selectfont
0.000000 0.234375 moveto
/m glyphshow
/STIXGeneral-Regular 10.0 selectfont
8.663983 0.234375 moveto
/equal glyphshow
16.957971 0.234375 moveto
/four glyphshow
grestore
1.500 setlinewidth
1 setlinejoin
2 setlinecap
0.173 0.627 0.173 setrgbcolor
gsave
307.6125 69.85625 m
317.6125 69.85625 l
327.6125 69.85625 l
stroke
grestore
1.000 setlinewidth
0 setlinecap
gsave
/o {
gsave
newpath
translate
1.0 setlinewidth
1 setlinejoin

0 setlinecap

-2 -2 m
2 2 l
-2 2 m
2 -2 l

gsave
0.173 0.627 0.173 setrgbcolor
fill
grestore
stroke
grestore
} bind def
317.613 69.8563 o
grestore
0.000 setgray
gsave
335.612500 66.356250 translate
0.000000 rotate
/STIXGeneral-Italic 10.0 selectfont
0.000000 0.156250 moveto
/m glyphshow
/STIXGeneral-Regular 10.0 selectfont
8.663983 0.156250 moveto
/equal glyphshow
16.957971 0.156250 moveto
/six glyphshow
grestore
1.500 setlinewidth
2 setlinecap
0.839 0.153 0.157 setrgbcolor
gsave
307.6125 55.684375 m
317.6125 55.684375 l
327.6125 55.684375 l
stroke
grestore
1.000 setlinewidth
0 setlinejoin
0 setlinecap
gsave
/o {
gsave
newpath
translate
1.0 setlinewidth
0 setlinejoin

0 setlinecap

2 -0 m
-2 2 l
-2 -2 l
cl

gsave
0.839 0.153 0.157 setrgbcolor
fill
grestore
stroke
grestore
} bind def
317.613 55.6844 o
grestore
0.000 setgray
gsave
335.612500 52.184375 translate
0.000000 rotate
/STIXGeneral-Italic 10.0 selectfont
0.000000 0.234375 moveto
/m glyphshow
/STIXGeneral-Regular 10.0 selectfont
8.663983 0.234375 moveto
/equal glyphshow
16.957971 0.234375 moveto
/eight glyphshow
grestore

end
showpage
