%!PS-Adobe-3.0 EPSF-3.0
%%Title: boussinesq_convergence.eps
%%Creator: Matplotlib v3.5.3, https://matplotlib.org/
%%CreationDate: Thu May  4 14:52:45 2023
%%Orientation: portrait
%%BoundingBox: 27 274 585 518
%%HiResBoundingBox: 27.958482 274.187500 584.041518 517.812500
%%EndComments
%%BeginProlog
/mpldict 12 dict def
mpldict begin
/_d { bind def } bind def
/m { moveto } _d
/l { lineto } _d
/r { rlineto } _d
/c { curveto } _d
/cl { closepath } _d
/ce { closepath eofill } _d
/box {
      m
      1 index 0 r
      0 exch r
      neg 0 r
      cl
    } _d
/clipbox {
      box
      clip
      newpath
    } _d
/sc { setcachedevice } _d
%!PS-Adobe-3.0 Resource-Font
%%Creator: Converted from TrueType to Type 3 by Matplotlib.
10 dict begin
/FontName /STIXGeneral-Regular def
/PaintType 0 def
/FontMatrix [0.001 0 0 0.001 0 0] def
/FontBBox [-970 -443 2000 1023] def
/FontType 3 def
/Encoding [/minus /uni221E /space /zero /one /two /three /four /five /six /seven /eight /nine /a /e /i /m /n /o /r /t] def
/CharStrings 22 dict dup begin
/.notdef 0 def
/minus{685 0 64 220 621 286 sc
621 220 m
64 220 l
64 286 l
621 286 l
621 220 l

ce} _d
/uni221E{926 0 70 0 854 430 sc
854 222 m
854 168 836 117 799 70 c
762 23 715 0 656 0 c
617 0 582 12 551 35 c
520 59 488 96 455 145 c
407 48 337 0 246 0 c
199 0 157 17 122 51 c
87 86 70 135 70 200 c
70 235 75 266 84 294 c
94 322 106 344 120 360 c
135 377 151 390 169 401 c
187 412 203 420 218 424 c
233 428 248 430 261 430 c
301 430 336 420 366 401 c
397 382 434 343 479 283 c
506 332 534 369 561 393 c
589 418 626 430 672 430 c
721 430 763 411 799 373 c
836 336 854 285 854 222 c

499 245 m
499 242 l
538 179 572 132 601 103 c
630 74 661 59 694 59 c
722 59 746 71 765 94 c
784 118 794 146 794 178 c
794 225 781 265 756 297 c
731 330 698 346 655 346 c
634 346 615 343 598 337 c
581 332 566 323 553 310 c
540 297 530 287 524 280 c
518 273 510 261 499 245 c

433 181 m
433 184 l
395 247 360 293 327 324 c
295 355 263 371 230 371 c
202 371 178 359 159 335 c
140 312 130 284 130 252 c
130 207 143 167 168 134 c
193 101 227 84 269 84 c
290 84 309 87 327 93 c
345 99 361 108 375 119 c
389 131 400 141 407 149 c
415 158 424 168 433 181 c

ce} _d
/space{250 0 0 0 0 0 sc
ce} _d
/zero{500 0 24 -14 476 676 sc
476 330 m
476 285 472 243 463 203 c
454 164 441 127 424 94 c
407 61 384 34 354 15 c
324 -4 289 -14 250 -14 c
209 -14 174 -4 143 17 c
112 38 89 65 72 100 c
55 135 43 172 35 211 c
28 250 24 292 24 336 c
24 398 32 454 47 503 c
62 553 88 594 123 627 c
159 660 203 676 254 676 c
319 676 373 644 414 580 c
455 516 476 433 476 330 c

380 325 m
380 430 369 511 346 566 c
324 622 291 650 248 650 c
207 650 175 622 153 566 c
131 510 120 431 120 329 c
120 226 131 148 153 93 c
175 39 207 12 250 12 c
292 12 324 39 346 93 c
369 148 380 225 380 325 c

ce} _d
/one{500 0 111 0 394 676 sc
394 0 m
118 0 l
118 15 l
155 17 180 24 193 35 c
206 47 213 67 213 95 c
213 544 l
213 577 203 593 183 593 c
174 593 159 589 138 581 c
111 571 l
111 585 l
290 676 l
299 673 l
299 76 l
299 54 306 38 319 29 c
332 20 357 15 394 15 c
394 0 l

ce} _d
/two{500 0 29 0 474 676 sc
474 137 m
420 0 l
29 0 l
29 12 l
207 201 l
254 250 287 294 307 335 c
327 376 337 418 337 461 c
337 506 325 540 300 565 c
275 590 241 602 198 602 c
162 602 133 593 112 574 c
91 555 71 521 51 472 c
30 477 l
41 539 64 588 98 623 c
133 658 179 676 238 676 c
293 676 338 659 372 626 c
406 593 423 551 423 500 c
423 425 380 342 295 252 c
130 76 l
364 76 l
386 76 403 80 416 89 c
429 98 444 116 460 143 c
474 137 l

ce} _d
/three{500 0 41 -14 431 676 sc
61 510 m
45 514 l
60 564 84 603 117 632 c
150 661 191 676 241 676 c
288 676 325 663 354 638 c
383 613 397 580 397 539 c
397 484 366 438 304 401 c
341 385 368 367 387 348 c
416 315 431 272 431 219 c
431 166 416 119 385 79 c
362 48 330 25 287 9 c
245 -6 200 -14 153 -14 c
78 -14 41 5 41 43 c
41 54 45 62 53 69 c
61 76 71 79 82 79 c
99 79 119 70 143 53 c
172 32 201 22 229 22 c
266 22 296 37 321 66 c
346 96 359 132 359 175 c
359 252 324 300 255 320 c
234 327 200 330 153 330 c
153 344 l
190 357 218 369 237 380 c
291 411 318 455 318 514 c
318 547 308 573 289 590 c
270 607 244 616 210 616 c
150 616 100 581 61 510 c

ce} _d
/four{500 0 12 0 473 676 sc
473 167 m
370 167 l
370 0 l
292 0 l
292 167 l
12 167 l
12 231 l
326 676 l
370 676 l
370 231 l
473 231 l
473 167 l

292 231 m
292 574 l
52 231 l
292 231 l

ce} _d
/five{500 0 31 -14 438 688 sc
438 681 m
402 596 l
398 587 389 583 375 583 c
181 583 l
141 498 l
214 484 267 469 300 452 c
333 436 363 409 391 370 c
414 338 426 296 426 243 c
426 195 418 155 402 122 c
387 89 362 60 328 35 c
283 2 226 -14 158 -14 c
120 -14 89 -8 66 3 c
43 14 31 29 31 48 c
31 73 46 86 76 86 c
100 86 125 76 150 55 c
176 34 200 23 221 23 c
256 23 287 40 314 75 c
342 110 356 149 356 192 c
356 256 334 306 289 342 c
231 389 160 412 76 412 c
68 412 64 415 64 420 c
65 425 l
174 662 l
381 662 l
392 662 401 664 407 667 c
414 670 421 677 429 688 c
438 681 l

ce} _d
/six{500 0 34 -14 468 684 sc
446 684 m
448 668 l
369 655 304 623 251 572 c
198 521 165 458 152 383 c
191 413 233 428 279 428 c
338 428 384 409 417 372 c
451 335 468 284 468 219 c
468 154 451 100 417 59 c
378 10 325 -14 258 -14 c
177 -14 118 20 81 87 c
50 144 34 208 34 279 c
34 388 70 480 143 555 c
184 598 227 628 270 645 c
314 663 373 676 446 684 c

378 188 m
378 317 333 382 243 382 c
210 382 182 373 160 355 c
138 338 127 308 127 266 c
127 188 139 126 163 81 c
188 36 223 14 269 14 c
304 14 331 30 350 61 c
369 93 378 135 378 188 c

ce} _d
/seven{500 0 20 -8 449 662 sc
449 646 m
237 -8 l
172 -8 l
370 588 l
155 588 l
126 588 105 583 91 573 c
77 563 59 541 38 506 c
20 515 l
80 662 l
449 662 l
449 646 l

ce} _d
/eight{500 0 56 -14 445 676 sc
445 155 m
445 104 427 63 391 32 c
356 1 308 -14 248 -14 c
192 -14 146 1 110 32 c
74 63 56 102 56 149 c
56 184 65 214 82 239 c
99 264 134 295 186 332 c
136 373 103 407 86 432 c
70 457 62 487 62 520 c
62 567 80 605 116 633 c
153 662 199 676 256 676 c
305 676 345 662 376 634 c
408 607 424 573 424 533 c
424 496 414 467 395 445 c
376 423 341 398 290 371 c
350 331 391 295 412 264 c
434 233 445 196 445 155 c

355 533 m
355 568 345 595 326 616 c
307 637 280 648 246 648 c
212 648 185 639 165 621 c
146 604 136 580 136 549 c
136 518 146 490 165 465 c
185 440 217 415 261 389 c
295 409 319 430 333 452 c
348 475 355 502 355 533 c

271 272 m
212 312 l
183 288 162 264 150 241 c
138 218 132 191 132 158 c
132 113 143 77 166 52 c
189 27 220 14 259 14 c
292 14 318 24 338 44 c
359 65 369 91 369 124 c
369 154 361 180 346 203 c
331 226 306 249 271 272 c

ce} _d
/nine{500 0 30 -22 459 676 sc
59 -22 m
56 -2 l
133 11 197 44 250 95 c
303 146 340 213 360 294 c
321 256 271 237 210 237 c
156 237 112 256 79 293 c
46 330 30 379 30 440 c
30 507 50 563 89 608 c
129 653 179 676 238 676 c
301 676 354 651 395 600 c
438 547 459 478 459 394 c
459 335 449 280 428 228 c
408 177 378 133 339 97 c
298 60 257 33 218 16 c
179 0 126 -13 59 -22 c

362 355 m
362 394 l
362 563 318 648 230 648 c
199 648 174 637 157 614 c
147 601 139 581 132 554 c
125 527 122 501 122 474 c
122 415 133 367 155 332 c
178 297 208 280 245 280 c
272 280 298 286 323 299 c
349 312 362 331 362 355 c

ce} _d
/a{444 0 37 -10 442 460 sc
442 66 m
442 38 l
417 6 387 -10 352 -10 c
314 -10 293 14 288 63 c
287 63 l
244 14 196 -10 142 -10 c
111 -10 85 -1 66 17 c
47 36 37 61 37 94 c
37 141 60 180 107 211 c
139 232 199 259 287 292 c
287 346 l
287 376 280 398 265 413 c
251 428 232 436 209 436 c
189 436 172 431 159 421 c
146 412 139 400 139 387 c
139 381 140 374 142 367 c
144 360 145 352 145 345 c
145 335 140 326 131 317 c
122 308 112 304 99 304 c
88 304 78 308 69 317 c
60 326 56 337 56 350 c
56 382 73 409 107 430 c
138 450 177 460 222 460 c
276 460 315 445 340 415 c
352 401 360 387 363 372 c
366 358 368 335 368 304 c
368 113 l
368 69 378 47 399 47 c
412 47 427 53 442 66 c

287 127 m
287 268 l
226 247 183 225 159 202 c
136 181 125 156 125 125 c
125 100 131 80 144 67 c
157 54 173 48 194 48 c
216 48 235 53 252 64 c
266 74 275 83 280 92 c
285 101 287 112 287 127 c

ce} _d
/e{444 0 25 -10 424 460 sc
408 164 m
424 157 l
384 46 314 -10 215 -10 c
156 -10 110 10 76 51 c
42 92 25 148 25 217 c
25 288 44 347 82 392 c
120 437 170 460 232 460 c
292 460 338 437 371 391 c
390 364 402 326 405 277 c
97 277 l
100 235 104 203 109 181 c
115 159 126 137 143 114 c
171 77 208 59 254 59 c
287 59 314 67 336 83 c
359 99 383 126 408 164 c

99 309 m
303 309 l
297 351 287 381 273 398 c
260 415 237 424 205 424 c
177 424 154 414 135 394 c
116 375 104 346 99 309 c

ce} _d
/i{278 0 16 0 253 683 sc
180 632 m
180 617 175 605 165 595 c
155 586 143 581 128 581 c
114 581 102 586 92 595 c
83 605 78 617 78 632 c
78 646 83 658 93 668 c
103 678 115 683 129 683 c
144 683 156 678 165 668 c
175 658 180 646 180 632 c

253 0 m
16 0 l
16 15 l
51 17 72 23 81 33 c
90 43 95 67 95 104 c
95 331 l
95 354 93 371 88 380 c
83 389 75 394 62 394 c
46 394 32 392 20 389 c
20 405 l
175 460 l
179 456 l
179 105 l
179 68 183 44 191 34 c
200 24 220 18 253 15 c
253 0 l

ce} _d
/m{778 0 16 0 775 460 sc
775 0 m
557 0 l
557 15 l
585 18 603 23 610 32 c
618 41 622 61 622 90 c
622 296 l
622 336 616 365 604 382 c
593 399 573 408 545 408 c
522 408 502 403 485 394 c
469 385 453 369 438 347 c
438 95 l
438 63 443 42 452 31 c
462 21 481 16 510 15 c
510 0 l
286 0 l
286 15 l
315 17 334 22 342 29 c
350 37 354 56 354 86 c
354 297 l
354 371 332 408 289 408 c
270 408 250 404 229 395 c
208 387 193 377 183 365 c
174 355 170 349 170 348 c
170 70 l
170 49 175 34 184 27 c
193 20 211 16 238 15 c
238 0 l
16 0 l
16 15 l
44 16 63 21 72 30 c
81 40 86 59 86 88 c
86 336 l
86 361 83 378 78 387 c
73 397 64 402 51 402 c
41 402 30 401 19 398 c
19 415 l
64 428 111 443 158 460 c
166 457 l
166 383 l
168 383 l
198 414 224 435 247 445 c
270 455 295 460 321 460 c
374 460 409 432 427 376 c
479 432 533 460 590 460 c
667 460 706 400 706 280 c
706 77 l
706 55 709 40 716 31 c
723 23 734 18 749 17 c
775 15 l
775 0 l

ce} _d
/n{500 0 16 0 485 460 sc
485 0 m
277 0 l
278 15 l
303 17 319 24 327 36 c
336 49 340 72 340 105 c
340 304 l
340 371 316 405 267 405 c
250 405 235 401 220 393 c
205 385 187 370 164 348 c
164 72 l
164 52 168 38 177 30 c
186 22 204 17 229 15 c
229 0 l
18 0 l
18 15 l
43 17 60 23 68 33 c
76 44 80 64 80 94 c
80 337 l
80 362 78 379 73 388 c
68 397 59 402 45 402 c
32 402 22 401 16 398 c
16 415 l
63 428 108 443 153 460 c
161 457 l
161 379 l
162 379 l
209 433 257 460 306 460 c
344 460 373 447 393 420 c
414 393 424 355 424 306 c
424 85 l
424 58 428 41 436 32 c
444 23 460 18 485 15 c
485 0 l

ce} _d
/o{500 0 29 -10 470 460 sc
470 231 m
470 161 449 103 407 58 c
366 13 312 -10 245 -10 c
184 -10 132 12 91 57 c
50 102 29 159 29 228 c
29 297 50 353 91 396 c
132 439 187 460 254 460 c
316 460 367 439 408 396 c
449 354 470 299 470 231 c

380 204 m
380 280 363 339 330 382 c
303 415 272 432 235 432 c
200 432 172 418 151 389 c
130 361 119 322 119 273 c
119 188 137 119 172 68 c
195 35 225 18 262 18 c
299 18 327 34 348 67 c
369 100 380 146 380 204 c

ce} _d
/r{333 0 5 0 335 460 sc
160 458 m
160 366 l
185 402 206 427 223 440 c
240 453 259 460 280 460 c
297 460 311 455 320 446 c
330 437 335 424 335 407 c
335 393 331 382 324 374 c
317 366 308 362 296 362 c
283 362 270 369 256 382 c
245 392 237 397 230 397 c
216 397 201 387 184 368 c
168 349 160 331 160 315 c
160 90 l
160 61 166 42 177 32 c
188 22 211 16 245 15 c
245 0 l
5 0 l
5 15 l
37 21 57 28 64 35 c
72 42 76 59 76 84 c
76 334 l
76 356 73 371 68 380 c
63 389 55 394 42 394 c
31 394 20 393 7 390 c
7 406 l
49 419 98 437 155 460 c
160 458 l

ce} _d
/t{278 0 13 -10 279 579 sc
266 77 m
279 66 l
247 15 207 -10 158 -10 c
99 -10 70 32 70 117 c
70 418 l
17 418 l
14 420 13 422 13 425 c
13 430 19 437 30 444 c
55 459 88 494 127 551 c
128 553 131 557 136 563 c
141 570 145 575 147 579 c
152 579 154 575 154 566 c
154 450 l
255 450 l
255 418 l
154 418 l
154 132 l
154 100 158 77 166 63 c
174 49 187 42 206 42 c
226 42 246 54 266 77 c

ce} _d
end readonly def

/BuildGlyph {
 exch begin
 CharStrings exch
 2 copy known not {pop /.notdef} if
 true 3 1 roll get exec
 end
} _d

/BuildChar {
 1 index /Encoding get exch get
 1 index /BuildGlyph get exec
} _d

FontName currentdict end definefont pop
%!PS-Adobe-3.0 Resource-Font
%%Creator: Converted from TrueType to Type 3 by Matplotlib.
10 dict begin
/FontName /STIXGeneral-Italic def
/PaintType 0 def
/FontMatrix [0.001 0 0 0.001 0 0] def
/FontBBox [-970 -305 1429 1023] def
/FontType 3 def
/Encoding [/uni2113 /N] def
/CharStrings 3 dict dup begin
/.notdef 0 def
/uni2113{579 0 48 -11 571 687 sc
77 389 m
91 415 l
115 398 146 390 185 390 c
242 473 300 544 359 601 c
419 658 468 687 507 687 c
550 687 571 665 571 620 c
571 566 539 512 474 459 c
410 406 335 373 249 360 c
154 206 106 107 106 62 c
106 33 118 19 142 19 c
164 19 189 32 218 57 c
247 82 288 125 341 186 c
362 169 l
305 103 261 56 228 29 c
196 2 165 -11 135 -11 c
110 -11 90 -4 73 11 c
56 26 48 48 48 76 c
48 132 74 205 125 294 c
133 309 146 331 165 360 c
132 361 103 371 77 389 c

268 396 m
269 395 l
347 412 412 443 463 486 c
515 530 541 576 541 624 c
541 645 529 655 506 655 c
481 655 454 639 424 608 c
385 569 333 498 268 396 c

ce} _d
/N{667 0 -20 -15 727 653 sc
727 653 m
727 637 l
709 633 696 630 689 627 c
682 625 675 618 666 606 c
658 595 652 582 647 568 c
643 554 636 529 625 492 c
479 -15 l
461 -15 l
231 535 l
117 113 l
111 92 108 74 108 59 c
108 45 113 35 123 28 c
134 22 152 18 178 16 c
178 0 l
-20 0 l
-20 16 l
9 20 29 30 41 47 c
53 64 68 105 86 168 c
203 583 l
188 619 159 637 117 637 c
117 653 l
277 653 l
484 154 l
590 542 l
595 561 598 575 598 586 c
598 604 593 616 584 623 c
575 630 557 634 529 637 c
529 653 l
727 653 l

ce} _d
end readonly def

/BuildGlyph {
 exch begin
 CharStrings exch
 2 copy known not {pop /.notdef} if
 true 3 1 roll get exec
 end
} _d

/BuildChar {
 1 index /Encoding get exch get
 1 index /BuildGlyph get exec
} _d

FontName currentdict end definefont pop
end
%%EndProlog
mpldict begin
27.958 274.188 translate
556.083 243.625 0 0 clipbox
gsave
0 0 m
556.083037 0 l
556.083037 243.625 l
0 243.625 l
cl
1.000 setgray
fill
grestore
gsave
53.79375 41.60625 m
420.827912 41.60625 l
420.827912 236.425 l
53.79375 236.425 l
cl
1.000 setgray
fill
grestore
0.800 setlinewidth
1 setlinejoin
2 setlinecap
[] 0 setdash
0.690 setgray
gsave
367.034 194.819 53.794 41.606 clipbox
70.477121 41.60625 m
70.477121 236.425 l
stroke
grestore
0 setlinecap
0.000 setgray
gsave
/o {
gsave
newpath
translate
0.8 setlinewidth
1 setlinejoin

0 setlinecap

0 0 m
0 -3.5 l

gsave
0.000 setgray
fill
grestore
stroke
grestore
} bind def
70.4771 41.6063 o
grestore
gsave
67.477121 26.403125 translate
0.000000 rotate
/STIXGeneral-Regular 12.0 selectfont
0.000000 0.890625 moveto
/zero glyphshow
grestore
2 setlinecap
0.690 setgray
gsave
367.034 194.819 53.794 41.606 clipbox
88.038564 41.60625 m
88.038564 236.425 l
stroke
grestore
0 setlinecap
0.000 setgray
gsave
/o {
gsave
newpath
translate
0.8 setlinewidth
1 setlinejoin

0 setlinecap

0 0 m
0 -3.5 l

gsave
0.000 setgray
fill
grestore
stroke
grestore
} bind def
88.0386 41.6063 o
grestore
gsave
85.038564 26.403125 translate
0.000000 rotate
/STIXGeneral-Regular 12.0 selectfont
0.000000 0.890625 moveto
/one glyphshow
grestore
2 setlinecap
0.690 setgray
gsave
367.034 194.819 53.794 41.606 clipbox
105.600007 41.60625 m
105.600007 236.425 l
stroke
grestore
0 setlinecap
0.000 setgray
gsave
/o {
gsave
newpath
translate
0.8 setlinewidth
1 setlinejoin

0 setlinecap

0 0 m
0 -3.5 l

gsave
0.000 setgray
fill
grestore
stroke
grestore
} bind def
105.6 41.6063 o
grestore
gsave
102.600007 26.403125 translate
0.000000 rotate
/STIXGeneral-Regular 12.0 selectfont
0.000000 0.890625 moveto
/two glyphshow
grestore
2 setlinecap
0.690 setgray
gsave
367.034 194.819 53.794 41.606 clipbox
123.161451 41.60625 m
123.161451 236.425 l
stroke
grestore
0 setlinecap
0.000 setgray
gsave
/o {
gsave
newpath
translate
0.8 setlinewidth
1 setlinejoin

0 setlinecap

0 0 m
0 -3.5 l

gsave
0.000 setgray
fill
grestore
stroke
grestore
} bind def
123.161 41.6063 o
grestore
gsave
120.161451 26.403125 translate
0.000000 rotate
/STIXGeneral-Regular 12.0 selectfont
0.000000 0.890625 moveto
/three glyphshow
grestore
2 setlinecap
0.690 setgray
gsave
367.034 194.819 53.794 41.606 clipbox
140.722894 41.60625 m
140.722894 236.425 l
stroke
grestore
0 setlinecap
0.000 setgray
gsave
/o {
gsave
newpath
translate
0.8 setlinewidth
1 setlinejoin

0 setlinecap

0 0 m
0 -3.5 l

gsave
0.000 setgray
fill
grestore
stroke
grestore
} bind def
140.723 41.6063 o
grestore
gsave
137.722894 26.403125 translate
0.000000 rotate
/STIXGeneral-Regular 12.0 selectfont
0.000000 0.890625 moveto
/four glyphshow
grestore
2 setlinecap
0.690 setgray
gsave
367.034 194.819 53.794 41.606 clipbox
158.284337 41.60625 m
158.284337 236.425 l
stroke
grestore
0 setlinecap
0.000 setgray
gsave
/o {
gsave
newpath
translate
0.8 setlinewidth
1 setlinejoin

0 setlinecap

0 0 m
0 -3.5 l

gsave
0.000 setgray
fill
grestore
stroke
grestore
} bind def
158.284 41.6063 o
grestore
gsave
155.284337 26.403125 translate
0.000000 rotate
/STIXGeneral-Regular 12.0 selectfont
0.000000 0.750000 moveto
/five glyphshow
grestore
2 setlinecap
0.690 setgray
gsave
367.034 194.819 53.794 41.606 clipbox
175.84578 41.60625 m
175.84578 236.425 l
stroke
grestore
0 setlinecap
0.000 setgray
gsave
/o {
gsave
newpath
translate
0.8 setlinewidth
1 setlinejoin

0 setlinecap

0 0 m
0 -3.5 l

gsave
0.000 setgray
fill
grestore
stroke
grestore
} bind def
175.846 41.6063 o
grestore
gsave
172.845780 26.403125 translate
0.000000 rotate
/STIXGeneral-Regular 12.0 selectfont
0.000000 0.796875 moveto
/six glyphshow
grestore
2 setlinecap
0.690 setgray
gsave
367.034 194.819 53.794 41.606 clipbox
193.407223 41.60625 m
193.407223 236.425 l
stroke
grestore
0 setlinecap
0.000 setgray
gsave
/o {
gsave
newpath
translate
0.8 setlinewidth
1 setlinejoin

0 setlinecap

0 0 m
0 -3.5 l

gsave
0.000 setgray
fill
grestore
stroke
grestore
} bind def
193.407 41.6063 o
grestore
gsave
190.407223 26.403125 translate
0.000000 rotate
/STIXGeneral-Regular 12.0 selectfont
0.000000 0.062500 moveto
/seven glyphshow
grestore
2 setlinecap
0.690 setgray
gsave
367.034 194.819 53.794 41.606 clipbox
210.968666 41.60625 m
210.968666 236.425 l
stroke
grestore
0 setlinecap
0.000 setgray
gsave
/o {
gsave
newpath
translate
0.8 setlinewidth
1 setlinejoin

0 setlinecap

0 0 m
0 -3.5 l

gsave
0.000 setgray
fill
grestore
stroke
grestore
} bind def
210.969 41.6063 o
grestore
gsave
207.968666 26.403125 translate
0.000000 rotate
/STIXGeneral-Regular 12.0 selectfont
0.000000 0.890625 moveto
/eight glyphshow
grestore
2 setlinecap
0.690 setgray
gsave
367.034 194.819 53.794 41.606 clipbox
228.53011 41.60625 m
228.53011 236.425 l
stroke
grestore
0 setlinecap
0.000 setgray
gsave
/o {
gsave
newpath
translate
0.8 setlinewidth
1 setlinejoin

0 setlinecap

0 0 m
0 -3.5 l

gsave
0.000 setgray
fill
grestore
stroke
grestore
} bind def
228.53 41.6063 o
grestore
gsave
225.530110 26.403125 translate
0.000000 rotate
/STIXGeneral-Regular 12.0 selectfont
0.000000 0.890625 moveto
/nine glyphshow
grestore
2 setlinecap
0.690 setgray
gsave
367.034 194.819 53.794 41.606 clipbox
246.091553 41.60625 m
246.091553 236.425 l
stroke
grestore
0 setlinecap
0.000 setgray
gsave
/o {
gsave
newpath
translate
0.8 setlinewidth
1 setlinejoin

0 setlinecap

0 0 m
0 -3.5 l

gsave
0.000 setgray
fill
grestore
stroke
grestore
} bind def
246.092 41.6063 o
grestore
gsave
240.091553 26.403125 translate
0.000000 rotate
/STIXGeneral-Regular 12.0 selectfont
0.000000 0.890625 moveto
/one glyphshow
5.999985 0.890625 moveto
/zero glyphshow
grestore
2 setlinecap
0.690 setgray
gsave
367.034 194.819 53.794 41.606 clipbox
263.652996 41.60625 m
263.652996 236.425 l
stroke
grestore
0 setlinecap
0.000 setgray
gsave
/o {
gsave
newpath
translate
0.8 setlinewidth
1 setlinejoin

0 setlinecap

0 0 m
0 -3.5 l

gsave
0.000 setgray
fill
grestore
stroke
grestore
} bind def
263.653 41.6063 o
grestore
gsave
257.652996 26.403125 translate
0.000000 rotate
/STIXGeneral-Regular 12.0 selectfont
0.000000 0.890625 moveto
/one glyphshow
5.999985 0.890625 moveto
/one glyphshow
grestore
2 setlinecap
0.690 setgray
gsave
367.034 194.819 53.794 41.606 clipbox
281.214439 41.60625 m
281.214439 236.425 l
stroke
grestore
0 setlinecap
0.000 setgray
gsave
/o {
gsave
newpath
translate
0.8 setlinewidth
1 setlinejoin

0 setlinecap

0 0 m
0 -3.5 l

gsave
0.000 setgray
fill
grestore
stroke
grestore
} bind def
281.214 41.6063 o
grestore
gsave
275.214439 26.403125 translate
0.000000 rotate
/STIXGeneral-Regular 12.0 selectfont
0.000000 0.890625 moveto
/one glyphshow
5.999985 0.890625 moveto
/two glyphshow
grestore
2 setlinecap
0.690 setgray
gsave
367.034 194.819 53.794 41.606 clipbox
298.775882 41.60625 m
298.775882 236.425 l
stroke
grestore
0 setlinecap
0.000 setgray
gsave
/o {
gsave
newpath
translate
0.8 setlinewidth
1 setlinejoin

0 setlinecap

0 0 m
0 -3.5 l

gsave
0.000 setgray
fill
grestore
stroke
grestore
} bind def
298.776 41.6063 o
grestore
gsave
292.775882 26.403125 translate
0.000000 rotate
/STIXGeneral-Regular 12.0 selectfont
0.000000 0.890625 moveto
/one glyphshow
5.999985 0.890625 moveto
/three glyphshow
grestore
2 setlinecap
0.690 setgray
gsave
367.034 194.819 53.794 41.606 clipbox
316.337325 41.60625 m
316.337325 236.425 l
stroke
grestore
0 setlinecap
0.000 setgray
gsave
/o {
gsave
newpath
translate
0.8 setlinewidth
1 setlinejoin

0 setlinecap

0 0 m
0 -3.5 l

gsave
0.000 setgray
fill
grestore
stroke
grestore
} bind def
316.337 41.6063 o
grestore
gsave
310.337325 26.403125 translate
0.000000 rotate
/STIXGeneral-Regular 12.0 selectfont
0.000000 0.890625 moveto
/one glyphshow
5.999985 0.890625 moveto
/four glyphshow
grestore
2 setlinecap
0.690 setgray
gsave
367.034 194.819 53.794 41.606 clipbox
333.898769 41.60625 m
333.898769 236.425 l
stroke
grestore
0 setlinecap
0.000 setgray
gsave
/o {
gsave
newpath
translate
0.8 setlinewidth
1 setlinejoin

0 setlinecap

0 0 m
0 -3.5 l

gsave
0.000 setgray
fill
grestore
stroke
grestore
} bind def
333.899 41.6063 o
grestore
gsave
327.898769 26.403125 translate
0.000000 rotate
/STIXGeneral-Regular 12.0 selectfont
0.000000 0.750000 moveto
/one glyphshow
5.999985 0.750000 moveto
/five glyphshow
grestore
2 setlinecap
0.690 setgray
gsave
367.034 194.819 53.794 41.606 clipbox
351.460212 41.60625 m
351.460212 236.425 l
stroke
grestore
0 setlinecap
0.000 setgray
gsave
/o {
gsave
newpath
translate
0.8 setlinewidth
1 setlinejoin

0 setlinecap

0 0 m
0 -3.5 l

gsave
0.000 setgray
fill
grestore
stroke
grestore
} bind def
351.46 41.6063 o
grestore
gsave
345.460212 26.403125 translate
0.000000 rotate
/STIXGeneral-Regular 12.0 selectfont
0.000000 0.796875 moveto
/one glyphshow
5.999985 0.796875 moveto
/six glyphshow
grestore
2 setlinecap
0.690 setgray
gsave
367.034 194.819 53.794 41.606 clipbox
369.021655 41.60625 m
369.021655 236.425 l
stroke
grestore
0 setlinecap
0.000 setgray
gsave
/o {
gsave
newpath
translate
0.8 setlinewidth
1 setlinejoin

0 setlinecap

0 0 m
0 -3.5 l

gsave
0.000 setgray
fill
grestore
stroke
grestore
} bind def
369.022 41.6063 o
grestore
gsave
363.021655 26.403125 translate
0.000000 rotate
/STIXGeneral-Regular 12.0 selectfont
0.000000 0.890625 moveto
/one glyphshow
5.999985 0.890625 moveto
/seven glyphshow
grestore
2 setlinecap
0.690 setgray
gsave
367.034 194.819 53.794 41.606 clipbox
386.583098 41.60625 m
386.583098 236.425 l
stroke
grestore
0 setlinecap
0.000 setgray
gsave
/o {
gsave
newpath
translate
0.8 setlinewidth
1 setlinejoin

0 setlinecap

0 0 m
0 -3.5 l

gsave
0.000 setgray
fill
grestore
stroke
grestore
} bind def
386.583 41.6063 o
grestore
gsave
380.583098 26.403125 translate
0.000000 rotate
/STIXGeneral-Regular 12.0 selectfont
0.000000 0.890625 moveto
/one glyphshow
5.999985 0.890625 moveto
/eight glyphshow
grestore
2 setlinecap
0.690 setgray
gsave
367.034 194.819 53.794 41.606 clipbox
404.144541 41.60625 m
404.144541 236.425 l
stroke
grestore
0 setlinecap
0.000 setgray
gsave
/o {
gsave
newpath
translate
0.8 setlinewidth
1 setlinejoin

0 setlinecap

0 0 m
0 -3.5 l

gsave
0.000 setgray
fill
grestore
stroke
grestore
} bind def
404.145 41.6063 o
grestore
gsave
398.144541 26.403125 translate
0.000000 rotate
/STIXGeneral-Regular 12.0 selectfont
0.000000 0.890625 moveto
/one glyphshow
5.999985 0.890625 moveto
/nine glyphshow
grestore
/STIXGeneral-Regular 14.000 selectfont
gsave

213.982706 10.231250 translate
0.000000 rotate
0.000000 0 m /i glyphshow
3.891998 0 m /t glyphshow
7.783997 0 m /e glyphshow
13.999985 0 m /r glyphshow
18.661972 0 m /a glyphshow
24.877960 0 m /t glyphshow
28.769958 0 m /i glyphshow
32.661957 0 m /o glyphshow
39.661957 0 m /n glyphshow
grestore
2 setlinecap
0.690 setgray
gsave
367.034 194.819 53.794 41.606 clipbox
53.79375 97.501488 m
420.827912 97.501488 l
stroke
grestore
0 setlinecap
0.000 setgray
gsave
/o {
gsave
newpath
translate
0.8 setlinewidth
1 setlinejoin

0 setlinecap

-0 0 m
-3.5 0 l

gsave
0.000 setgray
fill
grestore
stroke
grestore
} bind def
53.7938 97.5015 o
grestore
gsave
23.793750 92.806175 translate
0.000000 rotate
/STIXGeneral-Regular 12.0 selectfont
0.000000 0.998438 moveto
/one glyphshow
5.999985 0.998438 moveto
/zero glyphshow
/STIXGeneral-Regular 8.399999999999999 selectfont
12.189188 5.323438 moveto
/minus glyphshow
17.943178 5.323438 moveto
/three glyphshow
grestore
2 setlinecap
0.690 setgray
gsave
367.034 194.819 53.794 41.606 clipbox
53.79375 169.817155 m
420.827912 169.817155 l
stroke
grestore
0 setlinecap
0.000 setgray
gsave
/o {
gsave
newpath
translate
0.8 setlinewidth
1 setlinejoin

0 setlinecap

-0 0 m
-3.5 0 l

gsave
0.000 setgray
fill
grestore
stroke
grestore
} bind def
53.7938 169.817 o
grestore
gsave
23.793750 165.121842 translate
0.000000 rotate
/STIXGeneral-Regular 12.0 selectfont
0.000000 0.998438 moveto
/one glyphshow
5.999985 0.998438 moveto
/zero glyphshow
/STIXGeneral-Regular 8.399999999999999 selectfont
12.189188 5.323438 moveto
/minus glyphshow
17.943178 5.323438 moveto
/two glyphshow
grestore
2 setlinecap
0.690 setgray
gsave
367.034 194.819 53.794 41.606 clipbox
53.79375 46.955005 m
420.827912 46.955005 l
stroke
grestore
0.600 setlinewidth
0 setlinecap
0.000 setgray
gsave
/o {
gsave
newpath
translate
0.6 setlinewidth
1 setlinejoin

0 setlinecap

-0 0 m
-2 0 l

gsave
0.000 setgray
fill
grestore
stroke
grestore
} bind def
53.7938 46.955 o
grestore
0.800 setlinewidth
2 setlinecap
0.690 setgray
gsave
367.034 194.819 53.794 41.606 clipbox
53.79375 59.689162 m
420.827912 59.689162 l
stroke
grestore
0.600 setlinewidth
0 setlinecap
0.000 setgray
gsave
/o {
gsave
newpath
translate
0.6 setlinewidth
1 setlinejoin

0 setlinecap

-0 0 m
-2 0 l

gsave
0.000 setgray
fill
grestore
stroke
grestore
} bind def
53.7938 59.6892 o
grestore
0.800 setlinewidth
2 setlinecap
0.690 setgray
gsave
367.034 194.819 53.794 41.606 clipbox
53.79375 68.72419 m
420.827912 68.72419 l
stroke
grestore
0.600 setlinewidth
0 setlinecap
0.000 setgray
gsave
/o {
gsave
newpath
translate
0.6 setlinewidth
1 setlinejoin

0 setlinecap

-0 0 m
-2 0 l

gsave
0.000 setgray
fill
grestore
stroke
grestore
} bind def
53.7938 68.7242 o
grestore
0.800 setlinewidth
2 setlinecap
0.690 setgray
gsave
367.034 194.819 53.794 41.606 clipbox
53.79375 75.732303 m
420.827912 75.732303 l
stroke
grestore
0.600 setlinewidth
0 setlinecap
0.000 setgray
gsave
/o {
gsave
newpath
translate
0.6 setlinewidth
1 setlinejoin

0 setlinecap

-0 0 m
-2 0 l

gsave
0.000 setgray
fill
grestore
stroke
grestore
} bind def
53.7938 75.7323 o
grestore
0.800 setlinewidth
2 setlinecap
0.690 setgray
gsave
367.034 194.819 53.794 41.606 clipbox
53.79375 81.458347 m
420.827912 81.458347 l
stroke
grestore
0.600 setlinewidth
0 setlinecap
0.000 setgray
gsave
/o {
gsave
newpath
translate
0.6 setlinewidth
1 setlinejoin

0 setlinecap

-0 0 m
-2 0 l

gsave
0.000 setgray
fill
grestore
stroke
grestore
} bind def
53.7938 81.4583 o
grestore
0.800 setlinewidth
2 setlinecap
0.690 setgray
gsave
367.034 194.819 53.794 41.606 clipbox
53.79375 86.299649 m
420.827912 86.299649 l
stroke
grestore
0.600 setlinewidth
0 setlinecap
0.000 setgray
gsave
/o {
gsave
newpath
translate
0.6 setlinewidth
1 setlinejoin

0 setlinecap

-0 0 m
-2 0 l

gsave
0.000 setgray
fill
grestore
stroke
grestore
} bind def
53.7938 86.2996 o
grestore
0.800 setlinewidth
2 setlinecap
0.690 setgray
gsave
367.034 194.819 53.794 41.606 clipbox
53.79375 90.493375 m
420.827912 90.493375 l
stroke
grestore
0.600 setlinewidth
0 setlinecap
0.000 setgray
gsave
/o {
gsave
newpath
translate
0.6 setlinewidth
1 setlinejoin

0 setlinecap

-0 0 m
-2 0 l

gsave
0.000 setgray
fill
grestore
stroke
grestore
} bind def
53.7938 90.4934 o
grestore
0.800 setlinewidth
2 setlinecap
0.690 setgray
gsave
367.034 194.819 53.794 41.606 clipbox
53.79375 94.192504 m
420.827912 94.192504 l
stroke
grestore
0.600 setlinewidth
0 setlinecap
0.000 setgray
gsave
/o {
gsave
newpath
translate
0.6 setlinewidth
1 setlinejoin

0 setlinecap

-0 0 m
-2 0 l

gsave
0.000 setgray
fill
grestore
stroke
grestore
} bind def
53.7938 94.1925 o
grestore
0.800 setlinewidth
2 setlinecap
0.690 setgray
gsave
367.034 194.819 53.794 41.606 clipbox
53.79375 119.270673 m
420.827912 119.270673 l
stroke
grestore
0.600 setlinewidth
0 setlinecap
0.000 setgray
gsave
/o {
gsave
newpath
translate
0.6 setlinewidth
1 setlinejoin

0 setlinecap

-0 0 m
-2 0 l

gsave
0.000 setgray
fill
grestore
stroke
grestore
} bind def
53.7938 119.271 o
grestore
0.800 setlinewidth
2 setlinecap
0.690 setgray
gsave
367.034 194.819 53.794 41.606 clipbox
53.79375 132.004829 m
420.827912 132.004829 l
stroke
grestore
0.600 setlinewidth
0 setlinecap
0.000 setgray
gsave
/o {
gsave
newpath
translate
0.6 setlinewidth
1 setlinejoin

0 setlinecap

-0 0 m
-2 0 l

gsave
0.000 setgray
fill
grestore
stroke
grestore
} bind def
53.7938 132.005 o
grestore
0.800 setlinewidth
2 setlinecap
0.690 setgray
gsave
367.034 194.819 53.794 41.606 clipbox
53.79375 141.039857 m
420.827912 141.039857 l
stroke
grestore
0.600 setlinewidth
0 setlinecap
0.000 setgray
gsave
/o {
gsave
newpath
translate
0.6 setlinewidth
1 setlinejoin

0 setlinecap

-0 0 m
-2 0 l

gsave
0.000 setgray
fill
grestore
stroke
grestore
} bind def
53.7938 141.04 o
grestore
0.800 setlinewidth
2 setlinecap
0.690 setgray
gsave
367.034 194.819 53.794 41.606 clipbox
53.79375 148.04797 m
420.827912 148.04797 l
stroke
grestore
0.600 setlinewidth
0 setlinecap
0.000 setgray
gsave
/o {
gsave
newpath
translate
0.6 setlinewidth
1 setlinejoin

0 setlinecap

-0 0 m
-2 0 l

gsave
0.000 setgray
fill
grestore
stroke
grestore
} bind def
53.7938 148.048 o
grestore
0.800 setlinewidth
2 setlinecap
0.690 setgray
gsave
367.034 194.819 53.794 41.606 clipbox
53.79375 153.774014 m
420.827912 153.774014 l
stroke
grestore
0.600 setlinewidth
0 setlinecap
0.000 setgray
gsave
/o {
gsave
newpath
translate
0.6 setlinewidth
1 setlinejoin

0 setlinecap

-0 0 m
-2 0 l

gsave
0.000 setgray
fill
grestore
stroke
grestore
} bind def
53.7938 153.774 o
grestore
0.800 setlinewidth
2 setlinecap
0.690 setgray
gsave
367.034 194.819 53.794 41.606 clipbox
53.79375 158.615316 m
420.827912 158.615316 l
stroke
grestore
0.600 setlinewidth
0 setlinecap
0.000 setgray
gsave
/o {
gsave
newpath
translate
0.6 setlinewidth
1 setlinejoin

0 setlinecap

-0 0 m
-2 0 l

gsave
0.000 setgray
fill
grestore
stroke
grestore
} bind def
53.7938 158.615 o
grestore
0.800 setlinewidth
2 setlinecap
0.690 setgray
gsave
367.034 194.819 53.794 41.606 clipbox
53.79375 162.809042 m
420.827912 162.809042 l
stroke
grestore
0.600 setlinewidth
0 setlinecap
0.000 setgray
gsave
/o {
gsave
newpath
translate
0.6 setlinewidth
1 setlinejoin

0 setlinecap

-0 0 m
-2 0 l

gsave
0.000 setgray
fill
grestore
stroke
grestore
} bind def
53.7938 162.809 o
grestore
0.800 setlinewidth
2 setlinecap
0.690 setgray
gsave
367.034 194.819 53.794 41.606 clipbox
53.79375 166.508171 m
420.827912 166.508171 l
stroke
grestore
0.600 setlinewidth
0 setlinecap
0.000 setgray
gsave
/o {
gsave
newpath
translate
0.6 setlinewidth
1 setlinejoin

0 setlinecap

-0 0 m
-2 0 l

gsave
0.000 setgray
fill
grestore
stroke
grestore
} bind def
53.7938 166.508 o
grestore
0.800 setlinewidth
2 setlinecap
0.690 setgray
gsave
367.034 194.819 53.794 41.606 clipbox
53.79375 191.58634 m
420.827912 191.58634 l
stroke
grestore
0.600 setlinewidth
0 setlinecap
0.000 setgray
gsave
/o {
gsave
newpath
translate
0.6 setlinewidth
1 setlinejoin

0 setlinecap

-0 0 m
-2 0 l

gsave
0.000 setgray
fill
grestore
stroke
grestore
} bind def
53.7938 191.586 o
grestore
0.800 setlinewidth
2 setlinecap
0.690 setgray
gsave
367.034 194.819 53.794 41.606 clipbox
53.79375 204.320496 m
420.827912 204.320496 l
stroke
grestore
0.600 setlinewidth
0 setlinecap
0.000 setgray
gsave
/o {
gsave
newpath
translate
0.6 setlinewidth
1 setlinejoin

0 setlinecap

-0 0 m
-2 0 l

gsave
0.000 setgray
fill
grestore
stroke
grestore
} bind def
53.7938 204.32 o
grestore
0.800 setlinewidth
2 setlinecap
0.690 setgray
gsave
367.034 194.819 53.794 41.606 clipbox
53.79375 213.355524 m
420.827912 213.355524 l
stroke
grestore
0.600 setlinewidth
0 setlinecap
0.000 setgray
gsave
/o {
gsave
newpath
translate
0.6 setlinewidth
1 setlinejoin

0 setlinecap

-0 0 m
-2 0 l

gsave
0.000 setgray
fill
grestore
stroke
grestore
} bind def
53.7938 213.356 o
grestore
0.800 setlinewidth
2 setlinecap
0.690 setgray
gsave
367.034 194.819 53.794 41.606 clipbox
53.79375 220.363637 m
420.827912 220.363637 l
stroke
grestore
0.600 setlinewidth
0 setlinecap
0.000 setgray
gsave
/o {
gsave
newpath
translate
0.6 setlinewidth
1 setlinejoin

0 setlinecap

-0 0 m
-2 0 l

gsave
0.000 setgray
fill
grestore
stroke
grestore
} bind def
53.7938 220.364 o
grestore
0.800 setlinewidth
2 setlinecap
0.690 setgray
gsave
367.034 194.819 53.794 41.606 clipbox
53.79375 226.089681 m
420.827912 226.089681 l
stroke
grestore
0.600 setlinewidth
0 setlinecap
0.000 setgray
gsave
/o {
gsave
newpath
translate
0.6 setlinewidth
1 setlinejoin

0 setlinecap

-0 0 m
-2 0 l

gsave
0.000 setgray
fill
grestore
stroke
grestore
} bind def
53.7938 226.09 o
grestore
0.800 setlinewidth
2 setlinecap
0.690 setgray
gsave
367.034 194.819 53.794 41.606 clipbox
53.79375 230.930983 m
420.827912 230.930983 l
stroke
grestore
0.600 setlinewidth
0 setlinecap
0.000 setgray
gsave
/o {
gsave
newpath
translate
0.6 setlinewidth
1 setlinejoin

0 setlinecap

-0 0 m
-2 0 l

gsave
0.000 setgray
fill
grestore
stroke
grestore
} bind def
53.7938 230.931 o
grestore
0.800 setlinewidth
2 setlinecap
0.690 setgray
gsave
367.034 194.819 53.794 41.606 clipbox
53.79375 235.124709 m
420.827912 235.124709 l
stroke
grestore
0.600 setlinewidth
0 setlinecap
0.000 setgray
gsave
/o {
gsave
newpath
translate
0.6 setlinewidth
1 setlinejoin

0 setlinecap

-0 0 m
-2 0 l

gsave
0.000 setgray
fill
grestore
stroke
grestore
} bind def
53.7938 235.125 o
grestore
gsave

16.762500 125.421875 translate
90.000000 rotate
0.000000 0 m /e glyphshow
6.215988 0 m /r glyphshow
10.877975 0 m /r glyphshow
15.539963 0 m /o glyphshow
22.539963 0 m /r glyphshow
grestore
1.500 setlinewidth
2 setlinecap
0.122 0.467 0.706 setrgbcolor
gsave
367.034 194.819 53.794 41.606 clipbox
70.477121 117.833273 m
88.038564 99.731285 l
105.600007 99.284286 l
123.161451 89.115331 l
140.722894 78.03454 l
158.284337 80.574154 l
175.84578 74.930182 l
193.407223 77.049417 l
210.968666 73.648539 l
228.53011 64.423792 l
246.091553 67.417721 l
263.652996 63.695076 l
281.214439 59.124288 l
298.775882 61.986533 l
316.337325 59.851777 l
333.898769 54.268341 l
351.460212 57.705533 l
369.021655 52.356639 l
386.583098 50.785554 l
404.144541 50.461648 l
stroke
grestore
1.000 setlinewidth
0 setlinecap
gsave
367.034 194.819 53.794 41.606 clipbox
/o {
gsave
newpath
translate
1.0 setlinewidth
1 setlinejoin

0 setlinecap

0 -1.75 m
0.464105 -1.75 0.909265 -1.565609 1.237437 -1.237437 c
1.565609 -0.909265 1.75 -0.464105 1.75 0 c
1.75 0.464105 1.565609 0.909265 1.237437 1.237437 c
0.909265 1.565609 0.464105 1.75 0 1.75 c
-0.464105 1.75 -0.909265 1.565609 -1.237437 1.237437 c
-1.565609 0.909265 -1.75 0.464105 -1.75 0 c
-1.75 -0.464105 -1.565609 -0.909265 -1.237437 -1.237437 c
-0.909265 -1.565609 -0.464105 -1.75 0 -1.75 c
cl

gsave
0.122 0.467 0.706 setrgbcolor
fill
grestore
stroke
grestore
} bind def
70.4771 117.833 o
88.0386 99.7313 o
105.6 99.2843 o
123.161 89.1153 o
140.723 78.0345 o
158.284 80.5742 o
175.846 74.9302 o
193.407 77.0494 o
210.969 73.6485 o
228.53 64.4238 o
246.092 67.4177 o
263.653 63.6951 o
281.214 59.1243 o
298.776 61.9865 o
316.337 59.8518 o
333.899 54.2683 o
351.46 57.7055 o
369.022 52.3566 o
386.583 50.7856 o
404.145 50.4616 o
grestore
1.500 setlinewidth
2 setlinecap
0.839 0.153 0.157 setrgbcolor
gsave
367.034 194.819 53.794 41.606 clipbox
70.477121 159.530362 m
88.038564 129.853943 l
105.600007 151.88536 l
123.161451 127.414166 l
140.722894 100.654295 l
158.284337 112.241452 l
175.84578 98.46069 l
193.407223 94.245042 l
210.968666 90.570517 l
228.53011 80.979884 l
246.091553 88.53389 l
263.652996 79.265457 l
281.214439 75.879293 l
298.775882 78.640888 l
316.337325 78.359588 l
333.898769 71.806772 l
351.460212 77.324999 l
369.021655 69.635611 l
386.583098 68.472344 l
404.144541 67.735304 l
stroke
grestore
1.000 setlinewidth
2 setlinejoin
0 setlinecap
gsave
367.034 194.819 53.794 41.606 clipbox
/o {
gsave
newpath
translate
1.0 setlinewidth
2 setlinejoin

0 setlinecap

0 3.5 m
-0.785799 1.081559 l
-3.328698 1.081559 l
-1.271449 -0.413119 l
-2.057248 -2.831559 l
-0 -1.336881 l
2.057248 -2.831559 l
1.271449 -0.413119 l
3.328698 1.081559 l
0.785799 1.081559 l
cl

gsave
0.839 0.153 0.157 setrgbcolor
fill
grestore
stroke
grestore
} bind def
70.4771 159.53 o
88.0386 129.854 o
105.6 151.885 o
123.161 127.414 o
140.723 100.654 o
158.284 112.241 o
175.846 98.4607 o
193.407 94.245 o
210.969 90.5705 o
228.53 80.9799 o
246.092 88.5339 o
263.653 79.2655 o
281.214 75.8793 o
298.776 78.6409 o
316.337 78.3596 o
333.899 71.8068 o
351.46 77.325 o
369.022 69.6356 o
386.583 68.4723 o
404.145 67.7353 o
grestore
1.500 setlinewidth
1 setlinejoin
2 setlinecap
0.173 0.627 0.173 setrgbcolor
gsave
367.034 194.819 53.794 41.606 clipbox
70.477121 227.569602 m
88.038564 194.581488 l
105.600007 224.099327 l
123.161451 206.110929 l
140.722894 169.124337 l
158.284337 207.146683 l
175.84578 177.728466 l
193.407223 163.048544 l
210.968666 147.364232 l
228.53011 142.592038 l
246.091553 187.365299 l
263.652996 138.27498 l
281.214439 134.796773 l
298.775882 150.881088 l
316.337325 181.715477 l
333.898769 140.020153 l
351.460212 180.95493 l
369.021655 144.466674 l
386.583098 145.504447 l
404.144541 106.539899 l
stroke
grestore
1.000 setlinewidth
0 setlinecap
gsave
367.034 194.819 53.794 41.606 clipbox
/o {
gsave
newpath
translate
1.0 setlinewidth
1 setlinejoin

0 setlinecap

-3.5 -3.5 m
3.5 3.5 l
-3.5 3.5 m
3.5 -3.5 l

gsave
0.173 0.627 0.173 setrgbcolor
fill
grestore
stroke
grestore
} bind def
70.4771 227.57 o
88.0386 194.581 o
105.6 224.099 o
123.161 206.111 o
140.723 169.124 o
158.284 207.147 o
175.846 177.728 o
193.407 163.049 o
210.969 147.364 o
228.53 142.592 o
246.092 187.365 o
263.653 138.275 o
281.214 134.797 o
298.776 150.881 o
316.337 181.715 o
333.899 140.02 o
351.46 180.955 o
369.022 144.467 o
386.583 145.504 o
404.145 106.54 o
grestore
0.800 setlinewidth
0 setlinejoin
2 setlinecap
0.000 setgray
gsave
53.79375 41.60625 m
53.79375 236.425 l
stroke
grestore
gsave
420.827912 41.60625 m
420.827912 236.425 l
stroke
grestore
gsave
53.79375 41.60625 m
420.827912 41.60625 l
stroke
grestore
gsave
53.79375 236.425 m
420.827912 236.425 l
stroke
grestore
1.000 setlinewidth
0 setlinecap
0.800 setgray
gsave
477.883037 109.171875 m
546.883037 109.171875 l
548.21637 109.171875 548.883037 109.838542 548.883037 111.171875 c
548.883037 166.859375 l
548.883037 168.192708 548.21637 168.859375 546.883037 168.859375 c
477.883037 168.859375 l
476.549703 168.859375 475.883037 168.192708 475.883037 166.859375 c
475.883037 111.171875 l
475.883037 109.838542 476.549703 109.171875 477.883037 109.171875 c
cl
gsave
1.000 setgray
fill
grestore
stroke
grestore
1.500 setlinewidth
1 setlinejoin
2 setlinecap
0.122 0.467 0.706 setrgbcolor
gsave
479.883037 161.359375 m
489.883037 161.359375 l
499.883037 161.359375 l
stroke
grestore
1.000 setlinewidth
0 setlinecap
gsave
/o {
gsave
newpath
translate
1.0 setlinewidth
1 setlinejoin

0 setlinecap

0 -1.75 m
0.464105 -1.75 0.909265 -1.565609 1.237437 -1.237437 c
1.565609 -0.909265 1.75 -0.464105 1.75 0 c
1.75 0.464105 1.565609 0.909265 1.237437 1.237437 c
0.909265 1.565609 0.464105 1.75 0 1.75 c
-0.464105 1.75 -0.909265 1.565609 -1.237437 1.237437 c
-1.565609 0.909265 -1.75 0.464105 -1.75 0 c
-1.75 -0.464105 -1.565609 -0.909265 -1.237437 -1.237437 c
-0.909265 -1.565609 -0.464105 -1.75 0 -1.75 c
cl

gsave
0.122 0.467 0.706 setrgbcolor
fill
grestore
stroke
grestore
} bind def
489.883 161.359 o
grestore
0.000 setgray
gsave
507.883037 157.859375 translate
0.000000 rotate
/STIXGeneral-Italic 10.0 selectfont
0.000000 0.125000 moveto
/uni2113 glyphshow
/STIXGeneral-Regular 7.0 selectfont
5.789993 -1.196875 moveto
/one glyphshow
/STIXGeneral-Regular 10.0 selectfont
9.730608 0.125000 moveto
/space glyphshow
12.230592 0.125000 moveto
/n glyphshow
17.230577 0.125000 moveto
/o glyphshow
22.230562 0.125000 moveto
/r glyphshow
25.560548 0.125000 moveto
/m glyphshow
grestore
1.500 setlinewidth
2 setlinecap
0.839 0.153 0.157 setrgbcolor
gsave
479.883037 147.1875 m
489.883037 147.1875 l
499.883037 147.1875 l
stroke
grestore
1.000 setlinewidth
2 setlinejoin
0 setlinecap
gsave
/o {
gsave
newpath
translate
1.0 setlinewidth
2 setlinejoin

0 setlinecap

0 3.5 m
-0.785799 1.081559 l
-3.328698 1.081559 l
-1.271449 -0.413119 l
-2.057248 -2.831559 l
-0 -1.336881 l
2.057248 -2.831559 l
1.271449 -0.413119 l
3.328698 1.081559 l
0.785799 1.081559 l
cl

gsave
0.839 0.153 0.157 setrgbcolor
fill
grestore
stroke
grestore
} bind def
489.883 147.188 o
grestore
0.000 setgray
gsave
507.883037 143.687500 translate
0.000000 rotate
/STIXGeneral-Italic 10.0 selectfont
0.000000 0.125000 moveto
/uni2113 glyphshow
/STIXGeneral-Regular 7.0 selectfont
5.789993 -1.196875 moveto
/two glyphshow
/STIXGeneral-Regular 10.0 selectfont
9.730608 0.125000 moveto
/space glyphshow
12.230592 0.125000 moveto
/n glyphshow
17.230577 0.125000 moveto
/o glyphshow
22.230562 0.125000 moveto
/r glyphshow
25.560548 0.125000 moveto
/m glyphshow
grestore
1.500 setlinewidth
1 setlinejoin
2 setlinecap
0.173 0.627 0.173 setrgbcolor
gsave
479.883037 133.015625 m
489.883037 133.015625 l
499.883037 133.015625 l
stroke
grestore
1.000 setlinewidth
0 setlinecap
gsave
/o {
gsave
newpath
translate
1.0 setlinewidth
1 setlinejoin

0 setlinecap

-3.5 -3.5 m
3.5 3.5 l
-3.5 3.5 m
3.5 -3.5 l

gsave
0.173 0.627 0.173 setrgbcolor
fill
grestore
stroke
grestore
} bind def
489.883 133.016 o
grestore
0.000 setgray
gsave
507.883037 129.515625 translate
0.000000 rotate
/STIXGeneral-Italic 10.0 selectfont
0.000000 0.125000 moveto
/uni2113 glyphshow
/STIXGeneral-Regular 7.0 selectfont
5.789993 -1.196875 moveto
/uni221E glyphshow
/STIXGeneral-Regular 10.0 selectfont
12.712604 0.125000 moveto
/space glyphshow
15.212589 0.125000 moveto
/n glyphshow
20.212573 0.125000 moveto
/o glyphshow
25.212558 0.125000 moveto
/r glyphshow
28.542545 0.125000 moveto
/m glyphshow
grestore
1.500 setlinewidth
2 setlinecap
0.580 0.404 0.741 setrgbcolor
gsave
479.883037 118.84375 m
489.883037 118.84375 l
499.883037 118.84375 l
stroke
grestore
1.000 setlinewidth
0 setlinejoin
0 setlinecap
gsave
/o {
gsave
newpath
translate
1.0 setlinewidth
0 setlinejoin

0 setlinecap

3.5 -0 m
-3.5 3.5 l
-3.5 -3.5 l
cl

gsave
0.580 0.404 0.741 setrgbcolor
fill
grestore
stroke
grestore
} bind def
489.883 118.844 o
grestore
0.000 setgray
gsave
507.883037 115.343750 translate
0.000000 rotate
/STIXGeneral-Italic 10.0 selectfont
0.000000 0.468750 moveto
/N glyphshow
grestore
0.800 setlinewidth
1 setlinejoin
0.580 0.404 0.741 setrgbcolor
gsave
/o {
gsave
newpath
translate
0.8 setlinewidth
1 setlinejoin

0 setlinecap

0 0 m
3.5 0 l

gsave
0.580 0.404 0.741 setrgbcolor
fill
grestore
stroke
grestore
} bind def
420.828 48.9558 o
grestore
gsave
427.827912 44.854272 translate
0.000000 rotate
/STIXGeneral-Regular 12.0 selectfont
0.000000 0.890625 moveto
/one glyphshow
5.999985 0.890625 moveto
/zero glyphshow
11.999969 0.890625 moveto
/zero glyphshow
17.999954 0.890625 moveto
/zero glyphshow
23.999939 0.890625 moveto
/zero glyphshow
grestore
gsave
/o {
gsave
newpath
translate
0.8 setlinewidth
1 setlinejoin

0 setlinecap

0 0 m
3.5 0 l

gsave
0.580 0.404 0.741 setrgbcolor
fill
grestore
stroke
grestore
} bind def
420.828 74.3062 o
grestore
gsave
427.827912 70.204661 translate
0.000000 rotate
/STIXGeneral-Regular 12.0 selectfont
0.000000 0.890625 moveto
/two glyphshow
5.999985 0.890625 moveto
/zero glyphshow
11.999969 0.890625 moveto
/zero glyphshow
17.999954 0.890625 moveto
/zero glyphshow
23.999939 0.890625 moveto
/zero glyphshow
grestore
gsave
/o {
gsave
newpath
translate
0.8 setlinewidth
1 setlinejoin

0 setlinecap

0 0 m
3.5 0 l

gsave
0.580 0.404 0.741 setrgbcolor
fill
grestore
stroke
grestore
} bind def
420.828 99.6566 o
grestore
gsave
427.827912 95.555049 translate
0.000000 rotate
/STIXGeneral-Regular 12.0 selectfont
0.000000 0.890625 moveto
/three glyphshow
5.999985 0.890625 moveto
/zero glyphshow
11.999969 0.890625 moveto
/zero glyphshow
17.999954 0.890625 moveto
/zero glyphshow
23.999939 0.890625 moveto
/zero glyphshow
grestore
gsave
/o {
gsave
newpath
translate
0.8 setlinewidth
1 setlinejoin

0 setlinecap

0 0 m
3.5 0 l

gsave
0.580 0.404 0.741 setrgbcolor
fill
grestore
stroke
grestore
} bind def
420.828 125.007 o
grestore
gsave
427.827912 120.905438 translate
0.000000 rotate
/STIXGeneral-Regular 12.0 selectfont
0.000000 0.890625 moveto
/four glyphshow
5.999985 0.890625 moveto
/zero glyphshow
11.999969 0.890625 moveto
/zero glyphshow
17.999954 0.890625 moveto
/zero glyphshow
23.999939 0.890625 moveto
/zero glyphshow
grestore
gsave
/o {
gsave
newpath
translate
0.8 setlinewidth
1 setlinejoin

0 setlinecap

0 0 m
3.5 0 l

gsave
0.580 0.404 0.741 setrgbcolor
fill
grestore
stroke
grestore
} bind def
420.828 150.357 o
grestore
gsave
427.827912 146.255826 translate
0.000000 rotate
/STIXGeneral-Regular 12.0 selectfont
0.000000 0.750000 moveto
/five glyphshow
5.999985 0.750000 moveto
/zero glyphshow
11.999969 0.750000 moveto
/zero glyphshow
17.999954 0.750000 moveto
/zero glyphshow
23.999939 0.750000 moveto
/zero glyphshow
grestore
gsave
/o {
gsave
newpath
translate
0.8 setlinewidth
1 setlinejoin

0 setlinecap

0 0 m
3.5 0 l

gsave
0.580 0.404 0.741 setrgbcolor
fill
grestore
stroke
grestore
} bind def
420.828 175.708 o
grestore
gsave
427.827912 171.606215 translate
0.000000 rotate
/STIXGeneral-Regular 12.0 selectfont
0.000000 0.796875 moveto
/six glyphshow
5.999985 0.796875 moveto
/zero glyphshow
11.999969 0.796875 moveto
/zero glyphshow
17.999954 0.796875 moveto
/zero glyphshow
23.999939 0.796875 moveto
/zero glyphshow
grestore
gsave
/o {
gsave
newpath
translate
0.8 setlinewidth
1 setlinejoin

0 setlinecap

0 0 m
3.5 0 l

gsave
0.580 0.404 0.741 setrgbcolor
fill
grestore
stroke
grestore
} bind def
420.828 201.058 o
grestore
gsave
427.827912 196.956603 translate
0.000000 rotate
/STIXGeneral-Regular 12.0 selectfont
0.000000 0.890625 moveto
/seven glyphshow
5.999985 0.890625 moveto
/zero glyphshow
11.999969 0.890625 moveto
/zero glyphshow
17.999954 0.890625 moveto
/zero glyphshow
23.999939 0.890625 moveto
/zero glyphshow
grestore
gsave
/o {
gsave
newpath
translate
0.8 setlinewidth
1 setlinejoin

0 setlinecap

0 0 m
3.5 0 l

gsave
0.580 0.404 0.741 setrgbcolor
fill
grestore
stroke
grestore
} bind def
420.828 226.409 o
grestore
gsave
427.827912 222.306992 translate
0.000000 rotate
/STIXGeneral-Regular 12.0 selectfont
0.000000 0.890625 moveto
/eight glyphshow
5.999985 0.890625 moveto
/zero glyphshow
11.999969 0.890625 moveto
/zero glyphshow
17.999954 0.890625 moveto
/zero glyphshow
23.999939 0.890625 moveto
/zero glyphshow
grestore
gsave
471.390412 134.015625 translate
90.000000 rotate
/STIXGeneral-Italic 14.0 selectfont
0.000000 0.859375 moveto
/N glyphshow
grestore
1.500 setlinewidth
2 setlinecap
gsave
367.034 194.819 53.794 41.606 clipbox
70.477121 50.461648 m
88.038564 50.743037 l
105.600007 51.822964 l
123.161451 53.792689 l
140.722894 56.299842 l
158.284337 60.099865 l
175.84578 65.484288 l
193.407223 70.508735 l
210.968666 77.307709 l
228.53011 86.294422 l
246.091553 95.463657 l
263.652996 103.915477 l
281.214439 113.287516 l
298.775882 123.592449 l
316.337325 135.458965 l
333.898769 147.895866 l
351.460212 160.8778 l
369.021655 174.232385 l
386.583098 195.691489 l
404.144541 227.569602 l
stroke
grestore
1.000 setlinewidth
0 setlinejoin
0 setlinecap
gsave
367.034 194.819 53.794 41.606 clipbox
/o {
gsave
newpath
translate
1.0 setlinewidth
0 setlinejoin

0 setlinecap

3.5 -0 m
-3.5 3.5 l
-3.5 -3.5 l
cl

gsave
0.580 0.404 0.741 setrgbcolor
fill
grestore
stroke
grestore
} bind def
70.4771 50.4616 o
88.0386 50.743 o
105.6 51.823 o
123.161 53.7927 o
140.723 56.2998 o
158.284 60.0999 o
175.846 65.4843 o
193.407 70.5087 o
210.969 77.3077 o
228.53 86.2944 o
246.092 95.4637 o
263.653 103.915 o
281.214 113.288 o
298.776 123.592 o
316.337 135.459 o
333.899 147.896 o
351.46 160.878 o
369.022 174.232 o
386.583 195.691 o
404.145 227.57 o
grestore
0.800 setlinewidth
2 setlinecap
0.000 setgray
gsave
53.79375 41.60625 m
53.79375 236.425 l
stroke
grestore
gsave
420.827912 41.60625 m
420.827912 236.425 l
stroke
grestore
gsave
53.79375 41.60625 m
420.827912 41.60625 l
stroke
grestore
gsave
53.79375 236.425 m
420.827912 236.425 l
stroke
grestore

end
showpage
