%!PS-Adobe-3.0 EPSF-3.0
%%Title: solvers_iter_times.eps
%%Creator: Matplotlib v3.5.3, https://matplotlib.org/
%%CreationDate: Thu May  4 14:55:32 2023
%%Orientation: portrait
%%BoundingBox: -14 236 627 556
%%HiResBoundingBox: -14.391349 236.348125 626.391349 555.651875
%%EndComments
%%BeginProlog
/mpldict 12 dict def
mpldict begin
/_d { bind def } bind def
/m { moveto } _d
/l { lineto } _d
/r { rlineto } _d
/c { curveto } _d
/cl { closepath } _d
/ce { closepath eofill } _d
/box {
      m
      1 index 0 r
      0 exch r
      neg 0 r
      cl
    } _d
/clipbox {
      box
      clip
      newpath
    } _d
/sc { setcachedevice } _d
%!PS-Adobe-3.0 Resource-Font
%%Creator: Converted from TrueType to Type 3 by Matplotlib.
10 dict begin
/FontName /STIXGeneral-Regular def
/PaintType 0 def
/FontMatrix [0.001 0 0 0.001 0 0] def
/FontBBox [-970 -443 2000 1023] def
/FontType 3 def
/Encoding [/minus /space /parenleft /parenright /plus /zero /one /two /three /five /A /B /C /G /I /L /P /S /T /U /bracketleft /bracketright /a /d /e /i /l /m /n /o /p /r /s /t /v] def
/CharStrings 36 dict dup begin
/.notdef 0 def
/minus{685 0 64 220 621 286 sc
621 220 m
64 220 l
64 286 l
621 286 l
621 220 l

ce} _d
/space{250 0 0 0 0 0 sc
ce} _d
/parenleft{333 0 48 -177 304 676 sc
304 -161 m
292 -177 l
215 -133 155 -72 112 5 c
69 82 48 165 48 252 c
48 437 130 578 295 676 c
304 660 l
236 602 191 545 168 488 c
145 432 134 354 134 255 c
134 156 146 76 169 15 c
192 -46 237 -105 304 -161 c

ce} _d
/parenright{333 0 29 -177 285 676 sc
29 660 m
41 676 l
117 631 177 569 220 492 c
263 415 285 333 285 247 c
285 65 203 -76 38 -177 c
29 -161 l
98 -104 143 -48 165 8 c
188 65 199 143 199 244 c
199 345 188 426 165 487 c
143 548 98 606 29 660 c

ce} _d
/plus{685 0 48 -41 636 547 sc
636 220 m
375 220 l
375 -41 l
309 -41 l
309 220 l
48 220 l
48 286 l
309 286 l
309 547 l
375 547 l
375 286 l
636 286 l
636 220 l

ce} _d
/zero{500 0 24 -14 476 676 sc
476 330 m
476 285 472 243 463 203 c
454 164 441 127 424 94 c
407 61 384 34 354 15 c
324 -4 289 -14 250 -14 c
209 -14 174 -4 143 17 c
112 38 89 65 72 100 c
55 135 43 172 35 211 c
28 250 24 292 24 336 c
24 398 32 454 47 503 c
62 553 88 594 123 627 c
159 660 203 676 254 676 c
319 676 373 644 414 580 c
455 516 476 433 476 330 c

380 325 m
380 430 369 511 346 566 c
324 622 291 650 248 650 c
207 650 175 622 153 566 c
131 510 120 431 120 329 c
120 226 131 148 153 93 c
175 39 207 12 250 12 c
292 12 324 39 346 93 c
369 148 380 225 380 325 c

ce} _d
/one{500 0 111 0 394 676 sc
394 0 m
118 0 l
118 15 l
155 17 180 24 193 35 c
206 47 213 67 213 95 c
213 544 l
213 577 203 593 183 593 c
174 593 159 589 138 581 c
111 571 l
111 585 l
290 676 l
299 673 l
299 76 l
299 54 306 38 319 29 c
332 20 357 15 394 15 c
394 0 l

ce} _d
/two{500 0 29 0 474 676 sc
474 137 m
420 0 l
29 0 l
29 12 l
207 201 l
254 250 287 294 307 335 c
327 376 337 418 337 461 c
337 506 325 540 300 565 c
275 590 241 602 198 602 c
162 602 133 593 112 574 c
91 555 71 521 51 472 c
30 477 l
41 539 64 588 98 623 c
133 658 179 676 238 676 c
293 676 338 659 372 626 c
406 593 423 551 423 500 c
423 425 380 342 295 252 c
130 76 l
364 76 l
386 76 403 80 416 89 c
429 98 444 116 460 143 c
474 137 l

ce} _d
/three{500 0 41 -14 431 676 sc
61 510 m
45 514 l
60 564 84 603 117 632 c
150 661 191 676 241 676 c
288 676 325 663 354 638 c
383 613 397 580 397 539 c
397 484 366 438 304 401 c
341 385 368 367 387 348 c
416 315 431 272 431 219 c
431 166 416 119 385 79 c
362 48 330 25 287 9 c
245 -6 200 -14 153 -14 c
78 -14 41 5 41 43 c
41 54 45 62 53 69 c
61 76 71 79 82 79 c
99 79 119 70 143 53 c
172 32 201 22 229 22 c
266 22 296 37 321 66 c
346 96 359 132 359 175 c
359 252 324 300 255 320 c
234 327 200 330 153 330 c
153 344 l
190 357 218 369 237 380 c
291 411 318 455 318 514 c
318 547 308 573 289 590 c
270 607 244 616 210 616 c
150 616 100 581 61 510 c

ce} _d
/five{500 0 31 -14 438 688 sc
438 681 m
402 596 l
398 587 389 583 375 583 c
181 583 l
141 498 l
214 484 267 469 300 452 c
333 436 363 409 391 370 c
414 338 426 296 426 243 c
426 195 418 155 402 122 c
387 89 362 60 328 35 c
283 2 226 -14 158 -14 c
120 -14 89 -8 66 3 c
43 14 31 29 31 48 c
31 73 46 86 76 86 c
100 86 125 76 150 55 c
176 34 200 23 221 23 c
256 23 287 40 314 75 c
342 110 356 149 356 192 c
356 256 334 306 289 342 c
231 389 160 412 76 412 c
68 412 64 415 64 420 c
65 425 l
174 662 l
381 662 l
392 662 401 664 407 667 c
414 670 421 677 429 688 c
438 681 l

ce} _d
/A{722 0 15 0 707 674 sc
707 0 m
452 0 l
452 19 l
479 19 497 22 507 28 c
516 33 521 41 521 52 c
521 69 515 93 502 122 c
461 216 l
199 216 l
153 102 l
147 87 144 73 144 60 c
144 45 149 34 160 28 c
171 22 189 19 214 19 c
214 0 l
15 0 l
15 19 l
43 22 63 32 76 49 c
89 67 110 113 141 186 c
347 674 l
367 674 l
613 111 l
628 76 641 53 652 41 c
664 29 682 22 707 19 c
707 0 l

447 257 m
331 532 l
216 257 l
447 257 l

ce} _d
/B{667 0 17 0 593 662 sc
422 349 m
422 348 l
472 340 513 322 544 293 c
577 264 593 225 593 178 c
593 123 571 79 528 47 c
485 16 427 0 354 0 c
17 0 l
17 19 l
56 20 82 27 94 38 c
107 50 113 75 113 113 c
113 550 l
113 589 107 613 96 623 c
85 634 58 640 17 643 c
17 662 l
297 662 l
383 662 448 647 492 618 c
537 589 559 548 559 495 c
559 450 545 415 518 391 c
499 374 467 360 422 349 c

215 366 m
307 366 l
407 366 457 407 457 490 c
457 533 442 566 412 589 c
383 613 339 625 280 625 c
239 625 l
223 625 215 614 215 593 c
215 366 l

215 326 m
215 82 l
215 65 219 54 228 47 c
237 40 254 37 277 37 c
322 37 356 39 377 44 c
398 49 419 61 440 80 c
465 102 478 135 478 179 c
478 230 462 265 431 286 c
424 291 416 296 409 299 c
402 303 395 306 389 308 c
384 311 376 313 367 315 c
358 317 350 318 345 319 c
340 320 332 321 319 322 c
306 323 297 323 291 323 c
285 324 273 324 255 325 c
238 326 224 326 215 326 c

ce} _d
/C{667 0 28 -14 633 676 sc
614 131 m
633 113 l
574 28 483 -14 360 -14 c
263 -14 185 16 124 75 c
60 138 28 221 28 325 c
28 422 58 505 118 572 c
181 641 262 676 361 676 c
404 676 443 671 480 661 c
522 649 545 643 549 643 c
571 643 585 654 591 676 c
611 676 l
620 449 l
597 449 l
586 497 569 534 545 560 c
498 611 444 636 384 636 c
310 636 251 609 208 554 c
165 500 144 429 144 341 c
144 234 168 154 216 102 c
261 54 320 30 394 30 c
438 30 476 38 508 53 c
540 68 575 94 614 131 c

ce} _d
/G{722 0 32 -14 709 676 sc
709 354 m
709 336 l
680 333 661 327 652 318 c
643 309 639 288 639 256 c
639 56 l
582 9 497 -14 385 -14 c
333 -14 283 -5 235 14 c
188 33 148 59 115 93 c
60 151 32 229 32 327 c
32 438 68 525 139 590 c
202 647 281 676 378 676 c
421 676 465 668 511 653 c
529 646 544 643 555 643 c
566 643 575 646 583 652 c
591 659 597 667 600 676 c
622 676 l
630 465 l
607 465 l
586 517 562 556 536 581 c
497 618 449 636 390 636 c
323 636 268 613 223 567 c
172 516 146 435 146 324 c
146 232 170 159 218 106 c
266 53 330 26 409 26 c
447 26 479 32 504 44 c
529 56 542 70 542 87 c
542 244 l
542 283 537 307 527 316 c
518 326 493 333 453 336 c
453 354 l
709 354 l

ce} _d
/I{333 0 18 0 315 662 sc
315 0 m
18 0 l
18 19 l
60 20 87 26 98 37 c
109 48 115 73 115 112 c
115 551 l
115 590 110 614 99 624 c
88 634 61 640 18 643 c
18 662 l
315 662 l
315 643 l
273 641 246 635 234 624 c
223 613 217 589 217 551 c
217 112 l
217 75 223 50 235 38 c
247 27 274 20 315 19 c
315 0 l

ce} _d
/L{611 0 12 0 598 662 sc
598 174 m
550 0 l
12 0 l
12 19 l
49 21 72 28 83 40 c
94 52 99 77 99 115 c
99 546 l
99 585 94 611 84 622 c
75 633 51 640 12 643 c
12 662 l
295 662 l
295 643 l
254 640 228 633 217 622 c
206 611 201 587 201 548 c
201 84 l
201 65 207 53 218 47 c
230 42 254 39 291 39 c
361 39 l
442 39 498 59 530 100 c
543 118 557 143 572 174 c
598 174 l

ce} _d
/P{557 0 16 0 542 662 sc
16 662 m
275 662 l
370 662 442 641 492 599 c
525 571 542 531 542 480 c
542 427 523 383 485 349 c
457 324 428 307 399 299 c
370 292 327 288 271 288 c
252 288 229 289 202 291 c
202 112 l
202 74 207 49 218 38 c
229 27 255 21 296 19 c
296 0 l
16 0 l
16 19 l
55 22 78 29 87 40 c
96 51 100 79 100 122 c
100 551 l
100 588 95 612 85 623 c
76 634 53 640 16 643 c
16 662 l

202 589 m
202 331 l
225 329 245 328 263 328 c
317 328 359 341 388 367 c
418 394 433 430 433 475 c
433 529 418 567 387 590 c
356 613 306 625 237 625 c
223 625 214 622 209 617 c
204 612 202 603 202 589 c

ce} _d
/S{556 0 43 -14 491 676 sc
469 463 m
444 463 l
433 504 419 536 403 557 c
362 609 314 635 258 635 c
227 635 203 626 184 608 c
166 591 157 568 157 540 c
157 527 160 514 167 501 c
174 488 181 477 188 468 c
196 459 210 448 229 435 c
248 422 264 411 276 404 c
288 397 308 386 336 369 c
390 338 429 306 454 275 c
479 244 491 210 491 173 c
491 118 472 73 433 38 c
394 3 346 -14 287 -14 c
244 -14 204 -6 169 9 c
152 16 136 20 122 20 c
114 20 107 17 102 11 c
97 5 94 -3 94 -13 c
72 -13 l
43 199 l
65 199 l
110 81 178 22 271 22 c
306 22 335 32 357 53 c
379 74 390 101 390 134 c
390 165 380 192 361 213 c
329 248 273 286 193 329 c
112 372 71 430 71 501 c
71 554 87 597 120 628 c
153 660 194 676 245 676 c
280 676 315 669 350 654 c
368 646 383 642 394 642 c
411 642 422 653 426 676 c
447 676 l
469 463 l

ce} _d
/T{611 0 17 0 593 662 sc
593 492 m
569 492 l
558 547 543 582 524 597 c
505 612 468 620 415 620 c
356 620 l
356 111 l
356 73 362 49 373 38 c
384 27 411 21 452 19 c
452 0 l
160 0 l
160 19 l
202 22 228 29 238 40 c
249 51 254 79 254 123 c
254 620 l
194 620 l
140 620 103 612 84 596 c
65 581 51 546 41 492 c
17 492 l
24 662 l
586 662 l
593 492 l

ce} _d
/U{722 0 14 -14 705 662 sc
705 662 m
705 643 l
664 639 638 629 627 613 c
616 598 611 565 611 516 c
611 261 l
611 210 607 169 600 140 c
593 111 578 84 557 59 c
514 10 447 -14 355 -14 c
282 -14 226 1 185 32 c
131 72 104 144 104 249 c
104 559 l
104 592 99 614 88 624 c
78 634 53 640 14 643 c
14 662 l
297 662 l
297 643 l
257 640 232 632 221 621 c
211 610 206 586 206 549 c
206 237 l
206 194 209 160 214 137 c
219 114 231 93 250 75 c
281 45 324 30 378 30 c
445 30 496 50 530 89 c
545 108 555 128 560 150 c
565 173 567 206 567 250 c
567 513 l
567 565 561 599 550 615 c
539 631 513 640 473 643 c
473 662 l
705 662 l

ce} _d
/bracketleft{333 0 88 -156 299 662 sc
299 -156 m
88 -156 l
88 662 l
299 662 l
299 637 l
216 637 l
199 637 186 633 177 626 c
168 619 164 606 164 589 c
164 -77 l
164 -113 181 -131 216 -131 c
299 -131 l
299 -156 l

ce} _d
/bracketright{333 0 34 -156 245 662 sc
245 -156 m
34 -156 l
34 -131 l
122 -131 l
139 -131 151 -127 158 -120 c
165 -113 169 -101 169 -85 c
169 583 l
169 619 152 637 118 637 c
34 637 l
34 662 l
245 662 l
245 -156 l

ce} _d
/a{444 0 37 -10 442 460 sc
442 66 m
442 38 l
417 6 387 -10 352 -10 c
314 -10 293 14 288 63 c
287 63 l
244 14 196 -10 142 -10 c
111 -10 85 -1 66 17 c
47 36 37 61 37 94 c
37 141 60 180 107 211 c
139 232 199 259 287 292 c
287 346 l
287 376 280 398 265 413 c
251 428 232 436 209 436 c
189 436 172 431 159 421 c
146 412 139 400 139 387 c
139 381 140 374 142 367 c
144 360 145 352 145 345 c
145 335 140 326 131 317 c
122 308 112 304 99 304 c
88 304 78 308 69 317 c
60 326 56 337 56 350 c
56 382 73 409 107 430 c
138 450 177 460 222 460 c
276 460 315 445 340 415 c
352 401 360 387 363 372 c
366 358 368 335 368 304 c
368 113 l
368 69 378 47 399 47 c
412 47 427 53 442 66 c

287 127 m
287 268 l
226 247 183 225 159 202 c
136 181 125 156 125 125 c
125 100 131 80 144 67 c
157 54 173 48 194 48 c
216 48 235 53 252 64 c
266 74 275 83 280 92 c
285 101 287 112 287 127 c

ce} _d
/d{500 0 27 -10 491 683 sc
491 42 m
344 -10 l
340 -7 l
340 57 l
308 12 265 -10 212 -10 c
157 -10 112 10 78 49 c
44 89 27 141 27 205 c
27 276 47 336 88 385 c
129 435 178 460 235 460 c
271 460 306 446 340 417 c
340 573 l
340 594 337 607 331 614 c
325 621 313 624 294 624 c
285 624 277 624 272 623 c
272 639 l
333 655 382 670 419 683 c
424 681 l
424 114 l
424 91 427 75 432 68 c
438 61 450 57 468 57 c
472 57 480 57 491 58 c
491 42 l

340 102 m
340 332 l
340 359 330 382 309 402 c
289 422 265 432 238 432 c
200 432 170 415 147 381 c
124 347 113 302 113 245 c
113 184 125 134 150 97 c
175 60 209 42 251 42 c
282 42 307 53 325 74 c
335 85 340 95 340 102 c

ce} _d
/e{444 0 25 -10 424 460 sc
408 164 m
424 157 l
384 46 314 -10 215 -10 c
156 -10 110 10 76 51 c
42 92 25 148 25 217 c
25 288 44 347 82 392 c
120 437 170 460 232 460 c
292 460 338 437 371 391 c
390 364 402 326 405 277 c
97 277 l
100 235 104 203 109 181 c
115 159 126 137 143 114 c
171 77 208 59 254 59 c
287 59 314 67 336 83 c
359 99 383 126 408 164 c

99 309 m
303 309 l
297 351 287 381 273 398 c
260 415 237 424 205 424 c
177 424 154 414 135 394 c
116 375 104 346 99 309 c

ce} _d
/i{278 0 16 0 253 683 sc
180 632 m
180 617 175 605 165 595 c
155 586 143 581 128 581 c
114 581 102 586 92 595 c
83 605 78 617 78 632 c
78 646 83 658 93 668 c
103 678 115 683 129 683 c
144 683 156 678 165 668 c
175 658 180 646 180 632 c

253 0 m
16 0 l
16 15 l
51 17 72 23 81 33 c
90 43 95 67 95 104 c
95 331 l
95 354 93 371 88 380 c
83 389 75 394 62 394 c
46 394 32 392 20 389 c
20 405 l
175 460 l
179 456 l
179 105 l
179 68 183 44 191 34 c
200 24 220 18 253 15 c
253 0 l

ce} _d
/l{278 0 19 0 257 683 sc
257 0 m
21 0 l
21 15 l
52 18 73 24 83 34 c
93 45 98 64 98 92 c
98 561 l
98 585 95 602 89 611 c
83 620 72 625 56 625 c
42 625 30 624 19 623 c
19 639 l
82 654 135 669 177 683 c
182 679 l
182 87 l
182 59 187 40 196 31 c
205 22 226 17 257 15 c
257 0 l

ce} _d
/m{778 0 16 0 775 460 sc
775 0 m
557 0 l
557 15 l
585 18 603 23 610 32 c
618 41 622 61 622 90 c
622 296 l
622 336 616 365 604 382 c
593 399 573 408 545 408 c
522 408 502 403 485 394 c
469 385 453 369 438 347 c
438 95 l
438 63 443 42 452 31 c
462 21 481 16 510 15 c
510 0 l
286 0 l
286 15 l
315 17 334 22 342 29 c
350 37 354 56 354 86 c
354 297 l
354 371 332 408 289 408 c
270 408 250 404 229 395 c
208 387 193 377 183 365 c
174 355 170 349 170 348 c
170 70 l
170 49 175 34 184 27 c
193 20 211 16 238 15 c
238 0 l
16 0 l
16 15 l
44 16 63 21 72 30 c
81 40 86 59 86 88 c
86 336 l
86 361 83 378 78 387 c
73 397 64 402 51 402 c
41 402 30 401 19 398 c
19 415 l
64 428 111 443 158 460 c
166 457 l
166 383 l
168 383 l
198 414 224 435 247 445 c
270 455 295 460 321 460 c
374 460 409 432 427 376 c
479 432 533 460 590 460 c
667 460 706 400 706 280 c
706 77 l
706 55 709 40 716 31 c
723 23 734 18 749 17 c
775 15 l
775 0 l

ce} _d
/n{500 0 16 0 485 460 sc
485 0 m
277 0 l
278 15 l
303 17 319 24 327 36 c
336 49 340 72 340 105 c
340 304 l
340 371 316 405 267 405 c
250 405 235 401 220 393 c
205 385 187 370 164 348 c
164 72 l
164 52 168 38 177 30 c
186 22 204 17 229 15 c
229 0 l
18 0 l
18 15 l
43 17 60 23 68 33 c
76 44 80 64 80 94 c
80 337 l
80 362 78 379 73 388 c
68 397 59 402 45 402 c
32 402 22 401 16 398 c
16 415 l
63 428 108 443 153 460 c
161 457 l
161 379 l
162 379 l
209 433 257 460 306 460 c
344 460 373 447 393 420 c
414 393 424 355 424 306 c
424 85 l
424 58 428 41 436 32 c
444 23 460 18 485 15 c
485 0 l

ce} _d
/o{500 0 29 -10 470 460 sc
470 231 m
470 161 449 103 407 58 c
366 13 312 -10 245 -10 c
184 -10 132 12 91 57 c
50 102 29 159 29 228 c
29 297 50 353 91 396 c
132 439 187 460 254 460 c
316 460 367 439 408 396 c
449 354 470 299 470 231 c

380 204 m
380 280 363 339 330 382 c
303 415 272 432 235 432 c
200 432 172 418 151 389 c
130 361 119 322 119 273 c
119 188 137 119 172 68 c
195 35 225 18 262 18 c
299 18 327 34 348 67 c
369 100 380 146 380 204 c

ce} _d
/p{500 0 5 -217 470 460 sc
159 458 m
159 381 l
201 434 249 460 303 460 c
352 460 392 440 423 400 c
454 360 470 309 470 247 c
470 174 450 113 409 64 c
369 15 319 -10 260 -10 c
239 -10 222 -7 207 -1 c
193 5 177 16 159 33 c
159 -124 l
159 -155 164 -175 175 -184 c
186 -193 210 -198 247 -199 c
247 -217 l
5 -217 l
5 -200 l
34 -197 53 -192 62 -183 c
71 -174 75 -157 75 -131 c
75 337 l
75 360 72 376 67 383 c
62 390 51 394 34 394 c
23 394 15 394 9 393 c
9 409 l
56 423 104 440 153 460 c
159 458 l

159 334 m
159 88 l
159 73 170 59 193 44 c
216 29 240 22 263 22 c
299 22 328 39 350 73 c
373 107 384 152 384 207 c
384 266 373 312 350 347 c
328 382 298 400 261 400 c
238 400 215 393 192 378 c
170 363 159 349 159 334 c

ce} _d
/r{333 0 5 0 335 460 sc
160 458 m
160 366 l
185 402 206 427 223 440 c
240 453 259 460 280 460 c
297 460 311 455 320 446 c
330 437 335 424 335 407 c
335 393 331 382 324 374 c
317 366 308 362 296 362 c
283 362 270 369 256 382 c
245 392 237 397 230 397 c
216 397 201 387 184 368 c
168 349 160 331 160 315 c
160 90 l
160 61 166 42 177 32 c
188 22 211 16 245 15 c
245 0 l
5 0 l
5 15 l
37 21 57 28 64 35 c
72 42 76 59 76 84 c
76 334 l
76 356 73 371 68 380 c
63 389 55 394 42 394 c
31 394 20 393 7 390 c
7 406 l
49 419 98 437 155 460 c
160 458 l

ce} _d
/s{389 0 51 -10 348 459 sc
156 301 m
260 238 l
293 218 316 199 329 182 c
342 165 348 142 348 115 c
348 82 334 52 306 27 c
279 2 246 -10 208 -10 c
177 -10 152 -7 135 -1 c
117 5 102 8 89 8 c
78 8 70 4 65 -4 c
52 -4 l
52 153 l
68 153 l
79 104 94 69 114 46 c
134 23 161 12 195 12 c
220 12 240 19 255 33 c
270 47 278 65 278 86 c
278 117 260 142 225 161 c
171 191 l
91 236 51 284 51 336 c
51 375 63 405 88 426 c
113 448 147 459 189 459 c
218 459 241 455 256 448 c
268 443 277 440 284 440 c
289 440 294 443 300 450 c
311 450 l
316 314 l
301 314 l
290 359 275 391 258 409 c
241 428 218 437 188 437 c
165 437 147 431 133 420 c
120 409 113 392 113 369 c
113 358 117 345 124 332 c
132 319 143 309 156 301 c

ce} _d
/t{278 0 13 -10 279 579 sc
266 77 m
279 66 l
247 15 207 -10 158 -10 c
99 -10 70 32 70 117 c
70 418 l
17 418 l
14 420 13 422 13 425 c
13 430 19 437 30 444 c
55 459 88 494 127 551 c
128 553 131 557 136 563 c
141 570 145 575 147 579 c
152 579 154 575 154 566 c
154 450 l
255 450 l
255 418 l
154 418 l
154 132 l
154 100 158 77 166 63 c
174 49 187 42 206 42 c
226 42 246 54 266 77 c

ce} _d
/v{500 0 19 -14 477 450 sc
477 450 m
477 435 l
462 434 450 429 443 420 c
436 411 425 390 412 357 c
284 36 l
271 3 261 -14 256 -14 c
251 -14 245 -5 238 12 c
237 14 235 17 234 22 c
233 27 231 30 230 33 c
110 320 l
89 371 73 402 63 414 c
53 427 38 434 19 435 c
19 450 l
215 450 l
215 435 l
198 434 186 431 179 427 c
172 423 169 417 169 408 c
169 397 172 385 178 370 c
280 114 l
379 373 l
383 383 385 393 385 403 c
385 422 369 432 338 435 c
338 450 l
477 450 l

ce} _d
end readonly def

/BuildGlyph {
 exch begin
 CharStrings exch
 2 copy known not {pop /.notdef} if
 true 3 1 roll get exec
 end
} _d

/BuildChar {
 1 index /Encoding get exch get
 1 index /BuildGlyph get exec
} _d

FontName currentdict end definefont pop
%!PS-Adobe-3.0 Resource-Font
%%Creator: Converted from TrueType to Type 3 by Matplotlib.
10 dict begin
/FontName /STIXGeneral-Italic def
/PaintType 0 def
/FontMatrix [0.001 0 0 0.001 0 0] def
/FontBBox [-970 -305 1429 1023] def
/FontType 3 def
/Encoding [/uni2113] def
/CharStrings 2 dict dup begin
/.notdef 0 def
/uni2113{579 0 48 -11 571 687 sc
77 389 m
91 415 l
115 398 146 390 185 390 c
242 473 300 544 359 601 c
419 658 468 687 507 687 c
550 687 571 665 571 620 c
571 566 539 512 474 459 c
410 406 335 373 249 360 c
154 206 106 107 106 62 c
106 33 118 19 142 19 c
164 19 189 32 218 57 c
247 82 288 125 341 186 c
362 169 l
305 103 261 56 228 29 c
196 2 165 -11 135 -11 c
110 -11 90 -4 73 11 c
56 26 48 48 48 76 c
48 132 74 205 125 294 c
133 309 146 331 165 360 c
132 361 103 371 77 389 c

268 396 m
269 395 l
347 412 412 443 463 486 c
515 530 541 576 541 624 c
541 645 529 655 506 655 c
481 655 454 639 424 608 c
385 569 333 498 268 396 c

ce} _d
end readonly def

/BuildGlyph {
 exch begin
 CharStrings exch
 2 copy known not {pop /.notdef} if
 true 3 1 roll get exec
 end
} _d

/BuildChar {
 1 index /Encoding get exch get
 1 index /BuildGlyph get exec
} _d

FontName currentdict end definefont pop
end
%%EndProlog
mpldict begin
-14.391 236.348 translate
640.783 319.304 0 0 clipbox
gsave
0 0 m
640.782697 0 l
640.782697 319.30375 l
0 319.30375 l
cl
1.000 setgray
fill
grestore
gsave
54.2 80.11 m
204.189817 80.11 l
204.189817 307.408438 l
54.2 307.408438 l
cl
1.000 setgray
fill
grestore
0.800 setlinewidth
1 setlinejoin
2 setlinecap
[] 0 setdash
0.690 setgray
gsave
149.99 227.298 54.2 80.11 clipbox
61.017719 80.11 m
61.017719 307.408438 l
stroke
grestore
0 setlinecap
0.000 setgray
gsave
/o {
gsave
newpath
translate
0.8 setlinewidth
1 setlinejoin

0 setlinecap

0 0 m
0 -3.5 l

gsave
0.000 setgray
fill
grestore
stroke
grestore
} bind def
61.0177 80.11 o
grestore
/STIXGeneral-Regular 12.000 selectfont
gsave

58.017719 64.906875 translate
0.000000 rotate
0.000000 0 m /zero glyphshow
grestore
2 setlinecap
0.690 setgray
gsave
149.99 227.298 54.2 80.11 clipbox
89.424881 80.11 m
89.424881 307.408438 l
stroke
grestore
0 setlinecap
0.000 setgray
gsave
/o {
gsave
newpath
translate
0.8 setlinewidth
1 setlinejoin

0 setlinecap

0 0 m
0 -3.5 l

gsave
0.000 setgray
fill
grestore
stroke
grestore
} bind def
89.4249 80.11 o
grestore
gsave

86.424881 64.906875 translate
0.000000 rotate
0.000000 0 m /five glyphshow
grestore
2 setlinecap
0.690 setgray
gsave
149.99 227.298 54.2 80.11 clipbox
117.832044 80.11 m
117.832044 307.408438 l
stroke
grestore
0 setlinecap
0.000 setgray
gsave
/o {
gsave
newpath
translate
0.8 setlinewidth
1 setlinejoin

0 setlinecap

0 0 m
0 -3.5 l

gsave
0.000 setgray
fill
grestore
stroke
grestore
} bind def
117.832 80.11 o
grestore
gsave

111.832044 64.906875 translate
0.000000 rotate
0.000000 0 m /one glyphshow
5.999985 0 m /zero glyphshow
grestore
2 setlinecap
0.690 setgray
gsave
149.99 227.298 54.2 80.11 clipbox
146.239206 80.11 m
146.239206 307.408438 l
stroke
grestore
0 setlinecap
0.000 setgray
gsave
/o {
gsave
newpath
translate
0.8 setlinewidth
1 setlinejoin

0 setlinecap

0 0 m
0 -3.5 l

gsave
0.000 setgray
fill
grestore
stroke
grestore
} bind def
146.239 80.11 o
grestore
gsave

140.239206 64.906875 translate
0.000000 rotate
0.000000 0 m /one glyphshow
5.999985 0 m /five glyphshow
grestore
2 setlinecap
0.690 setgray
gsave
149.99 227.298 54.2 80.11 clipbox
174.646368 80.11 m
174.646368 307.408438 l
stroke
grestore
0 setlinecap
0.000 setgray
gsave
/o {
gsave
newpath
translate
0.8 setlinewidth
1 setlinejoin

0 setlinecap

0 0 m
0 -3.5 l

gsave
0.000 setgray
fill
grestore
stroke
grestore
} bind def
174.646 80.11 o
grestore
gsave

168.646368 64.906875 translate
0.000000 rotate
0.000000 0 m /two glyphshow
5.999985 0 m /zero glyphshow
grestore
2 setlinecap
0.690 setgray
gsave
149.99 227.298 54.2 80.11 clipbox
203.053531 80.11 m
203.053531 307.408438 l
stroke
grestore
0 setlinecap
0.000 setgray
gsave
/o {
gsave
newpath
translate
0.8 setlinewidth
1 setlinejoin

0 setlinecap

0 0 m
0 -3.5 l

gsave
0.000 setgray
fill
grestore
stroke
grestore
} bind def
203.054 80.11 o
grestore
gsave

197.053531 64.906875 translate
0.000000 rotate
0.000000 0 m /two glyphshow
5.999985 0 m /five glyphshow
grestore
/STIXGeneral-Regular 14.000 selectfont
gsave

105.866784 48.735000 translate
0.000000 rotate
0.000000 0 m /i glyphshow
3.891998 0 m /t glyphshow
7.783997 0 m /e glyphshow
13.999985 0 m /r glyphshow
18.661972 0 m /a glyphshow
24.877960 0 m /t glyphshow
28.769958 0 m /i glyphshow
32.661957 0 m /o glyphshow
39.661957 0 m /n glyphshow
grestore
2 setlinecap
0.690 setgray
gsave
149.99 227.298 54.2 80.11 clipbox
54.2 164.804414 m
204.189817 164.804414 l
stroke
grestore
0 setlinecap
0.000 setgray
gsave
/o {
gsave
newpath
translate
0.8 setlinewidth
1 setlinejoin

0 setlinecap

-0 0 m
-3.5 0 l

gsave
0.000 setgray
fill
grestore
stroke
grestore
} bind def
54.2 164.804 o
grestore
gsave
24.200000 160.109101 translate
0.000000 rotate
/STIXGeneral-Regular 12.0 selectfont
0.000000 0.998438 moveto
/one glyphshow
5.999985 0.998438 moveto
/zero glyphshow
/STIXGeneral-Regular 8.399999999999999 selectfont
12.189188 5.323438 moveto
/minus glyphshow
17.943178 5.323438 moveto
/three glyphshow
grestore
2 setlinecap
0.690 setgray
gsave
149.99 227.298 54.2 80.11 clipbox
54.2 307.408438 m
204.189817 307.408438 l
stroke
grestore
0 setlinecap
0.000 setgray
gsave
/o {
gsave
newpath
translate
0.8 setlinewidth
1 setlinejoin

0 setlinecap

-0 0 m
-3.5 0 l

gsave
0.000 setgray
fill
grestore
stroke
grestore
} bind def
54.2 307.408 o
grestore
gsave
24.200000 302.713125 translate
0.000000 rotate
/STIXGeneral-Regular 12.0 selectfont
0.000000 0.998438 moveto
/one glyphshow
5.999985 0.998438 moveto
/zero glyphshow
/STIXGeneral-Regular 8.399999999999999 selectfont
12.189188 5.323438 moveto
/minus glyphshow
17.943178 5.323438 moveto
/two glyphshow
grestore
2 setlinecap
0.690 setgray
gsave
149.99 227.298 54.2 80.11 clipbox
54.2 90.239801 m
204.189817 90.239801 l
stroke
grestore
0.600 setlinewidth
0 setlinecap
0.000 setgray
gsave
/o {
gsave
newpath
translate
0.6 setlinewidth
1 setlinejoin

0 setlinecap

-0 0 m
-2 0 l

gsave
0.000 setgray
fill
grestore
stroke
grestore
} bind def
54.2 90.2398 o
grestore
0.800 setlinewidth
2 setlinecap
0.690 setgray
gsave
149.99 227.298 54.2 80.11 clipbox
54.2 108.056568 m
204.189817 108.056568 l
stroke
grestore
0.600 setlinewidth
0 setlinecap
0.000 setgray
gsave
/o {
gsave
newpath
translate
0.6 setlinewidth
1 setlinejoin

0 setlinecap

-0 0 m
-2 0 l

gsave
0.000 setgray
fill
grestore
stroke
grestore
} bind def
54.2 108.057 o
grestore
0.800 setlinewidth
2 setlinecap
0.690 setgray
gsave
149.99 227.298 54.2 80.11 clipbox
54.2 121.876325 m
204.189817 121.876325 l
stroke
grestore
0.600 setlinewidth
0 setlinecap
0.000 setgray
gsave
/o {
gsave
newpath
translate
0.6 setlinewidth
1 setlinejoin

0 setlinecap

-0 0 m
-2 0 l

gsave
0.000 setgray
fill
grestore
stroke
grestore
} bind def
54.2 121.876 o
grestore
0.800 setlinewidth
2 setlinecap
0.690 setgray
gsave
149.99 227.298 54.2 80.11 clipbox
54.2 133.16789 m
204.189817 133.16789 l
stroke
grestore
0.600 setlinewidth
0 setlinecap
0.000 setgray
gsave
/o {
gsave
newpath
translate
0.6 setlinewidth
1 setlinejoin

0 setlinecap

-0 0 m
-2 0 l

gsave
0.000 setgray
fill
grestore
stroke
grestore
} bind def
54.2 133.168 o
grestore
0.800 setlinewidth
2 setlinecap
0.690 setgray
gsave
149.99 227.298 54.2 80.11 clipbox
54.2 142.714771 m
204.189817 142.714771 l
stroke
grestore
0.600 setlinewidth
0 setlinecap
0.000 setgray
gsave
/o {
gsave
newpath
translate
0.6 setlinewidth
1 setlinejoin

0 setlinecap

-0 0 m
-2 0 l

gsave
0.000 setgray
fill
grestore
stroke
grestore
} bind def
54.2 142.715 o
grestore
0.800 setlinewidth
2 setlinecap
0.690 setgray
gsave
149.99 227.298 54.2 80.11 clipbox
54.2 150.984656 m
204.189817 150.984656 l
stroke
grestore
0.600 setlinewidth
0 setlinecap
0.000 setgray
gsave
/o {
gsave
newpath
translate
0.6 setlinewidth
1 setlinejoin

0 setlinecap

-0 0 m
-2 0 l

gsave
0.000 setgray
fill
grestore
stroke
grestore
} bind def
54.2 150.985 o
grestore
0.800 setlinewidth
2 setlinecap
0.690 setgray
gsave
149.99 227.298 54.2 80.11 clipbox
54.2 158.279212 m
204.189817 158.279212 l
stroke
grestore
0.600 setlinewidth
0 setlinecap
0.000 setgray
gsave
/o {
gsave
newpath
translate
0.6 setlinewidth
1 setlinejoin

0 setlinecap

-0 0 m
-2 0 l

gsave
0.000 setgray
fill
grestore
stroke
grestore
} bind def
54.2 158.279 o
grestore
0.800 setlinewidth
2 setlinecap
0.690 setgray
gsave
149.99 227.298 54.2 80.11 clipbox
54.2 207.732503 m
204.189817 207.732503 l
stroke
grestore
0.600 setlinewidth
0 setlinecap
0.000 setgray
gsave
/o {
gsave
newpath
translate
0.6 setlinewidth
1 setlinejoin

0 setlinecap

-0 0 m
-2 0 l

gsave
0.000 setgray
fill
grestore
stroke
grestore
} bind def
54.2 207.733 o
grestore
0.800 setlinewidth
2 setlinecap
0.690 setgray
gsave
149.99 227.298 54.2 80.11 clipbox
54.2 232.843825 m
204.189817 232.843825 l
stroke
grestore
0.600 setlinewidth
0 setlinecap
0.000 setgray
gsave
/o {
gsave
newpath
translate
0.6 setlinewidth
1 setlinejoin

0 setlinecap

-0 0 m
-2 0 l

gsave
0.000 setgray
fill
grestore
stroke
grestore
} bind def
54.2 232.844 o
grestore
0.800 setlinewidth
2 setlinecap
0.690 setgray
gsave
149.99 227.298 54.2 80.11 clipbox
54.2 250.660591 m
204.189817 250.660591 l
stroke
grestore
0.600 setlinewidth
0 setlinecap
0.000 setgray
gsave
/o {
gsave
newpath
translate
0.6 setlinewidth
1 setlinejoin

0 setlinecap

-0 0 m
-2 0 l

gsave
0.000 setgray
fill
grestore
stroke
grestore
} bind def
54.2 250.661 o
grestore
0.800 setlinewidth
2 setlinecap
0.690 setgray
gsave
149.99 227.298 54.2 80.11 clipbox
54.2 264.480349 m
204.189817 264.480349 l
stroke
grestore
0.600 setlinewidth
0 setlinecap
0.000 setgray
gsave
/o {
gsave
newpath
translate
0.6 setlinewidth
1 setlinejoin

0 setlinecap

-0 0 m
-2 0 l

gsave
0.000 setgray
fill
grestore
stroke
grestore
} bind def
54.2 264.48 o
grestore
0.800 setlinewidth
2 setlinecap
0.690 setgray
gsave
149.99 227.298 54.2 80.11 clipbox
54.2 275.771913 m
204.189817 275.771913 l
stroke
grestore
0.600 setlinewidth
0 setlinecap
0.000 setgray
gsave
/o {
gsave
newpath
translate
0.6 setlinewidth
1 setlinejoin

0 setlinecap

-0 0 m
-2 0 l

gsave
0.000 setgray
fill
grestore
stroke
grestore
} bind def
54.2 275.772 o
grestore
0.800 setlinewidth
2 setlinecap
0.690 setgray
gsave
149.99 227.298 54.2 80.11 clipbox
54.2 285.318795 m
204.189817 285.318795 l
stroke
grestore
0.600 setlinewidth
0 setlinecap
0.000 setgray
gsave
/o {
gsave
newpath
translate
0.6 setlinewidth
1 setlinejoin

0 setlinecap

-0 0 m
-2 0 l

gsave
0.000 setgray
fill
grestore
stroke
grestore
} bind def
54.2 285.319 o
grestore
0.800 setlinewidth
2 setlinecap
0.690 setgray
gsave
149.99 227.298 54.2 80.11 clipbox
54.2 293.58868 m
204.189817 293.58868 l
stroke
grestore
0.600 setlinewidth
0 setlinecap
0.000 setgray
gsave
/o {
gsave
newpath
translate
0.6 setlinewidth
1 setlinejoin

0 setlinecap

-0 0 m
-2 0 l

gsave
0.000 setgray
fill
grestore
stroke
grestore
} bind def
54.2 293.589 o
grestore
0.800 setlinewidth
2 setlinecap
0.690 setgray
gsave
149.99 227.298 54.2 80.11 clipbox
54.2 300.883235 m
204.189817 300.883235 l
stroke
grestore
0.600 setlinewidth
0 setlinecap
0.000 setgray
gsave
/o {
gsave
newpath
translate
0.6 setlinewidth
1 setlinejoin

0 setlinecap

-0 0 m
-2 0 l

gsave
0.000 setgray
fill
grestore
stroke
grestore
} bind def
54.2 300.883 o
grestore
gsave
17.168750 131.259219 translate
90.000000 rotate
/STIXGeneral-Regular 14.0 selectfont
0.000000 0.375000 moveto
/s glyphshow
5.445999 0.375000 moveto
/o glyphshow
12.445999 0.375000 moveto
/l glyphshow
16.337997 0.375000 moveto
/v glyphshow
23.337997 0.375000 moveto
/e glyphshow
29.553986 0.375000 moveto
/r glyphshow
34.215973 0.375000 moveto
/space glyphshow
37.715973 0.375000 moveto
/e glyphshow
43.931961 0.375000 moveto
/r glyphshow
48.593948 0.375000 moveto
/r glyphshow
53.255936 0.375000 moveto
/o glyphshow
60.255936 0.375000 moveto
/r glyphshow
64.917923 0.375000 moveto
/space glyphshow
68.417923 0.375000 moveto
/parenleft glyphshow
/STIXGeneral-Italic 14.0 selectfont
73.079910 0.375000 moveto
/uni2113 glyphshow
/STIXGeneral-Regular 9.799999999999999 selectfont
81.185898 -1.476562 moveto
/two glyphshow
/STIXGeneral-Regular 14.0 selectfont
86.703085 0.375000 moveto
/space glyphshow
90.203085 0.375000 moveto
/n glyphshow
97.203085 0.375000 moveto
/o glyphshow
104.203085 0.375000 moveto
/r glyphshow
108.865073 0.375000 moveto
/m glyphshow
119.757071 0.375000 moveto
/parenright glyphshow
grestore
1.500 setlinewidth
[9.6 2.4 1.5 2.4] 0 setdash
0.122 0.467 0.706 setrgbcolor
gsave
149.99 227.298 54.2 80.11 clipbox
61.017719 287.123233 m
66.699151 228.602351 l
72.380584 272.047551 l
78.062016 223.791189 l
83.743449 171.021653 l
89.424881 193.871088 l
95.106314 182.759445 l
100.787746 151.809943 l
106.469179 162.218275 l
112.150611 146.693156 l
117.832044 146.827711 l
123.513476 134.911284 l
129.194909 140.066556 l
134.876341 124.702892 l
140.557774 122.892751 l
146.239206 118.940874 l
151.920639 115.386228 l
157.602071 116.19603 l
163.283503 108.747931 l
168.964936 99.952069 l
174.646368 146.580813 l
180.327801 98.380528 l
186.009233 92.605546 l
191.690666 95.246286 l
197.372098 89.967773 l
stroke
grestore
1.000 setlinewidth
[] 0 setdash
gsave
149.99 227.298 54.2 80.11 clipbox
/o {
gsave
newpath
translate
1.0 setlinewidth
1 setlinejoin

0 setlinecap

-2.5 -2.5 m
2.5 2.5 l
-2.5 2.5 m
2.5 -2.5 l

gsave
0.122 0.467 0.706 setrgbcolor
fill
grestore
stroke
grestore
} bind def
61.0177 287.123 o
66.6992 228.602 o
72.3806 272.048 o
78.062 223.791 o
83.7434 171.022 o
89.4249 193.871 o
95.1063 182.759 o
100.788 151.81 o
106.469 162.218 o
112.151 146.693 o
117.832 146.828 o
123.513 134.911 o
129.195 140.067 o
134.876 124.703 o
140.558 122.893 o
146.239 118.941 o
151.921 115.386 o
157.602 116.196 o
163.284 108.748 o
168.965 99.9521 o
174.646 146.581 o
180.328 98.3805 o
186.009 92.6055 o
191.691 95.2463 o
197.372 89.9678 o
grestore
1.500 setlinewidth
[9.6 2.4 1.5 2.4] 0 setdash
0.580 0.404 0.741 setrgbcolor
gsave
149.99 227.298 54.2 80.11 clipbox
61.017719 287.123233 m
66.699151 228.602351 l
72.380584 272.047551 l
78.062016 223.791206 l
83.743449 171.021608 l
89.424881 193.871158 l
95.106314 188.457797 l
100.787746 152.054227 l
106.469179 153.808749 l
112.150611 121.375921 l
117.832044 138.293727 l
123.513476 132.248436 l
129.194909 124.925317 l
134.876341 134.820016 l
140.557774 127.96911 l
146.239206 118.134511 l
151.920639 118.8272 l
157.602071 111.823911 l
163.283503 106.908231 l
168.964936 102.274754 l
174.646368 98.435657 l
180.327801 101.267094 l
186.009233 94.152468 l
191.690666 94.830661 l
197.372098 95.606394 l
stroke
grestore
1.000 setlinewidth
0 setlinejoin
[] 0 setdash
gsave
149.99 227.298 54.2 80.11 clipbox
/o {
gsave
newpath
translate
1.0 setlinewidth
0 setlinejoin

0 setlinecap

2.5 -0 m
-2.5 2.5 l
-2.5 -2.5 l
cl

gsave
0.580 0.404 0.741 setrgbcolor
fill
grestore
stroke
grestore
} bind def
61.0177 287.123 o
66.6992 228.602 o
72.3806 272.048 o
78.062 223.791 o
83.7434 171.022 o
89.4249 193.871 o
95.1063 188.458 o
100.788 152.054 o
106.469 153.809 o
112.151 121.376 o
117.832 138.294 o
123.513 132.248 o
129.195 124.925 o
134.876 134.82 o
140.558 127.969 o
146.239 118.135 o
151.921 118.827 o
157.602 111.824 o
163.284 106.908 o
168.965 102.275 o
174.646 98.4357 o
180.328 101.267 o
186.009 94.1525 o
191.691 94.8307 o
197.372 95.6064 o
grestore
1.500 setlinewidth
1 setlinejoin
2 setlinecap
1.000 0.498 0.055 setrgbcolor
gsave
149.99 227.298 54.2 80.11 clipbox
61.017719 287.123233 m
66.699151 228.602351 l
72.380584 272.047551 l
78.062016 223.79119 l
83.743449 171.02166 l
89.424881 193.877188 l
95.106314 151.402743 l
100.787746 163.054684 l
106.469179 157.802897 l
112.150611 138.168813 l
117.832044 148.592072 l
123.513476 127.853865 l
129.194909 126.602649 l
134.876341 132.764002 l
140.557774 124.831128 l
146.239206 126.725096 l
151.920639 111.651268 l
157.602071 112.987372 l
163.283503 112.867132 l
168.964936 133.405757 l
174.646368 112.552597 l
180.327801 108.761604 l
186.009233 95.542212 l
191.690666 93.473909 l
197.372098 94.671864 l
stroke
grestore
1.000 setlinewidth
0 setlinejoin
0 setlinecap
gsave
149.99 227.298 54.2 80.11 clipbox
/o {
gsave
newpath
translate
1.0 setlinewidth
0 setlinejoin

0 setlinecap

-0 -3.535534 m
2.12132 0 l
-0 3.535534 l
-2.12132 0 l
cl

gsave
1.000 0.498 0.055 setrgbcolor
fill
grestore
stroke
grestore
} bind def
61.0177 287.123 o
66.6992 228.602 o
72.3806 272.048 o
78.062 223.791 o
83.7434 171.022 o
89.4249 193.877 o
95.1063 151.403 o
100.788 163.055 o
106.469 157.803 o
112.151 138.169 o
117.832 148.592 o
123.513 127.854 o
129.195 126.603 o
134.876 132.764 o
140.558 124.831 o
146.239 126.725 o
151.921 111.651 o
157.602 112.987 o
163.284 112.867 o
168.965 133.406 o
174.646 112.553 o
180.328 108.762 o
186.009 95.5422 o
191.691 93.4739 o
197.372 94.6719 o
grestore
1.500 setlinewidth
1 setlinejoin
2 setlinecap
0.173 0.627 0.173 setrgbcolor
gsave
149.99 227.298 54.2 80.11 clipbox
61.017719 287.123233 m
66.699151 228.602351 l
72.380584 272.047553 l
78.062016 223.791248 l
83.743449 171.021505 l
89.424881 193.792686 l
95.106314 171.158454 l
100.787746 149.946766 l
106.469179 179.427071 l
112.150611 132.033243 l
117.832044 141.85249 l
123.513476 131.599575 l
129.194909 124.885491 l
134.876341 128.627995 l
140.557774 124.927331 l
stroke
grestore
1.000 setlinewidth
0 setlinecap
gsave
149.99 227.298 54.2 80.11 clipbox
/o {
gsave
newpath
translate
1.0 setlinewidth
1 setlinejoin

0 setlinecap

0 -1.5 m
0.397805 -1.5 0.77937 -1.341951 1.06066 -1.06066 c
1.341951 -0.77937 1.5 -0.397805 1.5 0 c
1.5 0.397805 1.341951 0.77937 1.06066 1.06066 c
0.77937 1.341951 0.397805 1.5 0 1.5 c
-0.397805 1.5 -0.77937 1.341951 -1.06066 1.06066 c
-1.341951 0.77937 -1.5 0.397805 -1.5 0 c
-1.5 -0.397805 -1.341951 -0.77937 -1.06066 -1.06066 c
-0.77937 -1.341951 -0.397805 -1.5 0 -1.5 c
cl

gsave
0.173 0.627 0.173 setrgbcolor
fill
grestore
stroke
grestore
} bind def
61.0177 287.123 o
66.6992 228.602 o
72.3806 272.048 o
78.062 223.791 o
83.7434 171.022 o
89.4249 193.793 o
95.1063 171.158 o
100.788 149.947 o
106.469 179.427 o
112.151 132.033 o
117.832 141.852 o
123.513 131.6 o
129.195 124.885 o
134.876 128.628 o
140.558 124.927 o
grestore
0.800 setlinewidth
0 setlinejoin
2 setlinecap
0.000 setgray
gsave
54.2 80.11 m
54.2 307.408438 l
stroke
grestore
gsave
204.189817 80.11 m
204.189817 307.408438 l
stroke
grestore
gsave
54.2 80.11 m
204.189817 80.11 l
stroke
grestore
gsave
54.2 307.408438 m
204.189817 307.408438 l
stroke
grestore
gsave
266.464583 80.11 m
416.454401 80.11 l
416.454401 307.408438 l
266.464583 307.408438 l
cl
1.000 setgray
fill
grestore
1 setlinejoin
0.690 setgray
gsave
149.99 227.298 266.465 80.11 clipbox
273.282302 80.11 m
273.282302 307.408438 l
stroke
grestore
0 setlinecap
0.000 setgray
gsave
/o {
gsave
newpath
translate
0.8 setlinewidth
1 setlinejoin

0 setlinecap

0 0 m
0 -3.5 l

gsave
0.000 setgray
fill
grestore
stroke
grestore
} bind def
273.282 80.11 o
grestore
/STIXGeneral-Regular 12.000 selectfont
gsave

270.282302 64.906875 translate
0.000000 rotate
0.000000 0 m /zero glyphshow
grestore
2 setlinecap
0.690 setgray
gsave
149.99 227.298 266.465 80.11 clipbox
301.689465 80.11 m
301.689465 307.408438 l
stroke
grestore
0 setlinecap
0.000 setgray
gsave
/o {
gsave
newpath
translate
0.8 setlinewidth
1 setlinejoin

0 setlinecap

0 0 m
0 -3.5 l

gsave
0.000 setgray
fill
grestore
stroke
grestore
} bind def
301.689 80.11 o
grestore
gsave

298.689465 64.906875 translate
0.000000 rotate
0.000000 0 m /five glyphshow
grestore
2 setlinecap
0.690 setgray
gsave
149.99 227.298 266.465 80.11 clipbox
330.096627 80.11 m
330.096627 307.408438 l
stroke
grestore
0 setlinecap
0.000 setgray
gsave
/o {
gsave
newpath
translate
0.8 setlinewidth
1 setlinejoin

0 setlinecap

0 0 m
0 -3.5 l

gsave
0.000 setgray
fill
grestore
stroke
grestore
} bind def
330.097 80.11 o
grestore
gsave

324.096627 64.906875 translate
0.000000 rotate
0.000000 0 m /one glyphshow
5.999985 0 m /zero glyphshow
grestore
2 setlinecap
0.690 setgray
gsave
149.99 227.298 266.465 80.11 clipbox
358.503789 80.11 m
358.503789 307.408438 l
stroke
grestore
0 setlinecap
0.000 setgray
gsave
/o {
gsave
newpath
translate
0.8 setlinewidth
1 setlinejoin

0 setlinecap

0 0 m
0 -3.5 l

gsave
0.000 setgray
fill
grestore
stroke
grestore
} bind def
358.504 80.11 o
grestore
gsave

352.503789 64.906875 translate
0.000000 rotate
0.000000 0 m /one glyphshow
5.999985 0 m /five glyphshow
grestore
2 setlinecap
0.690 setgray
gsave
149.99 227.298 266.465 80.11 clipbox
386.910952 80.11 m
386.910952 307.408438 l
stroke
grestore
0 setlinecap
0.000 setgray
gsave
/o {
gsave
newpath
translate
0.8 setlinewidth
1 setlinejoin

0 setlinecap

0 0 m
0 -3.5 l

gsave
0.000 setgray
fill
grestore
stroke
grestore
} bind def
386.911 80.11 o
grestore
gsave

380.910952 64.906875 translate
0.000000 rotate
0.000000 0 m /two glyphshow
5.999985 0 m /zero glyphshow
grestore
2 setlinecap
0.690 setgray
gsave
149.99 227.298 266.465 80.11 clipbox
415.318114 80.11 m
415.318114 307.408438 l
stroke
grestore
0 setlinecap
0.000 setgray
gsave
/o {
gsave
newpath
translate
0.8 setlinewidth
1 setlinejoin

0 setlinecap

0 0 m
0 -3.5 l

gsave
0.000 setgray
fill
grestore
stroke
grestore
} bind def
415.318 80.11 o
grestore
gsave

409.318114 64.906875 translate
0.000000 rotate
0.000000 0 m /two glyphshow
5.999985 0 m /five glyphshow
grestore
/STIXGeneral-Regular 14.000 selectfont
gsave

318.131367 48.735000 translate
0.000000 rotate
0.000000 0 m /i glyphshow
3.891998 0 m /t glyphshow
7.783997 0 m /e glyphshow
13.999985 0 m /r glyphshow
18.661972 0 m /a glyphshow
24.877960 0 m /t glyphshow
28.769958 0 m /i glyphshow
32.661957 0 m /o glyphshow
39.661957 0 m /n glyphshow
grestore
2 setlinecap
0.690 setgray
gsave
149.99 227.298 266.465 80.11 clipbox
266.464583 90.441747 m
416.454401 90.441747 l
stroke
grestore
0 setlinecap
0.000 setgray
gsave
/o {
gsave
newpath
translate
0.8 setlinewidth
1 setlinejoin

0 setlinecap

-0 0 m
-3.5 0 l

gsave
0.000 setgray
fill
grestore
stroke
grestore
} bind def
266.465 90.4417 o
grestore
gsave
242.464583 85.746435 translate
0.000000 rotate
/STIXGeneral-Regular 12.0 selectfont
0.000000 0.998438 moveto
/one glyphshow
5.999985 0.998438 moveto
/zero glyphshow
/STIXGeneral-Regular 8.399999999999999 selectfont
12.189188 5.323438 moveto
/zero glyphshow
grestore
2 setlinecap
0.690 setgray
gsave
149.99 227.298 266.465 80.11 clipbox
266.464583 219.422525 m
416.454401 219.422525 l
stroke
grestore
0 setlinecap
0.000 setgray
gsave
/o {
gsave
newpath
translate
0.8 setlinewidth
1 setlinejoin

0 setlinecap

-0 0 m
-3.5 0 l

gsave
0.000 setgray
fill
grestore
stroke
grestore
} bind def
266.465 219.423 o
grestore
gsave
242.464583 214.727212 translate
0.000000 rotate
/STIXGeneral-Regular 12.0 selectfont
0.000000 0.998438 moveto
/one glyphshow
5.999985 0.998438 moveto
/zero glyphshow
/STIXGeneral-Regular 8.399999999999999 selectfont
12.189188 5.323438 moveto
/one glyphshow
grestore
2 setlinecap
0.690 setgray
gsave
149.99 227.298 266.465 80.11 clipbox
266.464583 84.53991 m
416.454401 84.53991 l
stroke
grestore
0.600 setlinewidth
0 setlinecap
0.000 setgray
gsave
/o {
gsave
newpath
translate
0.6 setlinewidth
1 setlinejoin

0 setlinecap

-0 0 m
-2 0 l

gsave
0.000 setgray
fill
grestore
stroke
grestore
} bind def
266.465 84.5399 o
grestore
0.800 setlinewidth
2 setlinecap
0.690 setgray
gsave
149.99 227.298 266.465 80.11 clipbox
266.464583 129.26883 m
416.454401 129.26883 l
stroke
grestore
0.600 setlinewidth
0 setlinecap
0.000 setgray
gsave
/o {
gsave
newpath
translate
0.6 setlinewidth
1 setlinejoin

0 setlinecap

-0 0 m
-2 0 l

gsave
0.000 setgray
fill
grestore
stroke
grestore
} bind def
266.465 129.269 o
grestore
0.800 setlinewidth
2 setlinecap
0.690 setgray
gsave
149.99 227.298 266.465 80.11 clipbox
266.464583 151.981218 m
416.454401 151.981218 l
stroke
grestore
0.600 setlinewidth
0 setlinecap
0.000 setgray
gsave
/o {
gsave
newpath
translate
0.6 setlinewidth
1 setlinejoin

0 setlinecap

-0 0 m
-2 0 l

gsave
0.000 setgray
fill
grestore
stroke
grestore
} bind def
266.465 151.981 o
grestore
0.800 setlinewidth
2 setlinecap
0.690 setgray
gsave
149.99 227.298 266.465 80.11 clipbox
266.464583 168.095913 m
416.454401 168.095913 l
stroke
grestore
0.600 setlinewidth
0 setlinecap
0.000 setgray
gsave
/o {
gsave
newpath
translate
0.6 setlinewidth
1 setlinejoin

0 setlinecap

-0 0 m
-2 0 l

gsave
0.000 setgray
fill
grestore
stroke
grestore
} bind def
266.465 168.096 o
grestore
0.800 setlinewidth
2 setlinecap
0.690 setgray
gsave
149.99 227.298 266.465 80.11 clipbox
266.464583 180.595442 m
416.454401 180.595442 l
stroke
grestore
0.600 setlinewidth
0 setlinecap
0.000 setgray
gsave
/o {
gsave
newpath
translate
0.6 setlinewidth
1 setlinejoin

0 setlinecap

-0 0 m
-2 0 l

gsave
0.000 setgray
fill
grestore
stroke
grestore
} bind def
266.465 180.595 o
grestore
0.800 setlinewidth
2 setlinecap
0.690 setgray
gsave
149.99 227.298 266.465 80.11 clipbox
266.464583 190.8083 m
416.454401 190.8083 l
stroke
grestore
0.600 setlinewidth
0 setlinecap
0.000 setgray
gsave
/o {
gsave
newpath
translate
0.6 setlinewidth
1 setlinejoin

0 setlinecap

-0 0 m
-2 0 l

gsave
0.000 setgray
fill
grestore
stroke
grestore
} bind def
266.465 190.808 o
grestore
0.800 setlinewidth
2 setlinecap
0.690 setgray
gsave
149.99 227.298 266.465 80.11 clipbox
266.464583 199.443149 m
416.454401 199.443149 l
stroke
grestore
0.600 setlinewidth
0 setlinecap
0.000 setgray
gsave
/o {
gsave
newpath
translate
0.6 setlinewidth
1 setlinejoin

0 setlinecap

-0 0 m
-2 0 l

gsave
0.000 setgray
fill
grestore
stroke
grestore
} bind def
266.465 199.443 o
grestore
0.800 setlinewidth
2 setlinecap
0.690 setgray
gsave
149.99 227.298 266.465 80.11 clipbox
266.464583 206.922996 m
416.454401 206.922996 l
stroke
grestore
0.600 setlinewidth
0 setlinecap
0.000 setgray
gsave
/o {
gsave
newpath
translate
0.6 setlinewidth
1 setlinejoin

0 setlinecap

-0 0 m
-2 0 l

gsave
0.000 setgray
fill
grestore
stroke
grestore
} bind def
266.465 206.923 o
grestore
0.800 setlinewidth
2 setlinecap
0.690 setgray
gsave
149.99 227.298 266.465 80.11 clipbox
266.464583 213.520688 m
416.454401 213.520688 l
stroke
grestore
0.600 setlinewidth
0 setlinecap
0.000 setgray
gsave
/o {
gsave
newpath
translate
0.6 setlinewidth
1 setlinejoin

0 setlinecap

-0 0 m
-2 0 l

gsave
0.000 setgray
fill
grestore
stroke
grestore
} bind def
266.465 213.521 o
grestore
0.800 setlinewidth
2 setlinecap
0.690 setgray
gsave
149.99 227.298 266.465 80.11 clipbox
266.464583 258.249607 m
416.454401 258.249607 l
stroke
grestore
0.600 setlinewidth
0 setlinecap
0.000 setgray
gsave
/o {
gsave
newpath
translate
0.6 setlinewidth
1 setlinejoin

0 setlinecap

-0 0 m
-2 0 l

gsave
0.000 setgray
fill
grestore
stroke
grestore
} bind def
266.465 258.25 o
grestore
0.800 setlinewidth
2 setlinecap
0.690 setgray
gsave
149.99 227.298 266.465 80.11 clipbox
266.464583 280.961995 m
416.454401 280.961995 l
stroke
grestore
0.600 setlinewidth
0 setlinecap
0.000 setgray
gsave
/o {
gsave
newpath
translate
0.6 setlinewidth
1 setlinejoin

0 setlinecap

-0 0 m
-2 0 l

gsave
0.000 setgray
fill
grestore
stroke
grestore
} bind def
266.465 280.962 o
grestore
0.800 setlinewidth
2 setlinecap
0.690 setgray
gsave
149.99 227.298 266.465 80.11 clipbox
266.464583 297.07669 m
416.454401 297.07669 l
stroke
grestore
0.600 setlinewidth
0 setlinecap
0.000 setgray
gsave
/o {
gsave
newpath
translate
0.6 setlinewidth
1 setlinejoin

0 setlinecap

-0 0 m
-2 0 l

gsave
0.000 setgray
fill
grestore
stroke
grestore
} bind def
266.465 297.077 o
grestore
gsave

235.433333 148.845156 translate
90.000000 rotate
0.000000 0 m /s glyphshow
5.445999 0 m /o glyphshow
12.445999 0 m /l glyphshow
16.337997 0 m /v glyphshow
23.337997 0 m /e glyphshow
29.553986 0 m /r glyphshow
34.215973 0 m /space glyphshow
37.715973 0 m /i glyphshow
41.607971 0 m /t glyphshow
45.499969 0 m /e glyphshow
51.715958 0 m /r glyphshow
56.377945 0 m /a glyphshow
62.593933 0 m /t glyphshow
66.485931 0 m /i glyphshow
70.377930 0 m /o glyphshow
77.377930 0 m /n glyphshow
84.377930 0 m /s glyphshow
grestore
1.500 setlinewidth
[9.6 2.4 1.5 2.4] 0 setdash
0.122 0.467 0.706 setrgbcolor
gsave
149.99 227.298 266.465 80.11 clipbox
273.282302 168.095913 m
278.963735 168.095913 l
284.645167 168.095913 l
290.3266 168.095913 l
296.008032 168.095913 l
301.689465 168.095913 l
307.370897 168.095913 l
313.05233 168.095913 l
318.733762 151.981218 l
324.415195 151.981218 l
330.096627 168.095913 l
335.77806 168.095913 l
341.459492 168.095913 l
347.140924 168.095913 l
352.822357 168.095913 l
358.503789 168.095913 l
364.185222 168.095913 l
369.866654 168.095913 l
375.548087 168.095913 l
381.229519 180.595442 l
386.910952 168.095913 l
392.592384 180.595442 l
398.273817 180.595442 l
403.955249 180.595442 l
409.636682 180.595442 l
stroke
grestore
1.000 setlinewidth
[] 0 setdash
gsave
149.99 227.298 266.465 80.11 clipbox
/o {
gsave
newpath
translate
1.0 setlinewidth
1 setlinejoin

0 setlinecap

-2.5 -2.5 m
2.5 2.5 l
-2.5 2.5 m
2.5 -2.5 l

gsave
0.122 0.467 0.706 setrgbcolor
fill
grestore
stroke
grestore
} bind def
273.282 168.096 o
278.964 168.096 o
284.645 168.096 o
290.327 168.096 o
296.008 168.096 o
301.689 168.096 o
307.371 168.096 o
313.052 168.096 o
318.734 151.981 o
324.415 151.981 o
330.097 168.096 o
335.778 168.096 o
341.459 168.096 o
347.141 168.096 o
352.822 168.096 o
358.504 168.096 o
364.185 168.096 o
369.867 168.096 o
375.548 168.096 o
381.23 180.595 o
386.911 168.096 o
392.592 180.595 o
398.274 180.595 o
403.955 180.595 o
409.637 180.595 o
grestore
1.500 setlinewidth
[9.6 2.4 1.5 2.4] 0 setdash
0.580 0.404 0.741 setrgbcolor
gsave
149.99 227.298 266.465 80.11 clipbox
273.282302 213.520688 m
278.963735 213.520688 l
284.645167 219.422525 l
290.3266 297.07669 l
296.008032 229.635383 l
301.689465 219.422525 l
307.370897 219.422525 l
313.05233 224.761385 l
318.733762 287.973089 l
324.415195 249.146006 l
330.096627 224.761385 l
335.77806 260.98262 l
341.459492 238.270232 l
347.140924 252.347771 l
352.822357 234.119027 l
358.503789 229.635383 l
364.185222 234.119027 l
369.866654 234.119027 l
375.548087 238.270232 l
381.229519 249.146006 l
386.910952 242.134912 l
392.592384 238.270232 l
398.273817 245.750079 l
403.955249 252.347771 l
409.636682 252.347771 l
stroke
grestore
1.000 setlinewidth
0 setlinejoin
[] 0 setdash
gsave
149.99 227.298 266.465 80.11 clipbox
/o {
gsave
newpath
translate
1.0 setlinewidth
0 setlinejoin

0 setlinecap

2.5 -0 m
-2.5 2.5 l
-2.5 -2.5 l
cl

gsave
0.580 0.404 0.741 setrgbcolor
fill
grestore
stroke
grestore
} bind def
273.282 213.521 o
278.964 213.521 o
284.645 219.423 o
290.327 297.077 o
296.008 229.635 o
301.689 219.423 o
307.371 219.423 o
313.052 224.761 o
318.734 287.973 o
324.415 249.146 o
330.097 224.761 o
335.778 260.983 o
341.459 238.27 o
347.141 252.348 o
352.822 234.119 o
358.504 229.635 o
364.185 234.119 o
369.867 234.119 o
375.548 238.27 o
381.23 249.146 o
386.911 242.135 o
392.592 238.27 o
398.274 245.75 o
403.955 252.348 o
409.637 252.348 o
grestore
1.500 setlinewidth
1 setlinejoin
2 setlinecap
1.000 0.498 0.055 setrgbcolor
gsave
149.99 227.298 266.465 80.11 clipbox
273.282302 90.441747 m
278.963735 90.441747 l
284.645167 90.441747 l
290.3266 90.441747 l
296.008032 90.441747 l
301.689465 90.441747 l
307.370897 90.441747 l
313.05233 90.441747 l
318.733762 90.441747 l
324.415195 90.441747 l
330.096627 90.441747 l
335.77806 90.441747 l
341.459492 90.441747 l
347.140924 90.441747 l
352.822357 90.441747 l
358.503789 90.441747 l
364.185222 90.441747 l
369.866654 90.441747 l
375.548087 90.441747 l
381.229519 90.441747 l
386.910952 90.441747 l
392.592384 90.441747 l
398.273817 90.441747 l
403.955249 90.441747 l
409.636682 90.441747 l
stroke
grestore
1.000 setlinewidth
0 setlinejoin
0 setlinecap
gsave
149.99 227.298 266.465 80.11 clipbox
/o {
gsave
newpath
translate
1.0 setlinewidth
0 setlinejoin

0 setlinecap

-0 -3.535534 m
2.12132 0 l
-0 3.535534 l
-2.12132 0 l
cl

gsave
1.000 0.498 0.055 setrgbcolor
fill
grestore
stroke
grestore
} bind def
273.282 90.4417 o
278.964 90.4417 o
284.645 90.4417 o
290.327 90.4417 o
296.008 90.4417 o
301.689 90.4417 o
307.371 90.4417 o
313.052 90.4417 o
318.734 90.4417 o
324.415 90.4417 o
330.097 90.4417 o
335.778 90.4417 o
341.459 90.4417 o
347.141 90.4417 o
352.822 90.4417 o
358.504 90.4417 o
364.185 90.4417 o
369.867 90.4417 o
375.548 90.4417 o
381.23 90.4417 o
386.911 90.4417 o
392.592 90.4417 o
398.274 90.4417 o
403.955 90.4417 o
409.637 90.4417 o
grestore
1.500 setlinewidth
1 setlinejoin
2 setlinecap
0.173 0.627 0.173 setrgbcolor
gsave
149.99 227.298 266.465 80.11 clipbox
273.282302 90.441747 m
278.963735 90.441747 l
284.645167 90.441747 l
290.3266 90.441747 l
296.008032 90.441747 l
301.689465 90.441747 l
307.370897 90.441747 l
313.05233 90.441747 l
318.733762 90.441747 l
324.415195 90.441747 l
330.096627 90.441747 l
335.77806 90.441747 l
341.459492 90.441747 l
347.140924 90.441747 l
352.822357 90.441747 l
stroke
grestore
1.000 setlinewidth
0 setlinecap
gsave
149.99 227.298 266.465 80.11 clipbox
/o {
gsave
newpath
translate
1.0 setlinewidth
1 setlinejoin

0 setlinecap

0 -1.5 m
0.397805 -1.5 0.77937 -1.341951 1.06066 -1.06066 c
1.341951 -0.77937 1.5 -0.397805 1.5 0 c
1.5 0.397805 1.341951 0.77937 1.06066 1.06066 c
0.77937 1.341951 0.397805 1.5 0 1.5 c
-0.397805 1.5 -0.77937 1.341951 -1.06066 1.06066 c
-1.341951 0.77937 -1.5 0.397805 -1.5 0 c
-1.5 -0.397805 -1.341951 -0.77937 -1.06066 -1.06066 c
-0.77937 -1.341951 -0.397805 -1.5 0 -1.5 c
cl

gsave
0.173 0.627 0.173 setrgbcolor
fill
grestore
stroke
grestore
} bind def
273.282 90.4417 o
278.964 90.4417 o
284.645 90.4417 o
290.327 90.4417 o
296.008 90.4417 o
301.689 90.4417 o
307.371 90.4417 o
313.052 90.4417 o
318.734 90.4417 o
324.415 90.4417 o
330.097 90.4417 o
335.778 90.4417 o
341.459 90.4417 o
347.141 90.4417 o
352.822 90.4417 o
grestore
0.800 setlinewidth
0 setlinejoin
2 setlinecap
0.000 setgray
gsave
266.464583 80.11 m
266.464583 307.408438 l
stroke
grestore
gsave
416.454401 80.11 m
416.454401 307.408438 l
stroke
grestore
gsave
266.464583 80.11 m
416.454401 80.11 l
stroke
grestore
gsave
266.464583 307.408438 m
416.454401 307.408438 l
stroke
grestore
gsave
478.729167 80.11 m
628.718984 80.11 l
628.718984 307.408438 l
478.729167 307.408438 l
cl
1.000 setgray
fill
grestore
1 setlinejoin
0.690 setgray
gsave
149.99 227.298 478.729 80.11 clipbox
485.546886 80.11 m
485.546886 307.408438 l
stroke
grestore
0 setlinecap
0.000 setgray
gsave
/o {
gsave
newpath
translate
0.8 setlinewidth
1 setlinejoin

0 setlinecap

0 0 m
0 -3.5 l

gsave
0.000 setgray
fill
grestore
stroke
grestore
} bind def
485.547 80.11 o
grestore
/STIXGeneral-Regular 12.000 selectfont
gsave

482.546886 64.906875 translate
0.000000 rotate
0.000000 0 m /zero glyphshow
grestore
2 setlinecap
0.690 setgray
gsave
149.99 227.298 478.729 80.11 clipbox
513.954048 80.11 m
513.954048 307.408438 l
stroke
grestore
0 setlinecap
0.000 setgray
gsave
/o {
gsave
newpath
translate
0.8 setlinewidth
1 setlinejoin

0 setlinecap

0 0 m
0 -3.5 l

gsave
0.000 setgray
fill
grestore
stroke
grestore
} bind def
513.954 80.11 o
grestore
gsave

510.954048 64.906875 translate
0.000000 rotate
0.000000 0 m /five glyphshow
grestore
2 setlinecap
0.690 setgray
gsave
149.99 227.298 478.729 80.11 clipbox
542.36121 80.11 m
542.36121 307.408438 l
stroke
grestore
0 setlinecap
0.000 setgray
gsave
/o {
gsave
newpath
translate
0.8 setlinewidth
1 setlinejoin

0 setlinecap

0 0 m
0 -3.5 l

gsave
0.000 setgray
fill
grestore
stroke
grestore
} bind def
542.361 80.11 o
grestore
gsave

536.361210 64.906875 translate
0.000000 rotate
0.000000 0 m /one glyphshow
5.999985 0 m /zero glyphshow
grestore
2 setlinecap
0.690 setgray
gsave
149.99 227.298 478.729 80.11 clipbox
570.768373 80.11 m
570.768373 307.408438 l
stroke
grestore
0 setlinecap
0.000 setgray
gsave
/o {
gsave
newpath
translate
0.8 setlinewidth
1 setlinejoin

0 setlinecap

0 0 m
0 -3.5 l

gsave
0.000 setgray
fill
grestore
stroke
grestore
} bind def
570.768 80.11 o
grestore
gsave

564.768373 64.906875 translate
0.000000 rotate
0.000000 0 m /one glyphshow
5.999985 0 m /five glyphshow
grestore
2 setlinecap
0.690 setgray
gsave
149.99 227.298 478.729 80.11 clipbox
599.175535 80.11 m
599.175535 307.408438 l
stroke
grestore
0 setlinecap
0.000 setgray
gsave
/o {
gsave
newpath
translate
0.8 setlinewidth
1 setlinejoin

0 setlinecap

0 0 m
0 -3.5 l

gsave
0.000 setgray
fill
grestore
stroke
grestore
} bind def
599.176 80.11 o
grestore
gsave

593.175535 64.906875 translate
0.000000 rotate
0.000000 0 m /two glyphshow
5.999985 0 m /zero glyphshow
grestore
2 setlinecap
0.690 setgray
gsave
149.99 227.298 478.729 80.11 clipbox
627.582697 80.11 m
627.582697 307.408438 l
stroke
grestore
0 setlinecap
0.000 setgray
gsave
/o {
gsave
newpath
translate
0.8 setlinewidth
1 setlinejoin

0 setlinecap

0 0 m
0 -3.5 l

gsave
0.000 setgray
fill
grestore
stroke
grestore
} bind def
627.583 80.11 o
grestore
gsave

621.582697 64.906875 translate
0.000000 rotate
0.000000 0 m /two glyphshow
5.999985 0 m /five glyphshow
grestore
/STIXGeneral-Regular 14.000 selectfont
gsave

530.395950 48.735000 translate
0.000000 rotate
0.000000 0 m /i glyphshow
3.891998 0 m /t glyphshow
7.783997 0 m /e glyphshow
13.999985 0 m /r glyphshow
18.661972 0 m /a glyphshow
24.877960 0 m /t glyphshow
28.769958 0 m /i glyphshow
32.661957 0 m /o glyphshow
39.661957 0 m /n glyphshow
grestore
2 setlinecap
0.690 setgray
gsave
149.99 227.298 478.729 80.11 clipbox
478.729167 82.009889 m
628.718984 82.009889 l
stroke
grestore
0 setlinecap
0.000 setgray
gsave
/o {
gsave
newpath
translate
0.8 setlinewidth
1 setlinejoin

0 setlinecap

-0 0 m
-3.5 0 l

gsave
0.000 setgray
fill
grestore
stroke
grestore
} bind def
478.729 82.0099 o
grestore
gsave
448.729167 77.314576 translate
0.000000 rotate
/STIXGeneral-Regular 12.0 selectfont
0.000000 0.998438 moveto
/one glyphshow
5.999985 0.998438 moveto
/zero glyphshow
/STIXGeneral-Regular 8.399999999999999 selectfont
12.189188 5.323438 moveto
/minus glyphshow
17.943178 5.323438 moveto
/one glyphshow
grestore
2 setlinecap
0.690 setgray
gsave
149.99 227.298 478.729 80.11 clipbox
478.729167 179.558765 m
628.718984 179.558765 l
stroke
grestore
0 setlinecap
0.000 setgray
gsave
/o {
gsave
newpath
translate
0.8 setlinewidth
1 setlinejoin

0 setlinecap

-0 0 m
-3.5 0 l

gsave
0.000 setgray
fill
grestore
stroke
grestore
} bind def
478.729 179.559 o
grestore
gsave
454.729167 174.863452 translate
0.000000 rotate
/STIXGeneral-Regular 12.0 selectfont
0.000000 0.998438 moveto
/one glyphshow
5.999985 0.998438 moveto
/zero glyphshow
/STIXGeneral-Regular 8.399999999999999 selectfont
12.189188 5.323438 moveto
/zero glyphshow
grestore
2 setlinecap
0.690 setgray
gsave
149.99 227.298 478.729 80.11 clipbox
478.729167 277.107641 m
628.718984 277.107641 l
stroke
grestore
0 setlinecap
0.000 setgray
gsave
/o {
gsave
newpath
translate
0.8 setlinewidth
1 setlinejoin

0 setlinecap

-0 0 m
-3.5 0 l

gsave
0.000 setgray
fill
grestore
stroke
grestore
} bind def
478.729 277.108 o
grestore
gsave
454.729167 272.412328 translate
0.000000 rotate
/STIXGeneral-Regular 12.0 selectfont
0.000000 0.998438 moveto
/one glyphshow
5.999985 0.998438 moveto
/zero glyphshow
/STIXGeneral-Regular 8.399999999999999 selectfont
12.189188 5.323438 moveto
/one glyphshow
grestore
2 setlinecap
0.690 setgray
gsave
149.99 227.298 478.729 80.11 clipbox
478.729167 111.375027 m
628.718984 111.375027 l
stroke
grestore
0.600 setlinewidth
0 setlinecap
0.000 setgray
gsave
/o {
gsave
newpath
translate
0.6 setlinewidth
1 setlinejoin

0 setlinecap

-0 0 m
-2 0 l

gsave
0.000 setgray
fill
grestore
stroke
grestore
} bind def
478.729 111.375 o
grestore
0.800 setlinewidth
2 setlinecap
0.690 setgray
gsave
149.99 227.298 478.729 80.11 clipbox
478.729167 128.552531 m
628.718984 128.552531 l
stroke
grestore
0.600 setlinewidth
0 setlinecap
0.000 setgray
gsave
/o {
gsave
newpath
translate
0.6 setlinewidth
1 setlinejoin

0 setlinecap

-0 0 m
-2 0 l

gsave
0.000 setgray
fill
grestore
stroke
grestore
} bind def
478.729 128.553 o
grestore
0.800 setlinewidth
2 setlinecap
0.690 setgray
gsave
149.99 227.298 478.729 80.11 clipbox
478.729167 140.740164 m
628.718984 140.740164 l
stroke
grestore
0.600 setlinewidth
0 setlinecap
0.000 setgray
gsave
/o {
gsave
newpath
translate
0.6 setlinewidth
1 setlinejoin

0 setlinecap

-0 0 m
-2 0 l

gsave
0.000 setgray
fill
grestore
stroke
grestore
} bind def
478.729 140.74 o
grestore
0.800 setlinewidth
2 setlinecap
0.690 setgray
gsave
149.99 227.298 478.729 80.11 clipbox
478.729167 150.193627 m
628.718984 150.193627 l
stroke
grestore
0.600 setlinewidth
0 setlinecap
0.000 setgray
gsave
/o {
gsave
newpath
translate
0.6 setlinewidth
1 setlinejoin

0 setlinecap

-0 0 m
-2 0 l

gsave
0.000 setgray
fill
grestore
stroke
grestore
} bind def
478.729 150.194 o
grestore
0.800 setlinewidth
2 setlinecap
0.690 setgray
gsave
149.99 227.298 478.729 80.11 clipbox
478.729167 157.917669 m
628.718984 157.917669 l
stroke
grestore
0.600 setlinewidth
0 setlinecap
0.000 setgray
gsave
/o {
gsave
newpath
translate
0.6 setlinewidth
1 setlinejoin

0 setlinecap

-0 0 m
-2 0 l

gsave
0.000 setgray
fill
grestore
stroke
grestore
} bind def
478.729 157.918 o
grestore
0.800 setlinewidth
2 setlinecap
0.690 setgray
gsave
149.99 227.298 478.729 80.11 clipbox
478.729167 164.448253 m
628.718984 164.448253 l
stroke
grestore
0.600 setlinewidth
0 setlinecap
0.000 setgray
gsave
/o {
gsave
newpath
translate
0.6 setlinewidth
1 setlinejoin

0 setlinecap

-0 0 m
-2 0 l

gsave
0.000 setgray
fill
grestore
stroke
grestore
} bind def
478.729 164.448 o
grestore
0.800 setlinewidth
2 setlinecap
0.690 setgray
gsave
149.99 227.298 478.729 80.11 clipbox
478.729167 170.105302 m
628.718984 170.105302 l
stroke
grestore
0.600 setlinewidth
0 setlinecap
0.000 setgray
gsave
/o {
gsave
newpath
translate
0.6 setlinewidth
1 setlinejoin

0 setlinecap

-0 0 m
-2 0 l

gsave
0.000 setgray
fill
grestore
stroke
grestore
} bind def
478.729 170.105 o
grestore
0.800 setlinewidth
2 setlinecap
0.690 setgray
gsave
149.99 227.298 478.729 80.11 clipbox
478.729167 175.095173 m
628.718984 175.095173 l
stroke
grestore
0.600 setlinewidth
0 setlinecap
0.000 setgray
gsave
/o {
gsave
newpath
translate
0.6 setlinewidth
1 setlinejoin

0 setlinecap

-0 0 m
-2 0 l

gsave
0.000 setgray
fill
grestore
stroke
grestore
} bind def
478.729 175.095 o
grestore
0.800 setlinewidth
2 setlinecap
0.690 setgray
gsave
149.99 227.298 478.729 80.11 clipbox
478.729167 208.923903 m
628.718984 208.923903 l
stroke
grestore
0.600 setlinewidth
0 setlinecap
0.000 setgray
gsave
/o {
gsave
newpath
translate
0.6 setlinewidth
1 setlinejoin

0 setlinecap

-0 0 m
-2 0 l

gsave
0.000 setgray
fill
grestore
stroke
grestore
} bind def
478.729 208.924 o
grestore
0.800 setlinewidth
2 setlinecap
0.690 setgray
gsave
149.99 227.298 478.729 80.11 clipbox
478.729167 226.101407 m
628.718984 226.101407 l
stroke
grestore
0.600 setlinewidth
0 setlinecap
0.000 setgray
gsave
/o {
gsave
newpath
translate
0.6 setlinewidth
1 setlinejoin

0 setlinecap

-0 0 m
-2 0 l

gsave
0.000 setgray
fill
grestore
stroke
grestore
} bind def
478.729 226.101 o
grestore
0.800 setlinewidth
2 setlinecap
0.690 setgray
gsave
149.99 227.298 478.729 80.11 clipbox
478.729167 238.28904 m
628.718984 238.28904 l
stroke
grestore
0.600 setlinewidth
0 setlinecap
0.000 setgray
gsave
/o {
gsave
newpath
translate
0.6 setlinewidth
1 setlinejoin

0 setlinecap

-0 0 m
-2 0 l

gsave
0.000 setgray
fill
grestore
stroke
grestore
} bind def
478.729 238.289 o
grestore
0.800 setlinewidth
2 setlinecap
0.690 setgray
gsave
149.99 227.298 478.729 80.11 clipbox
478.729167 247.742503 m
628.718984 247.742503 l
stroke
grestore
0.600 setlinewidth
0 setlinecap
0.000 setgray
gsave
/o {
gsave
newpath
translate
0.6 setlinewidth
1 setlinejoin

0 setlinecap

-0 0 m
-2 0 l

gsave
0.000 setgray
fill
grestore
stroke
grestore
} bind def
478.729 247.743 o
grestore
0.800 setlinewidth
2 setlinecap
0.690 setgray
gsave
149.99 227.298 478.729 80.11 clipbox
478.729167 255.466545 m
628.718984 255.466545 l
stroke
grestore
0.600 setlinewidth
0 setlinecap
0.000 setgray
gsave
/o {
gsave
newpath
translate
0.6 setlinewidth
1 setlinejoin

0 setlinecap

-0 0 m
-2 0 l

gsave
0.000 setgray
fill
grestore
stroke
grestore
} bind def
478.729 255.467 o
grestore
0.800 setlinewidth
2 setlinecap
0.690 setgray
gsave
149.99 227.298 478.729 80.11 clipbox
478.729167 261.997129 m
628.718984 261.997129 l
stroke
grestore
0.600 setlinewidth
0 setlinecap
0.000 setgray
gsave
/o {
gsave
newpath
translate
0.6 setlinewidth
1 setlinejoin

0 setlinecap

-0 0 m
-2 0 l

gsave
0.000 setgray
fill
grestore
stroke
grestore
} bind def
478.729 261.997 o
grestore
0.800 setlinewidth
2 setlinecap
0.690 setgray
gsave
149.99 227.298 478.729 80.11 clipbox
478.729167 267.654178 m
628.718984 267.654178 l
stroke
grestore
0.600 setlinewidth
0 setlinecap
0.000 setgray
gsave
/o {
gsave
newpath
translate
0.6 setlinewidth
1 setlinejoin

0 setlinecap

-0 0 m
-2 0 l

gsave
0.000 setgray
fill
grestore
stroke
grestore
} bind def
478.729 267.654 o
grestore
0.800 setlinewidth
2 setlinecap
0.690 setgray
gsave
149.99 227.298 478.729 80.11 clipbox
478.729167 272.644049 m
628.718984 272.644049 l
stroke
grestore
0.600 setlinewidth
0 setlinecap
0.000 setgray
gsave
/o {
gsave
newpath
translate
0.6 setlinewidth
1 setlinejoin

0 setlinecap

-0 0 m
-2 0 l

gsave
0.000 setgray
fill
grestore
stroke
grestore
} bind def
478.729 272.644 o
grestore
0.800 setlinewidth
2 setlinecap
0.690 setgray
gsave
149.99 227.298 478.729 80.11 clipbox
478.729167 306.472778 m
628.718984 306.472778 l
stroke
grestore
0.600 setlinewidth
0 setlinecap
0.000 setgray
gsave
/o {
gsave
newpath
translate
0.6 setlinewidth
1 setlinejoin

0 setlinecap

-0 0 m
-2 0 l

gsave
0.000 setgray
fill
grestore
stroke
grestore
} bind def
478.729 306.473 o
grestore
gsave

441.697917 155.649844 translate
90.000000 rotate
0.000000 0 m /s glyphshow
5.445999 0 m /o glyphshow
12.445999 0 m /l glyphshow
16.337997 0 m /v glyphshow
23.337997 0 m /e glyphshow
29.553986 0 m /space glyphshow
33.053986 0 m /t glyphshow
36.945984 0 m /i glyphshow
40.837982 0 m /m glyphshow
51.729980 0 m /e glyphshow
57.945969 0 m /space glyphshow
61.445969 0 m /bracketleft glyphshow
66.107956 0 m /s glyphshow
71.553955 0 m /bracketright glyphshow
grestore
1.500 setlinewidth
[9.6 2.4 1.5 2.4] 0 setdash
0.122 0.467 0.706 setrgbcolor
gsave
149.99 227.298 478.729 80.11 clipbox
485.546886 155.556534 m
491.228318 155.266525 l
496.909751 156.952112 l
502.591183 159.655177 l
508.272616 162.071431 l
513.954048 166.941681 l
519.63548 175.051738 l
525.316913 178.617587 l
530.998345 175.407785 l
536.679778 181.113452 l
542.36121 202.288689 l
548.042643 211.727077 l
553.724075 216.47132 l
559.405508 223.307532 l
565.08694 232.602083 l
570.768373 240.480259 l
576.449805 245.358992 l
582.131238 251.317485 l
587.81267 257.359469 l
593.494103 271.201658 l
599.175535 266.426858 l
604.856968 280.929535 l
610.5384 287.373538 l
616.219833 293.252803 l
621.901265 296.656557 l
stroke
grestore
1.000 setlinewidth
[] 0 setdash
gsave
149.99 227.298 478.729 80.11 clipbox
/o {
gsave
newpath
translate
1.0 setlinewidth
1 setlinejoin

0 setlinecap

-2.5 -2.5 m
2.5 2.5 l
-2.5 2.5 m
2.5 -2.5 l

gsave
0.122 0.467 0.706 setrgbcolor
fill
grestore
stroke
grestore
} bind def
485.547 155.557 o
491.228 155.267 o
496.91 156.952 o
502.591 159.655 o
508.273 162.071 o
513.954 166.942 o
519.635 175.052 o
525.317 178.618 o
530.998 175.408 o
536.68 181.113 o
542.361 202.289 o
548.043 211.727 o
553.724 216.471 o
559.406 223.308 o
565.087 232.602 o
570.768 240.48 o
576.45 245.359 o
582.131 251.317 o
587.813 257.359 o
593.494 271.202 o
599.176 266.427 o
604.857 280.93 o
610.538 287.374 o
616.22 293.253 o
621.901 296.657 o
grestore
1.500 setlinewidth
[9.6 2.4 1.5 2.4] 0 setdash
0.580 0.404 0.741 setrgbcolor
gsave
149.99 227.298 478.729 80.11 clipbox
485.546886 157.11988 m
491.228318 156.956473 l
496.909751 162.801467 l
502.591183 221.651114 l
508.272616 177.275181 l
513.954048 175.070269 l
519.63548 181.825498 l
525.316913 189.396726 l
530.998345 242.064503 l
536.679778 223.330674 l
542.36121 214.532254 l
548.042643 248.173642 l
553.724075 239.307334 l
559.405508 255.016677 l
565.08694 245.23221 l
570.768373 246.685608 l
576.449805 252.17044 l
582.131238 258.25179 l
587.81267 265.963397 l
593.494103 277.917499 l
599.175535 276.674609 l
604.856968 277.901573 l
610.5384 287.101113 l
616.219833 295.532794 l
621.901265 297.07669 l
stroke
grestore
1.000 setlinewidth
0 setlinejoin
[] 0 setdash
gsave
149.99 227.298 478.729 80.11 clipbox
/o {
gsave
newpath
translate
1.0 setlinewidth
0 setlinejoin

0 setlinecap

2.5 -0 m
-2.5 2.5 l
-2.5 -2.5 l
cl

gsave
0.580 0.404 0.741 setrgbcolor
fill
grestore
stroke
grestore
} bind def
485.547 157.12 o
491.228 156.956 o
496.91 162.801 o
502.591 221.651 o
508.273 177.275 o
513.954 175.07 o
519.635 181.825 o
525.317 189.397 o
530.998 242.065 o
536.68 223.331 o
542.361 214.532 o
548.043 248.174 o
553.724 239.307 o
559.406 255.017 o
565.087 245.232 o
570.768 246.686 o
576.45 252.17 o
582.131 258.252 o
587.813 265.963 o
593.494 277.917 o
599.176 276.675 o
604.857 277.902 o
610.538 287.101 o
616.22 295.533 o
621.901 297.077 o
grestore
1.500 setlinewidth
1 setlinejoin
2 setlinecap
1.000 0.498 0.055 setrgbcolor
gsave
149.99 227.298 478.729 80.11 clipbox
485.546886 126.161552 m
491.228318 90.441747 l
496.909751 91.549361 l
502.591183 93.447129 l
508.272616 96.838751 l
513.954048 101.989472 l
519.63548 111.430037 l
525.316913 113.204585 l
530.998345 118.490081 l
536.679778 125.528024 l
542.36121 134.569314 l
548.042643 138.367418 l
553.724075 147.880978 l
559.405508 155.929282 l
565.08694 163.86664 l
570.768373 169.77018 l
576.449805 175.312066 l
582.131238 181.005685 l
587.81267 186.989558 l
593.494103 192.105047 l
599.175535 201.769052 l
604.856968 211.241326 l
610.5384 221.883066 l
616.219833 228.250295 l
621.901265 234.821528 l
stroke
grestore
1.000 setlinewidth
0 setlinejoin
0 setlinecap
gsave
149.99 227.298 478.729 80.11 clipbox
/o {
gsave
newpath
translate
1.0 setlinewidth
0 setlinejoin

0 setlinecap

-0 -3.535534 m
2.12132 0 l
-0 3.535534 l
-2.12132 0 l
cl

gsave
1.000 0.498 0.055 setrgbcolor
fill
grestore
stroke
grestore
} bind def
485.547 126.162 o
491.228 90.4417 o
496.91 91.5494 o
502.591 93.4471 o
508.273 96.8388 o
513.954 101.989 o
519.635 111.43 o
525.317 113.205 o
530.998 118.49 o
536.68 125.528 o
542.361 134.569 o
548.043 138.367 o
553.724 147.881 o
559.406 155.929 o
565.087 163.867 o
570.768 169.77 o
576.45 175.312 o
582.131 181.006 o
587.813 186.99 o
593.494 192.105 o
599.176 201.769 o
604.857 211.241 o
610.538 221.883 o
616.22 228.25 o
621.901 234.822 o
grestore
1.500 setlinewidth
1 setlinejoin
2 setlinecap
0.173 0.627 0.173 setrgbcolor
gsave
149.99 227.298 478.729 80.11 clipbox
485.546886 112.669727 m
491.228318 113.247734 l
496.909751 116.165018 l
502.591183 116.742613 l
508.272616 122.906332 l
513.954048 125.552202 l
519.63548 131.728673 l
525.316913 136.177083 l
530.998345 141.365692 l
536.679778 148.699924 l
542.36121 161.965365 l
548.042643 171.438732 l
553.724075 184.271106 l
559.405508 184.573982 l
565.08694 203.334561 l
stroke
grestore
1.000 setlinewidth
0 setlinecap
gsave
149.99 227.298 478.729 80.11 clipbox
/o {
gsave
newpath
translate
1.0 setlinewidth
1 setlinejoin

0 setlinecap

0 -1.5 m
0.397805 -1.5 0.77937 -1.341951 1.06066 -1.06066 c
1.341951 -0.77937 1.5 -0.397805 1.5 0 c
1.5 0.397805 1.341951 0.77937 1.06066 1.06066 c
0.77937 1.341951 0.397805 1.5 0 1.5 c
-0.397805 1.5 -0.77937 1.341951 -1.06066 1.06066 c
-1.341951 0.77937 -1.5 0.397805 -1.5 0 c
-1.5 -0.397805 -1.341951 -0.77937 -1.06066 -1.06066 c
-0.77937 -1.341951 -0.397805 -1.5 0 -1.5 c
cl

gsave
0.173 0.627 0.173 setrgbcolor
fill
grestore
stroke
grestore
} bind def
485.547 112.67 o
491.228 113.248 o
496.91 116.165 o
502.591 116.743 o
508.273 122.906 o
513.954 125.552 o
519.635 131.729 o
525.317 136.177 o
530.998 141.366 o
536.68 148.7 o
542.361 161.965 o
548.043 171.439 o
553.724 184.271 o
559.406 184.574 o
565.087 203.335 o
grestore
0.800 setlinewidth
0 setlinejoin
2 setlinecap
0.000 setgray
gsave
478.729167 80.11 m
478.729167 307.408438 l
stroke
grestore
gsave
628.718984 80.11 m
628.718984 307.408438 l
stroke
grestore
gsave
478.729167 80.11 m
628.718984 80.11 l
stroke
grestore
gsave
478.729167 307.408438 m
628.718984 307.408438 l
stroke
grestore
1.000 setlinewidth
0 setlinecap
0.800 setgray
gsave
210.76 7.2 m
417.619375 7.2 l
418.952708 7.2 419.619375 7.866667 419.619375 9.2 c
419.619375 36.54375 l
419.619375 37.877083 418.952708 38.54375 417.619375 38.54375 c
210.76 38.54375 l
209.426667 38.54375 208.76 37.877083 208.76 36.54375 c
208.76 9.2 l
208.76 7.866667 209.426667 7.2 210.76 7.2 c
cl
gsave
1.000 setgray
fill
grestore
stroke
grestore
1.500 setlinewidth
1 setlinejoin
[9.6 2.4 1.5 2.4] 0 setdash
0.122 0.467 0.706 setrgbcolor
gsave
212.76 31.04375 m
222.76 31.04375 l
232.76 31.04375 l
stroke
grestore
1.000 setlinewidth
[] 0 setdash
gsave
/o {
gsave
newpath
translate
1.0 setlinewidth
1 setlinejoin

0 setlinecap

-2.5 -2.5 m
2.5 2.5 l
-2.5 2.5 m
2.5 -2.5 l

gsave
0.122 0.467 0.706 setrgbcolor
fill
grestore
stroke
grestore
} bind def
222.76 31.0438 o
grestore
0.000 setgray
/STIXGeneral-Regular 10.000 selectfont
gsave

240.760000 27.543750 translate
0.000000 rotate
0.000000 0 m /B glyphshow
6.669983 0 m /i glyphshow
9.449966 0 m /C glyphshow
16.119949 0 m /G glyphshow
23.339935 0 m /S glyphshow
28.899918 0 m /T glyphshow
35.009903 0 m /A glyphshow
42.229889 0 m /B glyphshow
48.899872 0 m /space glyphshow
51.399857 0 m /plus glyphshow
58.249847 0 m /space glyphshow
60.749832 0 m /I glyphshow
64.079819 0 m /L glyphshow
70.189804 0 m /U glyphshow
77.409790 0 m /T glyphshow
grestore
1.500 setlinewidth
[9.6 2.4 1.5 2.4] 0 setdash
0.580 0.404 0.741 setrgbcolor
gsave
212.76 16.871875 m
222.76 16.871875 l
232.76 16.871875 l
stroke
grestore
1.000 setlinewidth
0 setlinejoin
[] 0 setdash
gsave
/o {
gsave
newpath
translate
1.0 setlinewidth
0 setlinejoin

0 setlinecap

2.5 -0 m
-2.5 2.5 l
-2.5 -2.5 l
cl

gsave
0.580 0.404 0.741 setrgbcolor
fill
grestore
stroke
grestore
} bind def
222.76 16.8719 o
grestore
0.000 setgray
gsave

240.760000 13.371875 translate
0.000000 rotate
0.000000 0 m /B glyphshow
6.669983 0 m /i glyphshow
9.449966 0 m /C glyphshow
16.119949 0 m /G glyphshow
23.339935 0 m /S glyphshow
28.899918 0 m /T glyphshow
35.009903 0 m /A glyphshow
42.229889 0 m /B glyphshow
grestore
1.500 setlinewidth
1 setlinejoin
2 setlinecap
1.000 0.498 0.055 setrgbcolor
gsave
344.275625 31.04375 m
354.275625 31.04375 l
364.275625 31.04375 l
stroke
grestore
1.000 setlinewidth
0 setlinejoin
0 setlinecap
gsave
/o {
gsave
newpath
translate
1.0 setlinewidth
0 setlinejoin

0 setlinecap

-0 -3.535534 m
2.12132 0 l
-0 3.535534 l
-2.12132 0 l
cl

gsave
1.000 0.498 0.055 setrgbcolor
fill
grestore
stroke
grestore
} bind def
354.276 31.0438 o
grestore
0.000 setgray
gsave

372.275625 27.543750 translate
0.000000 rotate
0.000000 0 m /P glyphshow
5.569992 0 m /a glyphshow
10.009979 0 m /r glyphshow
13.339966 0 m /d glyphshow
18.339951 0 m /i glyphshow
21.119934 0 m /s glyphshow
25.009918 0 m /o glyphshow
30.009903 0 m /L glyphshow
36.119888 0 m /U glyphshow
grestore
1.500 setlinewidth
1 setlinejoin
2 setlinecap
0.173 0.627 0.173 setrgbcolor
gsave
344.275625 16.871875 m
354.275625 16.871875 l
364.275625 16.871875 l
stroke
grestore
1.000 setlinewidth
0 setlinecap
gsave
/o {
gsave
newpath
translate
1.0 setlinewidth
1 setlinejoin

0 setlinecap

0 -1.5 m
0.397805 -1.5 0.77937 -1.341951 1.06066 -1.06066 c
1.341951 -0.77937 1.5 -0.397805 1.5 0 c
1.5 0.397805 1.341951 0.77937 1.06066 1.06066 c
0.77937 1.341951 0.397805 1.5 0 1.5 c
-0.397805 1.5 -0.77937 1.341951 -1.06066 1.06066 c
-1.341951 0.77937 -1.5 0.397805 -1.5 0 c
-1.5 -0.397805 -1.341951 -0.77937 -1.06066 -1.06066 c
-0.77937 -1.341951 -0.397805 -1.5 0 -1.5 c
cl

gsave
0.173 0.627 0.173 setrgbcolor
fill
grestore
stroke
grestore
} bind def
354.276 16.8719 o
grestore
0.000 setgray
gsave

372.275625 13.371875 translate
0.000000 rotate
0.000000 0 m /S glyphshow
5.559982 0 m /p glyphshow
10.559967 0 m /a glyphshow
14.999954 0 m /r glyphshow
18.329941 0 m /s glyphshow
22.219925 0 m /e glyphshow
26.659912 0 m /L glyphshow
32.769897 0 m /U glyphshow
grestore

end
showpage
