%!PS-Adobe-3.0 EPSF-3.0
%%Title: refinement_rules.eps
%%Creator: Matplotlib v3.5.3, https://matplotlib.org/
%%CreationDate: Thu May  4 14:24:59 2023
%%Orientation: portrait
%%BoundingBox: 58 259 554 533
%%HiResBoundingBox: 58.427699 259.000000 553.572301 533.000000
%%EndComments
%%BeginProlog
/mpldict 12 dict def
mpldict begin
/_d { bind def } bind def
/m { moveto } _d
/l { lineto } _d
/r { rlineto } _d
/c { curveto } _d
/cl { closepath } _d
/ce { closepath eofill } _d
/box {
      m
      1 index 0 r
      0 exch r
      neg 0 r
      cl
    } _d
/clipbox {
      box
      clip
      newpath
    } _d
/sc { setcachedevice } _d
%!PS-Adobe-3.0 Resource-Font
%%Creator: Converted from TrueType to Type 3 by Matplotlib.
10 dict begin
/FontName /STIXGeneral-Italic def
/PaintType 0 def
/FontMatrix [0.001 0 0 0.001 0 0] def
/FontBBox [-970 -305 1429 1023] def
/FontType 3 def
/Encoding [/a /d /h /i /l /m /n /o /p /uni03B1 /uni03B2 /uni03D1 /uni03B7 /x /uni03BB] def
/CharStrings 16 dict dup begin
/.notdef 0 def
/a{501 0 17 -11 476 441 sc
463 111 m
476 100 l
439 55 411 25 393 11 c
376 -3 357 -10 337 -10 c
310 -10 297 4 297 31 c
297 48 305 86 320 146 c
283 90 248 50 217 25 c
186 1 152 -11 117 -11 c
88 -11 64 -1 45 19 c
26 40 17 68 17 105 c
17 156 31 207 60 260 c
89 313 126 356 171 390 c
216 424 260 441 303 441 c
348 441 374 422 383 383 c
394 431 l
397 434 l
458 441 l
465 438 l
464 435 462 428 459 417 c
400 201 370 80 370 54 c
370 45 375 41 384 41 c
394 41 411 55 436 82 c
463 111 l

365 361 m
365 378 360 392 350 403 c
340 414 326 419 309 419 c
264 419 220 388 178 327 c
156 294 138 258 123 218 c
108 178 101 143 101 112 c
101 63 121 38 161 38 c
200 38 243 71 288 136 c
339 210 365 285 365 361 c

ce} _d
/d{500 0 15 -13 527 683 sc
521 683 m
527 677 l
488 525 l
428 306 l
385 147 363 65 363 60 c
363 47 369 40 381 40 c
390 40 399 44 408 52 c
418 61 436 80 463 111 c
475 101 l
424 25 375 -13 328 -13 c
315 -13 305 -9 298 -1 c
291 7 287 18 287 32 c
287 52 291 82 300 121 c
271 72 243 38 215 18 c
188 -1 157 -11 122 -11 c
89 -11 62 -1 43 19 c
24 40 15 69 15 106 c
15 185 47 261 111 333 c
176 405 241 441 307 441 c
328 441 343 436 352 427 c
362 418 369 403 372 383 c
373 383 l
418 546 l
427 579 432 602 432 617 c
432 628 428 634 421 637 c
414 640 396 642 368 643 c
368 660 l
419 665 470 672 521 683 c

356 361 m
356 378 351 392 341 402 c
332 413 321 418 309 418 c
278 418 247 403 218 372 c
185 337 157 294 135 245 c
113 196 102 151 102 110 c
102 87 107 69 117 56 c
128 43 142 37 160 37 c
190 37 220 53 251 86 c
282 119 307 160 326 211 c
346 262 356 312 356 361 c

ce} _d
/h{500 0 19 -9 478 683 sc
465 118 m
478 105 l
447 62 422 32 401 15 c
380 -1 357 -9 332 -9 c
319 -9 308 -5 300 2 c
292 10 288 20 288 33 c
288 44 295 75 308 125 c
363 332 l
368 351 370 362 370 365 c
370 382 361 390 342 390 c
324 390 301 377 272 350 c
244 323 217 290 190 250 c
169 218 153 187 141 156 c
129 126 113 74 94 0 c
19 0 l
165 554 l
174 587 178 608 178 616 c
178 624 174 630 165 634 c
156 639 147 641 137 641 c
110 641 l
110 656 l
161 662 213 671 267 683 c
274 677 l
153 230 l
240 371 316 441 383 441 c
405 441 421 435 432 422 c
443 410 448 394 448 374 c
448 345 432 281 400 181 c
378 114 367 72 367 56 c
367 44 372 38 383 38 c
391 38 400 43 409 52 c
419 62 438 84 465 118 c

ce} _d
/i{278 0 49 -11 264 654 sc
264 599 m
264 585 259 573 249 563 c
240 553 228 548 215 548 c
200 548 189 553 180 562 c
171 572 167 585 167 601 c
167 616 171 629 180 639 c
189 649 201 654 214 654 c
227 654 239 648 249 637 c
259 626 264 614 264 599 c

222 114 m
235 103 l
207 60 183 30 164 13 c
145 -3 123 -11 98 -11 c
65 -11 49 7 49 44 c
49 63 56 100 71 155 c
119 332 l
125 353 128 368 128 376 c
128 386 124 392 116 395 c
109 398 91 399 64 400 c
64 416 l
95 419 148 427 224 441 c
228 438 l
134 95 l
127 72 124 58 124 51 c
124 41 129 36 138 36 c
155 36 183 62 222 114 c

ce} _d
/l{278 0 41 -11 279 683 sc
279 678 m
126 93 l
121 74 118 59 118 50 c
118 38 124 32 135 32 c
153 32 175 51 202 89 c
227 124 l
241 114 l
211 67 185 34 163 16 c
142 -2 117 -11 90 -11 c
57 -11 41 8 41 45 c
41 56 42 66 45 75 c
182 599 l
184 606 185 612 185 618 c
185 633 169 640 136 640 c
118 640 l
118 656 l
165 661 216 670 273 683 c
279 678 l

ce} _d
/m{722 0 12 -9 704 441 sc
704 105 m
699 98 l
648 27 600 -9 555 -9 c
528 -9 515 6 515 37 c
515 47 519 69 528 103 c
586 330 l
591 349 593 361 593 368 c
593 374 591 379 587 383 c
583 387 578 389 573 389 c
542 389 498 350 442 272 c
417 237 398 202 384 167 c
370 132 353 77 334 0 c
259 0 l
286 93 l
331 250 354 340 354 364 c
354 381 347 389 332 389 c
315 389 293 376 266 349 c
239 323 211 289 183 246 c
166 220 152 192 140 163 c
129 134 111 79 87 0 c
12 0 l
55 144 l
92 266 110 342 110 372 c
110 387 96 394 69 394 c
44 394 l
44 410 l
206 441 l
209 439 l
151 230 l
238 371 311 441 371 441 c
390 441 405 436 415 425 c
426 414 431 400 431 381 c
431 356 418 305 391 229 c
426 285 456 327 479 355 c
503 384 527 406 551 421 c
572 434 593 441 614 441 c
632 441 646 435 656 423 c
667 412 672 397 672 378 c
672 369 671 360 669 350 c
601 99 l
594 74 591 59 591 54 c
591 43 595 38 603 38 c
618 38 639 56 668 91 c
689 117 l
704 105 l

ce} _d
/n{500 0 14 -9 474 441 sc
460 117 m
474 104 l
440 57 414 27 396 12 c
378 -2 357 -9 334 -9 c
321 -9 309 -5 300 4 c
291 13 287 27 287 45 c
287 56 292 81 303 120 c
347 282 l
356 318 361 344 361 361 c
361 380 353 390 337 390 c
318 390 296 378 273 355 c
250 332 222 297 189 248 c
167 215 151 186 140 160 c
130 134 113 81 89 0 c
14 0 l
110 350 l
111 357 112 362 112 367 c
112 377 107 384 98 387 c
89 391 72 393 47 394 c
47 410 l
73 415 102 421 134 426 c
166 432 191 437 209 441 c
213 439 l
146 221 l
195 300 238 356 274 390 c
310 424 344 441 377 441 c
398 441 414 435 425 424 c
436 413 442 399 442 380 c
442 363 439 343 432 320 c
376 117 l
367 84 362 63 362 56 c
362 44 367 38 378 38 c
391 38 411 56 439 91 c
444 96 451 105 460 117 c

ce} _d
/o{500 0 27 -11 468 441 sc
468 301 m
468 263 458 223 439 182 c
420 141 395 105 362 72 c
307 17 244 -11 174 -11 c
127 -11 91 1 65 25 c
40 50 27 84 27 128 c
27 183 44 237 77 290 c
111 343 154 383 207 411 c
244 431 284 441 327 441 c
368 441 402 428 428 403 c
455 378 468 344 468 301 c

384 326 m
384 356 378 379 365 395 c
352 412 335 420 313 420 c
268 420 226 390 185 329 c
136 254 111 178 111 101 c
111 72 118 49 132 33 c
146 18 165 10 189 10 c
230 10 270 38 310 93 c
333 124 351 160 364 203 c
377 246 384 287 384 326 c

ce} _d
/p{504 0 -75 -205 472 441 sc
215 428 m
186 328 l
236 403 293 441 357 441 c
394 441 422 430 442 408 c
462 386 472 355 472 316 c
472 234 441 159 378 91 c
316 23 248 -11 175 -11 c
151 -11 128 -5 106 6 c
79 -104 66 -159 66 -160 c
66 -171 70 -178 79 -182 c
88 -187 105 -189 128 -189 c
128 -205 l
-75 -205 l
-75 -189 l
-54 -188 -38 -184 -29 -175 c
-20 -166 -13 -150 -7 -126 c
108 306 l
119 345 124 368 124 377 c
124 395 109 404 80 404 c
58 404 l
56 419 l
212 441 l
215 441 217 440 217 437 c
216 434 216 431 215 428 c

382 313 m
382 342 377 364 367 377 c
358 391 342 398 320 398 c
294 398 268 387 242 364 c
216 341 197 315 185 284 c
170 246 156 201 141 149 c
127 97 120 63 120 46 c
120 35 124 25 133 18 c
142 11 154 8 168 8 c
220 8 268 40 313 103 c
359 167 382 237 382 313 c

ce} _d
/uni03B1{552 0 27 -11 549 441 sc
549 428 m
407 167 l
407 149 l
407 123 410 100 416 80 c
422 60 430 50 441 50 c
456 50 473 75 492 124 c
508 117 l
483 33 450 -9 407 -9 c
374 -9 357 26 355 96 c
296 25 232 -11 161 -11 c
115 -11 81 3 59 31 c
38 59 27 96 27 141 c
27 182 35 222 51 261 c
68 301 90 335 118 364 c
141 387 167 405 198 419 c
229 434 260 441 291 441 c
331 441 362 429 384 405 c
406 382 417 354 417 322 c
463 428 l
549 428 l

359 272 m
359 371 333 420 282 420 c
247 420 210 389 169 328 c
129 267 109 199 109 125 c
109 93 115 66 126 43 c
137 21 155 10 178 10 c
227 10 282 74 343 201 c
344 205 345 211 348 220 c
351 229 354 238 356 247 c
358 256 359 264 359 272 c

ce} _d
/uni03B2{506 0 -40 -205 514 678 sc
-9 -127 m
128 368 l
137 400 146 429 155 454 c
165 480 178 507 193 536 c
208 565 225 590 243 609 c
261 629 283 645 309 658 c
335 671 363 678 393 678 c
424 678 452 670 477 653 c
502 637 514 612 514 577 c
514 539 501 503 474 469 c
448 435 419 411 386 396 c
386 395 l
408 393 428 382 446 362 c
465 343 474 317 474 284 c
474 238 456 189 421 136 c
386 84 344 45 297 19 c
262 -1 220 -11 173 -11 c
154 -11 132 -5 107 6 c
69 -127 l
60 -160 49 -186 38 -205 c
-40 -205 l
-29 -189 -19 -163 -9 -127 c

233 477 m
119 45 l
119 34 123 25 132 18 c
141 11 153 8 167 8 c
222 8 272 42 317 110 c
362 178 385 247 385 317 c
385 356 372 376 345 376 c
339 376 330 375 319 372 c
308 369 300 368 295 368 c
286 368 279 370 273 374 c
268 379 265 384 265 390 c
265 406 280 414 309 414 c
311 414 317 413 328 411 c
339 409 347 408 352 408 c
373 408 393 427 412 464 c
432 501 442 535 442 566 c
442 601 436 625 424 638 c
412 651 396 657 375 657 c
342 657 313 639 288 604 c
264 569 246 526 233 477 c

ce} _d
/uni03D1{556 0 19 -10 526 678 sc
526 206 m
521 187 l
496 189 473 193 450 199 c
424 138 391 87 351 48 c
311 9 264 -10 211 -10 c
122 -10 77 25 77 94 c
77 114 79 132 84 147 c
105 212 l
110 228 113 241 113 251 c
113 260 109 265 101 265 c
86 265 63 245 32 205 c
19 214 l
66 285 109 320 150 320 c
179 320 194 305 194 275 c
194 258 191 241 186 223 c
168 163 l
161 137 157 112 157 89 c
157 37 176 11 214 11 c
285 11 341 82 382 223 c
321 250 271 287 232 335 c
193 383 174 435 174 492 c
174 551 192 597 229 632 c
262 663 302 678 351 678 c
387 678 417 668 441 647 c
466 627 483 603 492 574 c
501 546 506 515 506 481 c
506 395 490 309 459 224 c
487 215 509 209 526 206 c

422 484 m
422 591 396 645 343 645 c
316 645 295 630 280 601 c
265 572 258 538 258 498 c
258 473 261 447 267 422 c
273 397 287 368 308 335 c
329 303 357 277 392 256 c
412 337 422 413 422 484 c

ce} _d
/uni03B7{474 0 14 -205 442 441 sc
148 228 m
150 227 l
239 370 312 441 371 441 c
392 441 409 436 422 426 c
435 417 442 403 442 384 c
442 368 439 347 432 321 c
345 0 l
325 -73 315 -130 315 -171 c
315 -181 318 -192 323 -205 c
250 -205 l
243 -196 239 -182 239 -161 c
239 -128 250 -71 272 9 c
347 283 l
356 314 361 338 361 355 c
361 378 353 390 336 390 c
309 390 272 359 223 296 c
174 234 140 171 121 106 c
89 0 l
14 0 l
96 305 l
105 338 110 359 110 367 c
110 378 105 384 96 384 c
93 384 90 383 87 382 c
84 381 81 378 78 375 c
75 372 71 370 68 367 c
65 364 62 361 58 356 c
55 352 52 348 49 345 c
47 342 44 339 40 334 c
37 330 34 327 33 326 c
21 336 l
30 351 39 364 50 377 c
83 418 115 438 147 438 c
174 438 187 423 187 393 c
187 366 174 311 148 228 c

ce} _d
/x{444 0 -27 -11 447 441 sc
243 355 m
255 298 l
290 352 319 389 340 410 c
362 431 384 441 406 441 c
418 441 428 437 435 430 c
443 423 447 415 447 404 c
447 393 444 385 437 378 c
431 371 423 368 413 368 c
407 368 399 371 389 376 c
379 382 370 385 361 385 c
342 385 309 345 263 264 c
263 255 266 240 271 219 c
303 85 l
310 58 320 44 333 44 c
344 44 359 57 380 84 c
382 87 384 90 387 93 c
390 97 392 100 394 103 c
396 106 398 109 401 112 c
416 103 l
387 58 365 28 348 12 c
331 -3 313 -11 294 -11 c
278 -11 266 -6 257 4 c
248 14 241 32 235 57 c
206 176 l
118 57 l
97 29 80 11 67 2 c
54 -7 40 -11 23 -11 c
8 -11 -4 -7 -13 0 c
-22 7 -27 18 -27 31 c
-27 41 -24 49 -17 56 c
-11 63 -3 67 7 67 c
15 67 26 63 39 56 c
49 50 58 47 65 47 c
76 47 93 63 116 96 c
198 212 l
170 336 l
163 365 157 384 151 392 c
146 400 137 404 124 404 c
116 404 103 402 85 397 c
67 392 l
64 408 l
75 412 l
128 431 167 441 192 441 c
205 441 215 435 222 423 c
229 411 236 388 243 355 c

ce} _d
/uni03BB{458 0 -12 -16 431 678 sc
415 123 m
431 123 l
410 30 377 -16 330 -16 c
315 -16 302 -8 292 7 c
282 23 277 47 277 78 c
277 96 278 116 279 139 c
281 162 283 191 286 226 c
289 261 292 291 293 315 c
84 0 l
-12 0 l
298 428 l
301 452 302 478 302 507 c
302 579 286 615 253 615 c
244 615 233 609 220 597 c
207 585 197 566 188 541 c
172 541 l
194 632 228 678 273 678 c
292 678 307 666 319 643 c
331 620 337 586 337 543 c
337 498 334 431 327 342 c
320 254 317 189 317 147 c
317 112 320 86 326 70 c
333 55 343 47 358 47 c
378 47 397 72 415 123 c

ce} _d
end readonly def

/BuildGlyph {
 exch begin
 CharStrings exch
 2 copy known not {pop /.notdef} if
 true 3 1 roll get exec
 end
} _d

/BuildChar {
 1 index /Encoding get exch get
 1 index /BuildGlyph get exec
} _d

FontName currentdict end definefont pop
%!PS-Adobe-3.0 Resource-Font
%%Creator: Converted from TrueType to Type 3 by Matplotlib.
10 dict begin
/FontName /STIXGeneral-Regular def
/PaintType 0 def
/FontMatrix [0.001 0 0 0.001 0 0] def
/FontBBox [-970 -443 2000 1023] def
/FontType 3 def
/Encoding [/space /comma /hyphen /one /two /three /four /equal /a /d /e /f /g /i /m /n /r /s /t /y] def
/CharStrings 21 dict dup begin
/.notdef 0 def
/space{250 0 0 0 0 0 sc
ce} _d
/comma{250 0 55 -141 195 102 sc
83 -141 m
73 -122 l
128 -85 156 -49 156 -15 c
156 -6 151 -2 142 -2 c
139 -2 135 -3 128 -4 c
122 -5 117 -6 113 -6 c
74 -6 55 11 55 45 c
55 62 60 76 71 86 c
82 97 97 102 115 102 c
138 102 157 94 172 77 c
187 61 195 40 195 15 c
195 -16 185 -45 164 -74 c
144 -103 117 -125 83 -141 c

ce} _d
/hyphen{333 0 39 194 285 257 sc
285 194 m
39 194 l
39 257 l
285 257 l
285 194 l

ce} _d
/one{500 0 111 0 394 676 sc
394 0 m
118 0 l
118 15 l
155 17 180 24 193 35 c
206 47 213 67 213 95 c
213 544 l
213 577 203 593 183 593 c
174 593 159 589 138 581 c
111 571 l
111 585 l
290 676 l
299 673 l
299 76 l
299 54 306 38 319 29 c
332 20 357 15 394 15 c
394 0 l

ce} _d
/two{500 0 29 0 474 676 sc
474 137 m
420 0 l
29 0 l
29 12 l
207 201 l
254 250 287 294 307 335 c
327 376 337 418 337 461 c
337 506 325 540 300 565 c
275 590 241 602 198 602 c
162 602 133 593 112 574 c
91 555 71 521 51 472 c
30 477 l
41 539 64 588 98 623 c
133 658 179 676 238 676 c
293 676 338 659 372 626 c
406 593 423 551 423 500 c
423 425 380 342 295 252 c
130 76 l
364 76 l
386 76 403 80 416 89 c
429 98 444 116 460 143 c
474 137 l

ce} _d
/three{500 0 41 -14 431 676 sc
61 510 m
45 514 l
60 564 84 603 117 632 c
150 661 191 676 241 676 c
288 676 325 663 354 638 c
383 613 397 580 397 539 c
397 484 366 438 304 401 c
341 385 368 367 387 348 c
416 315 431 272 431 219 c
431 166 416 119 385 79 c
362 48 330 25 287 9 c
245 -6 200 -14 153 -14 c
78 -14 41 5 41 43 c
41 54 45 62 53 69 c
61 76 71 79 82 79 c
99 79 119 70 143 53 c
172 32 201 22 229 22 c
266 22 296 37 321 66 c
346 96 359 132 359 175 c
359 252 324 300 255 320 c
234 327 200 330 153 330 c
153 344 l
190 357 218 369 237 380 c
291 411 318 455 318 514 c
318 547 308 573 289 590 c
270 607 244 616 210 616 c
150 616 100 581 61 510 c

ce} _d
/four{500 0 12 0 473 676 sc
473 167 m
370 167 l
370 0 l
292 0 l
292 167 l
12 167 l
12 231 l
326 676 l
370 676 l
370 231 l
473 231 l
473 167 l

292 231 m
292 574 l
52 231 l
292 231 l

ce} _d
/equal{685 0 48 120 637 386 sc
637 320 m
48 320 l
48 386 l
637 386 l
637 320 l

637 120 m
48 120 l
48 186 l
637 186 l
637 120 l

ce} _d
/a{444 0 37 -10 442 460 sc
442 66 m
442 38 l
417 6 387 -10 352 -10 c
314 -10 293 14 288 63 c
287 63 l
244 14 196 -10 142 -10 c
111 -10 85 -1 66 17 c
47 36 37 61 37 94 c
37 141 60 180 107 211 c
139 232 199 259 287 292 c
287 346 l
287 376 280 398 265 413 c
251 428 232 436 209 436 c
189 436 172 431 159 421 c
146 412 139 400 139 387 c
139 381 140 374 142 367 c
144 360 145 352 145 345 c
145 335 140 326 131 317 c
122 308 112 304 99 304 c
88 304 78 308 69 317 c
60 326 56 337 56 350 c
56 382 73 409 107 430 c
138 450 177 460 222 460 c
276 460 315 445 340 415 c
352 401 360 387 363 372 c
366 358 368 335 368 304 c
368 113 l
368 69 378 47 399 47 c
412 47 427 53 442 66 c

287 127 m
287 268 l
226 247 183 225 159 202 c
136 181 125 156 125 125 c
125 100 131 80 144 67 c
157 54 173 48 194 48 c
216 48 235 53 252 64 c
266 74 275 83 280 92 c
285 101 287 112 287 127 c

ce} _d
/d{500 0 27 -10 491 683 sc
491 42 m
344 -10 l
340 -7 l
340 57 l
308 12 265 -10 212 -10 c
157 -10 112 10 78 49 c
44 89 27 141 27 205 c
27 276 47 336 88 385 c
129 435 178 460 235 460 c
271 460 306 446 340 417 c
340 573 l
340 594 337 607 331 614 c
325 621 313 624 294 624 c
285 624 277 624 272 623 c
272 639 l
333 655 382 670 419 683 c
424 681 l
424 114 l
424 91 427 75 432 68 c
438 61 450 57 468 57 c
472 57 480 57 491 58 c
491 42 l

340 102 m
340 332 l
340 359 330 382 309 402 c
289 422 265 432 238 432 c
200 432 170 415 147 381 c
124 347 113 302 113 245 c
113 184 125 134 150 97 c
175 60 209 42 251 42 c
282 42 307 53 325 74 c
335 85 340 95 340 102 c

ce} _d
/e{444 0 25 -10 424 460 sc
408 164 m
424 157 l
384 46 314 -10 215 -10 c
156 -10 110 10 76 51 c
42 92 25 148 25 217 c
25 288 44 347 82 392 c
120 437 170 460 232 460 c
292 460 338 437 371 391 c
390 364 402 326 405 277 c
97 277 l
100 235 104 203 109 181 c
115 159 126 137 143 114 c
171 77 208 59 254 59 c
287 59 314 67 336 83 c
359 99 383 126 408 164 c

99 309 m
303 309 l
297 351 287 381 273 398 c
260 415 237 424 205 424 c
177 424 154 414 135 394 c
116 375 104 346 99 309 c

ce} _d
/f{333 0 20 0 383 683 sc
21 450 m
103 450 l
104 490 106 521 111 543 c
116 566 125 588 138 611 c
166 659 213 683 279 683 c
309 683 334 677 353 665 c
373 654 383 639 383 621 c
383 610 379 600 371 592 c
363 584 353 580 341 580 c
325 580 310 592 296 616 c
280 642 262 655 243 655 c
206 655 187 625 187 566 c
187 450 l
309 450 l
309 418 l
187 418 l
187 104 l
187 67 192 43 203 32 c
214 22 239 16 280 15 c
280 0 l
20 0 l
20 15 l
56 17 79 23 88 33 c
98 44 103 67 103 104 c
103 418 l
21 418 l
21 450 l

ce} _d
/g{500 0 28 -218 470 460 sc
470 388 m
387 388 l
400 359 406 331 406 304 c
406 253 389 214 354 188 c
319 162 285 149 250 149 c
243 149 230 150 212 152 c
193 154 l
180 150 166 141 153 127 c
140 113 133 101 133 91 c
133 76 159 67 211 64 c
340 58 l
377 57 406 46 428 27 c
450 8 461 -18 461 -49 c
461 -88 441 -123 401 -154 c
346 -197 279 -218 201 -218 c
153 -218 112 -208 78 -189 c
45 -170 28 -148 28 -121 c
28 -102 35 -84 50 -65 c
65 -47 90 -25 126 1 c
105 11 90 20 83 27 c
76 34 73 43 73 54 c
73 73 88 96 119 123 c
134 136 149 150 162 163 c
129 180 105 198 90 219 c
76 240 69 266 69 297 c
69 342 85 381 117 412 c
150 444 189 460 236 460 c
263 460 289 455 316 445 c
338 437 l
357 430 376 427 393 427 c
470 427 l
470 388 l

152 338 m
152 335 l
152 287 161 248 180 218 c
199 189 224 174 255 174 c
278 174 296 182 309 198 c
322 215 329 237 329 264 c
329 308 319 348 299 385 c
282 416 258 432 226 432 c
203 432 184 424 171 407 c
158 390 152 367 152 338 c

433 -64 m
433 -45 424 -32 405 -25 c
387 -18 355 -15 309 -15 c
243 -15 189 -11 147 -2 c
127 -26 114 -43 107 -54 c
101 -65 98 -77 98 -88 c
98 -110 111 -128 137 -141 c
164 -154 199 -161 243 -161 c
300 -161 345 -152 380 -134 c
415 -117 433 -93 433 -64 c

ce} _d
/i{278 0 16 0 253 683 sc
180 632 m
180 617 175 605 165 595 c
155 586 143 581 128 581 c
114 581 102 586 92 595 c
83 605 78 617 78 632 c
78 646 83 658 93 668 c
103 678 115 683 129 683 c
144 683 156 678 165 668 c
175 658 180 646 180 632 c

253 0 m
16 0 l
16 15 l
51 17 72 23 81 33 c
90 43 95 67 95 104 c
95 331 l
95 354 93 371 88 380 c
83 389 75 394 62 394 c
46 394 32 392 20 389 c
20 405 l
175 460 l
179 456 l
179 105 l
179 68 183 44 191 34 c
200 24 220 18 253 15 c
253 0 l

ce} _d
/m{778 0 16 0 775 460 sc
775 0 m
557 0 l
557 15 l
585 18 603 23 610 32 c
618 41 622 61 622 90 c
622 296 l
622 336 616 365 604 382 c
593 399 573 408 545 408 c
522 408 502 403 485 394 c
469 385 453 369 438 347 c
438 95 l
438 63 443 42 452 31 c
462 21 481 16 510 15 c
510 0 l
286 0 l
286 15 l
315 17 334 22 342 29 c
350 37 354 56 354 86 c
354 297 l
354 371 332 408 289 408 c
270 408 250 404 229 395 c
208 387 193 377 183 365 c
174 355 170 349 170 348 c
170 70 l
170 49 175 34 184 27 c
193 20 211 16 238 15 c
238 0 l
16 0 l
16 15 l
44 16 63 21 72 30 c
81 40 86 59 86 88 c
86 336 l
86 361 83 378 78 387 c
73 397 64 402 51 402 c
41 402 30 401 19 398 c
19 415 l
64 428 111 443 158 460 c
166 457 l
166 383 l
168 383 l
198 414 224 435 247 445 c
270 455 295 460 321 460 c
374 460 409 432 427 376 c
479 432 533 460 590 460 c
667 460 706 400 706 280 c
706 77 l
706 55 709 40 716 31 c
723 23 734 18 749 17 c
775 15 l
775 0 l

ce} _d
/n{500 0 16 0 485 460 sc
485 0 m
277 0 l
278 15 l
303 17 319 24 327 36 c
336 49 340 72 340 105 c
340 304 l
340 371 316 405 267 405 c
250 405 235 401 220 393 c
205 385 187 370 164 348 c
164 72 l
164 52 168 38 177 30 c
186 22 204 17 229 15 c
229 0 l
18 0 l
18 15 l
43 17 60 23 68 33 c
76 44 80 64 80 94 c
80 337 l
80 362 78 379 73 388 c
68 397 59 402 45 402 c
32 402 22 401 16 398 c
16 415 l
63 428 108 443 153 460 c
161 457 l
161 379 l
162 379 l
209 433 257 460 306 460 c
344 460 373 447 393 420 c
414 393 424 355 424 306 c
424 85 l
424 58 428 41 436 32 c
444 23 460 18 485 15 c
485 0 l

ce} _d
/r{333 0 5 0 335 460 sc
160 458 m
160 366 l
185 402 206 427 223 440 c
240 453 259 460 280 460 c
297 460 311 455 320 446 c
330 437 335 424 335 407 c
335 393 331 382 324 374 c
317 366 308 362 296 362 c
283 362 270 369 256 382 c
245 392 237 397 230 397 c
216 397 201 387 184 368 c
168 349 160 331 160 315 c
160 90 l
160 61 166 42 177 32 c
188 22 211 16 245 15 c
245 0 l
5 0 l
5 15 l
37 21 57 28 64 35 c
72 42 76 59 76 84 c
76 334 l
76 356 73 371 68 380 c
63 389 55 394 42 394 c
31 394 20 393 7 390 c
7 406 l
49 419 98 437 155 460 c
160 458 l

ce} _d
/s{389 0 51 -10 348 459 sc
156 301 m
260 238 l
293 218 316 199 329 182 c
342 165 348 142 348 115 c
348 82 334 52 306 27 c
279 2 246 -10 208 -10 c
177 -10 152 -7 135 -1 c
117 5 102 8 89 8 c
78 8 70 4 65 -4 c
52 -4 l
52 153 l
68 153 l
79 104 94 69 114 46 c
134 23 161 12 195 12 c
220 12 240 19 255 33 c
270 47 278 65 278 86 c
278 117 260 142 225 161 c
171 191 l
91 236 51 284 51 336 c
51 375 63 405 88 426 c
113 448 147 459 189 459 c
218 459 241 455 256 448 c
268 443 277 440 284 440 c
289 440 294 443 300 450 c
311 450 l
316 314 l
301 314 l
290 359 275 391 258 409 c
241 428 218 437 188 437 c
165 437 147 431 133 420 c
120 409 113 392 113 369 c
113 358 117 345 124 332 c
132 319 143 309 156 301 c

ce} _d
/t{278 0 13 -10 279 579 sc
266 77 m
279 66 l
247 15 207 -10 158 -10 c
99 -10 70 32 70 117 c
70 418 l
17 418 l
14 420 13 422 13 425 c
13 430 19 437 30 444 c
55 459 88 494 127 551 c
128 553 131 557 136 563 c
141 570 145 575 147 579 c
152 579 154 575 154 566 c
154 450 l
255 450 l
255 418 l
154 418 l
154 132 l
154 100 158 77 166 63 c
174 49 187 42 206 42 c
226 42 246 54 266 77 c

ce} _d
/y{500 0 14 -218 475 450 sc
475 450 m
475 435 l
463 434 453 429 446 422 c
439 415 432 402 425 384 c
275 -25 l
249 -96 223 -145 196 -174 c
170 -203 138 -218 100 -218 c
79 -218 62 -212 49 -201 c
36 -190 30 -177 30 -160 c
30 -147 34 -136 42 -127 c
51 -118 61 -114 73 -114 c
92 -114 110 -118 125 -127 c
134 -132 142 -134 151 -134 c
165 -134 182 -119 201 -90 c
210 -77 219 -58 228 -33 c
237 -8 241 9 241 18 c
241 27 227 60 199 119 c
67 401 l
58 420 41 432 14 436 c
14 450 l
219 450 l
219 435 l
198 434 183 432 174 428 c
166 424 162 417 162 408 c
162 401 166 387 175 367 c
287 117 l
384 393 l
387 399 388 405 388 411 c
388 427 373 435 342 435 c
342 450 l
475 450 l

ce} _d
end readonly def

/BuildGlyph {
 exch begin
 CharStrings exch
 2 copy known not {pop /.notdef} if
 true 3 1 roll get exec
 end
} _d

/BuildChar {
 1 index /Encoding get exch get
 1 index /BuildGlyph get exec
} _d

FontName currentdict end definefont pop
end
%%EndProlog
mpldict begin
58.428 259 translate
495.145 274 0 0 clipbox
gsave
0 0 m
495.144602 0 l
495.144602 274 l
0 274 l
cl
1.000 setgray
fill
grestore
gsave
35.2 59.6 m
238.769072 59.6 l
238.769072 251.8 l
35.2 251.8 l
cl
1.000 setgray
fill
grestore
0.800 setlinewidth
1 setlinejoin
2 setlinecap
[] 0 setdash
0.690 setgray
gsave
203.569 192.2 35.2 59.6 clipbox
44.267892 59.6 m
44.267892 251.8 l
stroke
grestore
0 setlinecap
0.000 setgray
gsave
/o {
gsave
newpath
translate
0.8 setlinewidth
1 setlinejoin

0 setlinecap

0 0 m
0 -3.5 l

gsave
0.000 setgray
fill
grestore
stroke
grestore
} bind def
44.2679 59.6 o
grestore
gsave
34.767892 44.787500 translate
0.000000 rotate
/STIXGeneral-Italic 12.0 selectfont
0.000000 0.703125 moveto
/uni03B7 glyphshow
/STIXGeneral-Italic 8.399999999999999 selectfont
5.687988 -0.885937 moveto
/m glyphshow
11.752779 -0.885937 moveto
/i glyphshow
14.087978 -0.885937 moveto
/n glyphshow
grestore
2 setlinecap
0.690 setgray
gsave
203.569 192.2 35.2 59.6 clipbox
99.842304 59.6 m
99.842304 251.8 l
stroke
grestore
0 setlinecap
0.000 setgray
gsave
/o {
gsave
newpath
translate
0.8 setlinewidth
1 setlinejoin

0 setlinecap

0 0 m
0 -3.5 l

gsave
0.000 setgray
fill
grestore
stroke
grestore
} bind def
99.8423 59.6 o
grestore
gsave
83.842304 43.600000 translate
0.000000 rotate
/STIXGeneral-Italic 12.0 selectfont
0.000000 0.859375 moveto
/uni03B2 glyphshow
/STIXGeneral-Italic 8.399999999999999 selectfont
6.071991 -0.729688 moveto
/h glyphshow
/STIXGeneral-Italic 12.0 selectfont
10.801668 0.859375 moveto
/uni03B7 glyphshow
/STIXGeneral-Italic 8.399999999999999 selectfont
16.489656 -0.729688 moveto
/m glyphshow
22.554446 -0.729688 moveto
/a glyphshow
26.762842 -0.729688 moveto
/x glyphshow
grestore
2 setlinecap
0.690 setgray
gsave
203.569 192.2 35.2 59.6 clipbox
173.94152 59.6 m
173.94152 251.8 l
stroke
grestore
0 setlinecap
0.000 setgray
gsave
/o {
gsave
newpath
translate
0.8 setlinewidth
1 setlinejoin

0 setlinecap

0 0 m
0 -3.5 l

gsave
0.000 setgray
fill
grestore
stroke
grestore
} bind def
173.942 59.6 o
grestore
gsave
157.941520 44.787500 translate
0.000000 rotate
/STIXGeneral-Italic 12.0 selectfont
0.000000 0.703125 moveto
/uni03B1 glyphshow
/STIXGeneral-Italic 8.399999999999999 selectfont
6.623993 -0.885937 moveto
/h glyphshow
/STIXGeneral-Italic 12.0 selectfont
11.353670 0.703125 moveto
/uni03B7 glyphshow
/STIXGeneral-Italic 8.399999999999999 selectfont
17.041658 -0.885937 moveto
/m glyphshow
23.106448 -0.885937 moveto
/a glyphshow
27.314844 -0.885937 moveto
/x glyphshow
grestore
2 setlinecap
0.690 setgray
gsave
203.569 192.2 35.2 59.6 clipbox
229.515932 59.6 m
229.515932 251.8 l
stroke
grestore
0 setlinecap
0.000 setgray
gsave
/o {
gsave
newpath
translate
0.8 setlinewidth
1 setlinejoin

0 setlinecap

0 0 m
0 -3.5 l

gsave
0.000 setgray
fill
grestore
stroke
grestore
} bind def
229.516 59.6 o
grestore
gsave
219.015932 44.787500 translate
0.000000 rotate
/STIXGeneral-Italic 12.0 selectfont
0.000000 0.703125 moveto
/uni03B7 glyphshow
/STIXGeneral-Italic 8.399999999999999 selectfont
5.687988 -0.885937 moveto
/m glyphshow
11.752779 -0.885937 moveto
/a glyphshow
15.961174 -0.885937 moveto
/x glyphshow
grestore
2 setlinecap
0.690 setgray
gsave
203.569 192.2 35.2 59.6 clipbox
35.2 68.336364 m
238.769072 68.336364 l
stroke
grestore
0 setlinecap
0.000 setgray
gsave
/o {
gsave
newpath
translate
0.8 setlinewidth
1 setlinejoin

0 setlinecap

-0 0 m
-3.5 0 l

gsave
0.000 setgray
fill
grestore
stroke
grestore
} bind def
35.2 68.3364 o
grestore
gsave
8.200000 64.141051 translate
0.000000 rotate
/STIXGeneral-Italic 12.0 selectfont
0.000000 0.796875 moveto
/h glyphshow
/STIXGeneral-Italic 8.399999999999999 selectfont
5.999985 -0.792188 moveto
/m glyphshow
12.064775 -0.792188 moveto
/i glyphshow
14.399974 -0.792188 moveto
/n glyphshow
grestore
2 setlinecap
0.690 setgray
gsave
203.569 192.2 35.2 59.6 clipbox
35.2 118.258442 m
238.769072 118.258442 l
stroke
grestore
0 setlinecap
0.000 setgray
gsave
/o {
gsave
newpath
translate
0.8 setlinewidth
1 setlinejoin

0 setlinecap

-0 0 m
-3.5 0 l

gsave
0.000 setgray
fill
grestore
stroke
grestore
} bind def
35.2 118.258 o
grestore
gsave
10.200000 114.063129 translate
0.000000 rotate
/STIXGeneral-Italic 12.0 selectfont
0.000000 0.796875 moveto
/h glyphshow
/STIXGeneral-Italic 8.399999999999999 selectfont
5.999985 -0.792188 moveto
/o glyphshow
10.199974 -0.792188 moveto
/l glyphshow
12.535173 -0.792188 moveto
/d glyphshow
grestore
2 setlinecap
0.690 setgray
gsave
203.569 192.2 35.2 59.6 clipbox
35.2 243.063636 m
238.769072 243.063636 l
stroke
grestore
0 setlinecap
0.000 setgray
gsave
/o {
gsave
newpath
translate
0.8 setlinewidth
1 setlinejoin

0 setlinecap

-0 0 m
-3.5 0 l

gsave
0.000 setgray
fill
grestore
stroke
grestore
} bind def
35.2 243.064 o
grestore
gsave
7.200000 238.868324 translate
0.000000 rotate
/STIXGeneral-Italic 12.0 selectfont
0.000000 0.796875 moveto
/h glyphshow
/STIXGeneral-Italic 8.399999999999999 selectfont
5.999985 -0.792188 moveto
/m glyphshow
12.064775 -0.792188 moveto
/a glyphshow
16.273170 -0.792188 moveto
/x glyphshow
grestore
1.500 setlinewidth
2 setlinecap
0.122 0.467 0.706 setrgbcolor
gsave
203.569 192.2 35.2 59.6 clipbox
44.45314 118.258442 m
46.322461 118.258442 l
48.191782 118.258442 l
50.061103 118.258442 l
51.930424 118.258442 l
53.799745 118.258442 l
55.669066 118.258442 l
57.538388 118.258442 l
59.407709 118.258442 l
61.27703 118.258442 l
63.146351 118.258442 l
65.015672 118.258442 l
66.884993 118.258442 l
68.754314 118.258442 l
70.623636 118.258442 l
72.492957 118.258442 l
74.362278 118.258442 l
76.231599 118.258442 l
78.10092 118.258442 l
79.970241 118.258442 l
81.839562 118.258442 l
83.708884 118.258442 l
85.578205 118.258442 l
87.447526 118.258442 l
89.316847 118.258442 l
91.186168 118.258442 l
93.055489 118.258442 l
94.92481 118.258442 l
96.794131 118.258442 l
98.663453 118.258442 l
100.532774 118.258442 l
102.402095 118.258442 l
104.271416 118.258442 l
106.140737 118.258442 l
108.010058 118.258442 l
109.879379 118.258442 l
111.748701 118.258442 l
113.618022 118.258442 l
115.487343 118.258442 l
117.356664 118.258442 l
119.225985 118.258442 l
121.095306 118.258442 l
122.964627 118.258442 l
124.833949 118.258442 l
126.70327 118.258442 l
128.572591 118.258442 l
130.441912 118.258442 l
132.311233 118.258442 l
134.180554 118.258442 l
136.049875 118.258442 l
137.919196 118.258442 l
139.788518 118.258442 l
141.657839 118.258442 l
143.52716 118.258442 l
145.396481 118.258442 l
147.265802 118.258442 l
149.135123 118.258442 l
151.004444 118.258442 l
152.873766 118.258442 l
154.743087 118.258442 l
156.612408 118.258442 l
158.481729 118.258442 l
160.35105 118.258442 l
162.220371 118.258442 l
164.089692 118.258442 l
165.959014 118.258442 l
167.828335 118.258442 l
169.697656 118.258442 l
171.566977 118.258442 l
173.436298 118.258442 l
175.305619 118.258442 l
177.17494 118.258442 l
179.044262 118.258442 l
180.913583 118.258442 l
182.782904 118.258442 l
184.652225 118.258442 l
186.521546 118.258442 l
188.390867 118.258442 l
190.260188 118.258442 l
192.129509 118.258442 l
193.998831 118.258442 l
195.868152 118.258442 l
197.737473 118.258442 l
199.606794 118.258442 l
201.476115 118.258442 l
203.345436 118.258442 l
205.214757 118.258442 l
207.084079 118.258442 l
208.9534 118.258442 l
210.822721 118.258442 l
212.692042 118.258442 l
214.561363 118.258442 l
216.430684 118.258442 l
218.300005 118.258442 l
220.169327 118.258442 l
222.038648 118.258442 l
223.907969 118.258442 l
225.77729 118.258442 l
227.646611 118.258442 l
229.515932 118.258442 l
stroke
grestore
0 setlinecap
[5.55 2.4] 0 setdash
1.000 0.498 0.055 setrgbcolor
gsave
203.569 192.2 35.2 59.6 clipbox
44.45314 200.909058 m
46.322461 195.529221 l
48.191782 190.487432 l
50.061103 185.752799 l
51.930424 181.298083 l
53.799745 177.099173 l
55.669066 173.134651 l
57.538388 169.385423 l
59.407709 165.834416 l
61.27703 162.466314 l
63.146351 159.267341 l
65.015672 156.22507 l
66.884993 153.328262 l
68.754314 150.566728 l
70.623636 147.931208 l
72.492957 145.41327 l
74.362278 143.005216 l
76.231599 140.700007 l
78.10092 138.491192 l
79.970241 136.372849 l
81.839562 134.33953 l
83.708884 132.386219 l
85.578205 130.508282 l
87.447526 128.701441 l
89.316847 126.961733 l
91.186168 125.285484 l
93.055489 123.669285 l
94.92481 122.109965 l
96.794131 120.604574 l
98.663453 119.150362 l
100.532774 118.258442 l
102.402095 118.258442 l
104.271416 118.258442 l
106.140737 118.258442 l
108.010058 118.258442 l
109.879379 118.258442 l
111.748701 118.258442 l
113.618022 118.258442 l
115.487343 118.258442 l
117.356664 118.258442 l
119.225985 118.258442 l
121.095306 118.258442 l
122.964627 118.258442 l
124.833949 118.258442 l
126.70327 118.258442 l
128.572591 118.258442 l
130.441912 118.258442 l
132.311233 118.258442 l
134.180554 118.258442 l
136.049875 118.258442 l
137.919196 118.258442 l
139.788518 118.258442 l
141.657839 118.258442 l
143.52716 118.258442 l
145.396481 118.258442 l
147.265802 118.258442 l
149.135123 118.258442 l
151.004444 118.258442 l
152.873766 118.258442 l
154.743087 118.258442 l
156.612408 118.258442 l
158.481729 118.258442 l
160.35105 118.258442 l
162.220371 118.258442 l
164.089692 118.258442 l
165.959014 118.258442 l
167.828335 118.258442 l
169.697656 118.258442 l
171.566977 118.258442 l
173.436298 118.258442 l
175.305619 116.265102 l
177.17494 113.683681 l
179.044262 111.261314 l
180.913583 108.983742 l
182.782904 106.838358 l
184.652225 104.81398 l
186.521546 102.900649 l
188.390867 101.089473 l
190.260188 99.372483 l
192.129509 97.742519 l
193.998831 96.193128 l
195.868152 94.718479 l
197.737473 93.313291 l
199.606794 91.97277 l
201.476115 90.692553 l
203.345436 89.468658 l
205.214757 88.29745 l
207.084079 87.175599 l
208.9534 86.100048 l
210.822721 85.067989 l
212.692042 84.076837 l
214.561363 83.124206 l
216.430684 82.207894 l
218.300005 81.325863 l
220.169327 80.476224 l
222.038648 79.657225 l
223.907969 78.867238 l
225.77729 78.104748 l
227.646611 77.368344 l
229.515932 76.65671 l
stroke
grestore
[9.6 2.4 1.5 2.4] 0 setdash
0.173 0.627 0.173 setrgbcolor
gsave
203.569 192.2 35.2 59.6 clipbox
44.45314 243.063636 m
46.322461 243.063636 l
48.191782 243.063636 l
50.061103 241.603194 l
51.930424 230.711578 l
53.799745 220.91109 l
55.669066 212.045586 l
57.538388 203.987359 l
59.407709 196.630947 l
61.27703 189.888491 l
63.146351 183.68621 l
65.015672 177.96169 l
66.884993 172.661775 l
68.754314 167.740914 l
70.623636 163.159844 l
72.492957 158.884546 l
74.362278 154.885395 l
76.231599 151.136473 l
78.10092 147.615006 l
79.970241 144.300905 l
81.839562 141.176376 l
83.708884 138.225605 l
85.578205 135.434492 l
87.447526 132.790418 l
89.316847 130.282063 l
91.186168 127.89924 l
93.055489 125.632753 l
94.92481 123.474288 l
96.794131 121.4163 l
98.663453 119.451934 l
100.532774 118.258442 l
102.402095 118.258442 l
104.271416 118.258442 l
106.140737 118.258442 l
108.010058 118.258442 l
109.879379 118.258442 l
111.748701 118.258442 l
113.618022 118.258442 l
115.487343 118.258442 l
117.356664 118.258442 l
119.225985 118.258442 l
121.095306 118.258442 l
122.964627 118.258442 l
124.833949 118.258442 l
126.70327 118.258442 l
128.572591 118.258442 l
130.441912 118.258442 l
132.311233 118.258442 l
134.180554 118.258442 l
136.049875 118.258442 l
137.919196 118.258442 l
139.788518 118.258442 l
141.657839 118.258442 l
143.52716 118.258442 l
145.396481 118.258442 l
147.265802 118.258442 l
149.135123 118.258442 l
151.004444 118.258442 l
152.873766 118.258442 l
154.743087 118.258442 l
156.612408 118.258442 l
158.481729 118.258442 l
160.35105 118.258442 l
162.220371 118.258442 l
164.089692 118.258442 l
165.959014 118.258442 l
167.828335 118.258442 l
169.697656 118.258442 l
171.566977 118.258442 l
173.436298 118.258442 l
175.305619 114.365039 l
177.17494 109.585768 l
179.044262 105.349763 l
180.913583 101.569375 l
182.782904 98.174847 l
184.652225 95.109971 l
186.521546 92.328952 l
188.390867 89.794099 l
190.260188 87.474113 l
192.129509 85.342786 l
193.998831 83.378003 l
195.868152 81.560979 l
197.737473 79.875649 l
199.606794 78.308196 l
201.476115 76.846672 l
203.345436 75.480689 l
205.214757 74.201176 l
207.084079 73.000173 l
208.9534 71.87067 l
210.822721 70.806466 l
212.692042 69.802059 l
214.561363 68.852545 l
216.430684 68.336364 l
218.300005 68.336364 l
220.169327 68.336364 l
222.038648 68.336364 l
223.907969 68.336364 l
225.77729 68.336364 l
227.646611 68.336364 l
229.515932 68.336364 l
stroke
grestore
[1.5 2.475] 0 setdash
0.839 0.153 0.157 setrgbcolor
gsave
203.569 192.2 35.2 59.6 clipbox
44.45314 243.063636 m
46.322461 243.063636 l
48.191782 243.063636 l
50.061103 243.063636 l
51.930424 243.063636 l
53.799745 243.063636 l
55.669066 241.073683 l
57.538388 228.961354 l
59.407709 218.194167 l
61.27703 208.559831 l
63.146351 199.888494 l
65.015672 192.042645 l
66.884993 184.909763 l
68.754314 178.396888 l
70.623636 172.42655 l
72.492957 166.933666 l
74.362278 161.863166 l
76.231599 157.168133 l
78.10092 152.808352 l
79.970241 148.749152 l
81.839562 144.960484 l
83.708884 141.416175 l
85.578205 138.093323 l
87.447526 134.971801 l
89.316847 132.033849 l
91.186168 129.263738 l
93.055489 126.647482 l
94.92481 124.172612 l
96.794131 121.827967 l
98.663453 119.603532 l
100.532774 118.258442 l
102.402095 118.258442 l
104.271416 118.258442 l
106.140737 118.258442 l
108.010058 118.258442 l
109.879379 118.258442 l
111.748701 118.258442 l
113.618022 118.258442 l
115.487343 118.258442 l
117.356664 118.258442 l
119.225985 118.258442 l
121.095306 118.258442 l
122.964627 118.258442 l
124.833949 118.258442 l
126.70327 118.258442 l
128.572591 118.258442 l
130.441912 118.258442 l
132.311233 118.258442 l
134.180554 118.258442 l
136.049875 118.258442 l
137.919196 118.258442 l
139.788518 118.258442 l
141.657839 118.258442 l
143.52716 118.258442 l
145.396481 118.258442 l
147.265802 118.258442 l
149.135123 118.258442 l
151.004444 118.258442 l
152.873766 118.258442 l
154.743087 118.258442 l
156.612408 118.258442 l
158.481729 118.258442 l
160.35105 118.258442 l
162.220371 118.258442 l
164.089692 118.258442 l
165.959014 118.258442 l
167.828335 118.258442 l
169.697656 118.258442 l
171.566977 118.258442 l
173.436298 118.258442 l
175.305619 112.551853 l
177.17494 105.89384 l
179.044262 100.28934 l
180.913583 95.506636 l
182.782904 91.377323 l
184.652225 87.776067 l
186.521546 84.607664 l
188.390867 81.798497 l
190.260188 79.290749 l
192.129509 77.038377 l
193.998831 75.004262 l
195.868152 73.158146 l
197.737473 71.475117 l
199.606794 69.934479 l
201.476115 68.518894 l
203.345436 68.336364 l
205.214757 68.336364 l
207.084079 68.336364 l
208.9534 68.336364 l
210.822721 68.336364 l
212.692042 68.336364 l
214.561363 68.336364 l
216.430684 68.336364 l
218.300005 68.336364 l
220.169327 68.336364 l
222.038648 68.336364 l
223.907969 68.336364 l
225.77729 68.336364 l
227.646611 68.336364 l
229.515932 68.336364 l
stroke
grestore
1.000 setlinewidth
2 setlinecap
[] 0 setdash
0.000 setgray
gsave
203.569 192.2 35.2 59.6 clipbox
44.267892 70.803346 m
45.297047 73.879001 l
46.326203 75.16684 l
47.355359 75.507858 l
48.384515 75.586113 l
49.41367 75.603459 l
50.442826 75.607273 l
51.471982 75.608111 l
52.501138 75.608295 l
53.530294 75.608335 l
54.559449 75.608344 l
55.588605 75.608346 l
56.617761 75.608346 l
57.646917 75.608346 l
58.676073 75.608346 l
59.705228 75.608346 l
60.734384 75.608347 l
61.76354 75.608349 l
62.792696 75.608358 l
63.821851 75.608398 l
64.851007 75.608582 l
65.880163 75.609419 l
66.909319 75.613234 l
67.938475 75.630579 l
68.96763 75.708835 l
69.996786 76.049852 l
71.025942 77.337691 l
72.055098 80.413346 l
73.084253 77.337691 l
74.113409 76.049852 l
75.142565 75.708835 l
76.171721 75.630579 l
77.200877 75.613234 l
78.230032 75.609419 l
79.259188 75.608582 l
80.288344 75.608398 l
81.3175 75.608358 l
82.346655 75.608349 l
83.375811 75.608347 l
84.404967 75.608346 l
85.434123 75.608346 l
86.463279 75.608346 l
87.492434 75.608346 l
88.52159 75.608346 l
89.550746 75.608344 l
90.579902 75.608335 l
91.609058 75.608295 l
92.638213 75.608111 l
93.667369 75.607273 l
94.696525 75.603459 l
95.725681 75.586113 l
96.754836 75.507858 l
97.783992 75.16684 l
98.813148 73.879001 l
99.842304 70.803346 l
stroke
grestore
gsave
203.569 192.2 35.2 59.6 clipbox
173.94152 145.686463 m
174.970676 148.762118 l
175.999832 150.049957 l
177.028987 150.390975 l
178.058143 150.46923 l
179.087299 150.486576 l
180.116455 150.49039 l
181.14561 150.491228 l
182.174766 150.491412 l
183.203922 150.491452 l
184.233078 150.491461 l
185.262234 150.491463 l
186.291389 150.491463 l
187.320545 150.491463 l
188.349701 150.491463 l
189.378857 150.491463 l
190.408013 150.491464 l
191.437168 150.491466 l
192.466324 150.491475 l
193.49548 150.491515 l
194.524636 150.491699 l
195.553791 150.492536 l
196.582947 150.496351 l
197.612103 150.513696 l
198.641259 150.591952 l
199.670415 150.932969 l
200.69957 152.220808 l
201.728726 155.296463 l
202.757882 152.220808 l
203.787038 150.932969 l
204.816193 150.591952 l
205.845349 150.513696 l
206.874505 150.496351 l
207.903661 150.492536 l
208.932817 150.491699 l
209.961972 150.491515 l
210.991128 150.491475 l
212.020284 150.491466 l
213.04944 150.491464 l
214.078595 150.491463 l
215.107751 150.491463 l
216.136907 150.491463 l
217.166063 150.491463 l
218.195219 150.491463 l
219.224374 150.491461 l
220.25353 150.491452 l
221.282686 150.491412 l
222.311842 150.491228 l
223.340998 150.49039 l
224.370153 150.486576 l
225.399309 150.46923 l
226.428465 150.390975 l
227.457621 150.049957 l
228.486776 148.762118 l
229.515932 145.686463 l
stroke
grestore
0.800 setlinewidth
0 setlinejoin
gsave
35.2 59.6 m
35.2 251.8 l
stroke
grestore
gsave
238.769072 59.6 m
238.769072 251.8 l
stroke
grestore
gsave
35.2 59.6 m
238.769072 59.6 l
stroke
grestore
gsave
35.2 251.8 m
238.769072 251.8 l
stroke
grestore
/STIXGeneral-Regular 10.000 selectfont
gsave

55.680098 83.546221 translate
0.000000 rotate
0.000000 0 m /d glyphshow
4.999985 0 m /e glyphshow
9.439972 0 m /r glyphshow
12.769958 0 m /e glyphshow
17.209946 0 m /f glyphshow
20.539932 0 m /i glyphshow
23.319916 0 m /n glyphshow
28.319901 0 m /e glyphshow
grestore
gsave

190.072476 158.429338 translate
0.000000 rotate
0.000000 0 m /r glyphshow
3.329987 0 m /e glyphshow
7.769974 0 m /f glyphshow
11.099960 0 m /i glyphshow
13.879944 0 m /n glyphshow
18.879929 0 m /e glyphshow
grestore
gsave
85.484536 257.800000 translate
0.000000 rotate
/STIXGeneral-Italic 12.0 selectfont
0.000000 0.796875 moveto
/h glyphshow
/STIXGeneral-Regular 12.0 selectfont
5.999985 0.796875 moveto
/hyphen glyphshow
9.995972 0.796875 moveto
/r glyphshow
13.991959 0.796875 moveto
/e glyphshow
19.319946 0.796875 moveto
/f glyphshow
23.315933 0.796875 moveto
/i glyphshow
26.651932 0.796875 moveto
/n glyphshow
32.651917 0.796875 moveto
/e glyphshow
37.979904 0.796875 moveto
/m glyphshow
47.315887 0.796875 moveto
/e glyphshow
52.643875 0.796875 moveto
/n glyphshow
58.643860 0.796875 moveto
/t glyphshow
61.979858 0.796875 moveto
/space glyphshow
64.979843 0.796875 moveto
/s glyphshow
69.647827 0.796875 moveto
/t glyphshow
72.983826 0.796875 moveto
/r glyphshow
76.979813 0.796875 moveto
/a glyphshow
82.307800 0.796875 moveto
/t glyphshow
85.643799 0.796875 moveto
/e glyphshow
90.971786 0.796875 moveto
/g glyphshow
96.971771 0.796875 moveto
/y glyphshow
grestore
gsave
283.12867 59.6 m
486.697742 59.6 l
486.697742 251.8 l
283.12867 251.8 l
cl
1.000 setgray
fill
grestore
1 setlinejoin
0.690 setgray
gsave
203.569 192.2 283.129 59.6 clipbox
292.196562 59.6 m
292.196562 251.8 l
stroke
grestore
0 setlinecap
0.000 setgray
gsave
/o {
gsave
newpath
translate
0.8 setlinewidth
1 setlinejoin

0 setlinecap

0 0 m
0 -3.5 l

gsave
0.000 setgray
fill
grestore
stroke
grestore
} bind def
292.197 59.6 o
grestore
gsave
282.696562 44.787500 translate
0.000000 rotate
/STIXGeneral-Italic 12.0 selectfont
0.000000 0.703125 moveto
/uni03B7 glyphshow
/STIXGeneral-Italic 8.399999999999999 selectfont
5.687988 -0.885937 moveto
/m glyphshow
11.752779 -0.885937 moveto
/i glyphshow
14.087978 -0.885937 moveto
/n glyphshow
grestore
2 setlinecap
0.690 setgray
gsave
203.569 192.2 283.129 59.6 clipbox
347.770974 59.6 m
347.770974 251.8 l
stroke
grestore
0 setlinecap
0.000 setgray
gsave
/o {
gsave
newpath
translate
0.8 setlinewidth
1 setlinejoin

0 setlinecap

0 0 m
0 -3.5 l

gsave
0.000 setgray
fill
grestore
stroke
grestore
} bind def
347.771 59.6 o
grestore
gsave
331.770974 43.600000 translate
0.000000 rotate
/STIXGeneral-Italic 12.0 selectfont
0.000000 0.859375 moveto
/uni03B2 glyphshow
/STIXGeneral-Italic 8.399999999999999 selectfont
6.071991 -0.729688 moveto
/p glyphshow
/STIXGeneral-Italic 12.0 selectfont
10.835271 0.859375 moveto
/uni03B7 glyphshow
/STIXGeneral-Italic 8.399999999999999 selectfont
16.523259 -0.729688 moveto
/m glyphshow
22.588049 -0.729688 moveto
/a glyphshow
26.796445 -0.729688 moveto
/x glyphshow
grestore
2 setlinecap
0.690 setgray
gsave
203.569 192.2 283.129 59.6 clipbox
421.87019 59.6 m
421.87019 251.8 l
stroke
grestore
0 setlinecap
0.000 setgray
gsave
/o {
gsave
newpath
translate
0.8 setlinewidth
1 setlinejoin

0 setlinecap

0 0 m
0 -3.5 l

gsave
0.000 setgray
fill
grestore
stroke
grestore
} bind def
421.87 59.6 o
grestore
gsave
405.870190 45.787500 translate
0.000000 rotate
/STIXGeneral-Italic 12.0 selectfont
0.000000 0.703125 moveto
/uni03B1 glyphshow
/STIXGeneral-Italic 8.399999999999999 selectfont
6.623993 -0.885937 moveto
/p glyphshow
/STIXGeneral-Italic 12.0 selectfont
11.387273 0.703125 moveto
/uni03B7 glyphshow
/STIXGeneral-Italic 8.399999999999999 selectfont
17.075261 -0.885937 moveto
/m glyphshow
23.140051 -0.885937 moveto
/a glyphshow
27.348447 -0.885937 moveto
/x glyphshow
grestore
2 setlinecap
0.690 setgray
gsave
203.569 192.2 283.129 59.6 clipbox
477.444602 59.6 m
477.444602 251.8 l
stroke
grestore
0 setlinecap
0.000 setgray
gsave
/o {
gsave
newpath
translate
0.8 setlinewidth
1 setlinejoin

0 setlinecap

0 0 m
0 -3.5 l

gsave
0.000 setgray
fill
grestore
stroke
grestore
} bind def
477.445 59.6 o
grestore
gsave
466.944602 44.787500 translate
0.000000 rotate
/STIXGeneral-Italic 12.0 selectfont
0.000000 0.703125 moveto
/uni03B7 glyphshow
/STIXGeneral-Italic 8.399999999999999 selectfont
5.687988 -0.885937 moveto
/m glyphshow
11.752779 -0.885937 moveto
/a glyphshow
15.961174 -0.885937 moveto
/x glyphshow
grestore
2 setlinecap
0.690 setgray
gsave
203.569 192.2 283.129 59.6 clipbox
283.12867 68.336364 m
486.697742 68.336364 l
stroke
grestore
0 setlinecap
0.000 setgray
gsave
/o {
gsave
newpath
translate
0.8 setlinewidth
1 setlinejoin

0 setlinecap

-0 0 m
-3.5 0 l

gsave
0.000 setgray
fill
grestore
stroke
grestore
} bind def
283.129 68.3364 o
grestore
gsave
254.128670 64.234801 translate
0.000000 rotate
/STIXGeneral-Italic 12.0 selectfont
0.000000 0.703125 moveto
/m glyphshow
/STIXGeneral-Italic 8.399999999999999 selectfont
8.663986 -0.885937 moveto
/m glyphshow
14.728777 -0.885937 moveto
/i glyphshow
17.063976 -0.885937 moveto
/n glyphshow
grestore
2 setlinecap
0.690 setgray
gsave
203.569 192.2 283.129 59.6 clipbox
283.12867 168.180519 m
486.697742 168.180519 l
stroke
grestore
0 setlinecap
0.000 setgray
gsave
/o {
gsave
newpath
translate
0.8 setlinewidth
1 setlinejoin

0 setlinecap

-0 0 m
-3.5 0 l

gsave
0.000 setgray
fill
grestore
stroke
grestore
} bind def
283.129 168.181 o
grestore
gsave
256.128670 164.078957 translate
0.000000 rotate
/STIXGeneral-Italic 12.0 selectfont
0.000000 0.703125 moveto
/m glyphshow
/STIXGeneral-Italic 8.399999999999999 selectfont
8.663986 -0.885937 moveto
/o glyphshow
12.863976 -0.885937 moveto
/l glyphshow
15.199174 -0.885937 moveto
/d glyphshow
grestore
2 setlinecap
0.690 setgray
gsave
203.569 192.2 283.129 59.6 clipbox
283.12867 243.063636 m
486.697742 243.063636 l
stroke
grestore
0 setlinecap
0.000 setgray
gsave
/o {
gsave
newpath
translate
0.8 setlinewidth
1 setlinejoin

0 setlinecap

-0 0 m
-3.5 0 l

gsave
0.000 setgray
fill
grestore
stroke
grestore
} bind def
283.129 243.064 o
grestore
gsave
252.128670 238.962074 translate
0.000000 rotate
/STIXGeneral-Italic 12.0 selectfont
0.000000 0.703125 moveto
/m glyphshow
/STIXGeneral-Italic 8.399999999999999 selectfont
8.663986 -0.885937 moveto
/m glyphshow
14.728777 -0.885937 moveto
/a glyphshow
18.937172 -0.885937 moveto
/x glyphshow
grestore
1.500 setlinewidth
2 setlinecap
0.122 0.467 0.706 setrgbcolor
gsave
203.569 192.2 283.129 59.6 clipbox
292.38181 168.180519 m
294.251131 168.180519 l
296.120452 168.180519 l
297.989773 168.180519 l
299.859094 168.180519 l
301.728415 168.180519 l
303.597736 168.180519 l
305.467058 168.180519 l
307.336379 168.180519 l
309.2057 168.180519 l
311.075021 168.180519 l
312.944342 168.180519 l
314.813663 168.180519 l
316.682984 168.180519 l
318.552306 168.180519 l
320.421627 168.180519 l
322.290948 168.180519 l
324.160269 168.180519 l
326.02959 168.180519 l
327.898911 168.180519 l
329.768232 168.180519 l
331.637554 168.180519 l
333.506875 168.180519 l
335.376196 168.180519 l
337.245517 168.180519 l
339.114838 168.180519 l
340.984159 168.180519 l
342.85348 168.180519 l
344.722802 168.180519 l
346.592123 168.180519 l
348.461444 168.180519 l
350.330765 168.180519 l
352.200086 168.180519 l
354.069407 168.180519 l
355.938728 168.180519 l
357.808049 168.180519 l
359.677371 168.180519 l
361.546692 168.180519 l
363.416013 168.180519 l
365.285334 168.180519 l
367.154655 168.180519 l
369.023976 168.180519 l
370.893297 168.180519 l
372.762619 168.180519 l
374.63194 168.180519 l
376.501261 168.180519 l
378.370582 168.180519 l
380.239903 168.180519 l
382.109224 168.180519 l
383.978545 168.180519 l
385.847867 168.180519 l
387.717188 168.180519 l
389.586509 168.180519 l
391.45583 168.180519 l
393.325151 168.180519 l
395.194472 168.180519 l
397.063793 168.180519 l
398.933114 168.180519 l
400.802436 168.180519 l
402.671757 168.180519 l
404.541078 168.180519 l
406.410399 168.180519 l
408.27972 168.180519 l
410.149041 168.180519 l
412.018362 168.180519 l
413.887684 168.180519 l
415.757005 168.180519 l
417.626326 168.180519 l
419.495647 168.180519 l
421.364968 168.180519 l
423.234289 168.180519 l
425.10361 168.180519 l
426.972932 168.180519 l
428.842253 168.180519 l
430.711574 168.180519 l
432.580895 168.180519 l
434.450216 168.180519 l
436.319537 168.180519 l
438.188858 168.180519 l
440.05818 168.180519 l
441.927501 168.180519 l
443.796822 168.180519 l
445.666143 168.180519 l
447.535464 168.180519 l
449.404785 168.180519 l
451.274106 168.180519 l
453.143427 168.180519 l
455.012749 168.180519 l
456.88207 168.180519 l
458.751391 168.180519 l
460.620712 168.180519 l
462.490033 168.180519 l
464.359354 168.180519 l
466.228675 168.180519 l
468.097997 168.180519 l
469.967318 168.180519 l
471.836639 168.180519 l
473.70596 168.180519 l
475.575281 168.180519 l
477.444602 168.180519 l
stroke
grestore
0 setlinecap
[5.55 2.4] 0 setdash
1.000 0.498 0.055 setrgbcolor
gsave
203.569 192.2 283.129 59.6 clipbox
292.38181 118.258442 m
294.251131 118.258442 l
296.120452 118.258442 l
297.989773 118.258442 l
299.859094 118.258442 l
301.728415 118.258442 l
303.597736 118.258442 l
305.467058 118.258442 l
307.336379 118.258442 l
309.2057 118.258442 l
311.075021 118.258442 l
312.944342 118.258442 l
314.813663 118.258442 l
316.682984 118.258442 l
318.552306 118.258442 l
320.421627 118.258442 l
322.290948 118.258442 l
324.160269 143.219481 l
326.02959 143.219481 l
327.898911 143.219481 l
329.768232 143.219481 l
331.637554 143.219481 l
333.506875 143.219481 l
335.376196 143.219481 l
337.245517 143.219481 l
339.114838 143.219481 l
340.984159 143.219481 l
342.85348 168.180519 l
344.722802 168.180519 l
346.592123 168.180519 l
348.461444 168.180519 l
350.330765 168.180519 l
352.200086 168.180519 l
354.069407 168.180519 l
355.938728 168.180519 l
357.808049 168.180519 l
359.677371 168.180519 l
361.546692 168.180519 l
363.416013 168.180519 l
365.285334 168.180519 l
367.154655 168.180519 l
369.023976 168.180519 l
370.893297 168.180519 l
372.762619 168.180519 l
374.63194 168.180519 l
376.501261 168.180519 l
378.370582 168.180519 l
380.239903 168.180519 l
382.109224 168.180519 l
383.978545 168.180519 l
385.847867 168.180519 l
387.717188 168.180519 l
389.586509 168.180519 l
391.45583 168.180519 l
393.325151 168.180519 l
395.194472 168.180519 l
397.063793 168.180519 l
398.933114 168.180519 l
400.802436 168.180519 l
402.671757 168.180519 l
404.541078 168.180519 l
406.410399 168.180519 l
408.27972 168.180519 l
410.149041 168.180519 l
412.018362 168.180519 l
413.887684 168.180519 l
415.757005 168.180519 l
417.626326 168.180519 l
419.495647 168.180519 l
421.364968 168.180519 l
423.234289 168.180519 l
425.10361 168.180519 l
426.972932 168.180519 l
428.842253 168.180519 l
430.711574 168.180519 l
432.580895 193.141558 l
434.450216 193.141558 l
436.319537 193.141558 l
438.188858 193.141558 l
440.05818 193.141558 l
441.927501 193.141558 l
443.796822 193.141558 l
445.666143 193.141558 l
447.535464 218.102597 l
449.404785 218.102597 l
451.274106 218.102597 l
453.143427 218.102597 l
455.012749 218.102597 l
456.88207 218.102597 l
458.751391 218.102597 l
460.620712 243.063636 l
462.490033 243.063636 l
464.359354 243.063636 l
466.228675 243.063636 l
468.097997 243.063636 l
469.967318 243.063636 l
471.836639 243.063636 l
473.70596 243.063636 l
475.575281 243.063636 l
477.444602 243.063636 l
stroke
grestore
[9.6 2.4 1.5 2.4] 0 setdash
0.173 0.627 0.173 setrgbcolor
gsave
203.569 192.2 283.129 59.6 clipbox
292.38181 93.297403 m
294.251131 93.297403 l
296.120452 93.297403 l
297.989773 93.297403 l
299.859094 93.297403 l
301.728415 93.297403 l
303.597736 93.297403 l
305.467058 93.297403 l
307.336379 93.297403 l
309.2057 93.297403 l
311.075021 93.297403 l
312.944342 93.297403 l
314.813663 93.297403 l
316.682984 93.297403 l
318.552306 93.297403 l
320.421627 118.258442 l
322.290948 118.258442 l
324.160269 118.258442 l
326.02959 118.258442 l
327.898911 118.258442 l
329.768232 118.258442 l
331.637554 118.258442 l
333.506875 118.258442 l
335.376196 118.258442 l
337.245517 143.219481 l
339.114838 143.219481 l
340.984159 143.219481 l
342.85348 143.219481 l
344.722802 168.180519 l
346.592123 168.180519 l
348.461444 168.180519 l
350.330765 168.180519 l
352.200086 168.180519 l
354.069407 168.180519 l
355.938728 168.180519 l
357.808049 168.180519 l
359.677371 168.180519 l
361.546692 168.180519 l
363.416013 168.180519 l
365.285334 168.180519 l
367.154655 168.180519 l
369.023976 168.180519 l
370.893297 168.180519 l
372.762619 168.180519 l
374.63194 168.180519 l
376.501261 168.180519 l
378.370582 168.180519 l
380.239903 168.180519 l
382.109224 168.180519 l
383.978545 168.180519 l
385.847867 168.180519 l
387.717188 168.180519 l
389.586509 168.180519 l
391.45583 168.180519 l
393.325151 168.180519 l
395.194472 168.180519 l
397.063793 168.180519 l
398.933114 168.180519 l
400.802436 168.180519 l
402.671757 168.180519 l
404.541078 168.180519 l
406.410399 168.180519 l
408.27972 168.180519 l
410.149041 168.180519 l
412.018362 168.180519 l
413.887684 168.180519 l
415.757005 168.180519 l
417.626326 168.180519 l
419.495647 168.180519 l
421.364968 168.180519 l
423.234289 168.180519 l
425.10361 168.180519 l
426.972932 168.180519 l
428.842253 168.180519 l
430.711574 193.141558 l
432.580895 193.141558 l
434.450216 193.141558 l
436.319537 193.141558 l
438.188858 193.141558 l
440.05818 193.141558 l
441.927501 218.102597 l
443.796822 218.102597 l
445.666143 218.102597 l
447.535464 218.102597 l
449.404785 218.102597 l
451.274106 243.063636 l
453.143427 243.063636 l
455.012749 243.063636 l
456.88207 243.063636 l
458.751391 243.063636 l
460.620712 243.063636 l
462.490033 243.063636 l
464.359354 243.063636 l
466.228675 243.063636 l
468.097997 243.063636 l
469.967318 243.063636 l
471.836639 243.063636 l
473.70596 243.063636 l
475.575281 243.063636 l
477.444602 243.063636 l
stroke
grestore
[1.5 2.475] 0 setdash
0.839 0.153 0.157 setrgbcolor
gsave
203.569 192.2 283.129 59.6 clipbox
292.38181 68.336364 m
294.251131 68.336364 l
296.120452 68.336364 l
297.989773 68.336364 l
299.859094 68.336364 l
301.728415 68.336364 l
303.597736 68.336364 l
305.467058 93.297403 l
307.336379 93.297403 l
309.2057 93.297403 l
311.075021 93.297403 l
312.944342 93.297403 l
314.813663 93.297403 l
316.682984 93.297403 l
318.552306 93.297403 l
320.421627 93.297403 l
322.290948 93.297403 l
324.160269 93.297403 l
326.02959 93.297403 l
327.898911 93.297403 l
329.768232 118.258442 l
331.637554 118.258442 l
333.506875 118.258442 l
335.376196 118.258442 l
337.245517 118.258442 l
339.114838 118.258442 l
340.984159 143.219481 l
342.85348 143.219481 l
344.722802 143.219481 l
346.592123 168.180519 l
348.461444 168.180519 l
350.330765 168.180519 l
352.200086 168.180519 l
354.069407 168.180519 l
355.938728 168.180519 l
357.808049 168.180519 l
359.677371 168.180519 l
361.546692 168.180519 l
363.416013 168.180519 l
365.285334 168.180519 l
367.154655 168.180519 l
369.023976 168.180519 l
370.893297 168.180519 l
372.762619 168.180519 l
374.63194 168.180519 l
376.501261 168.180519 l
378.370582 168.180519 l
380.239903 168.180519 l
382.109224 168.180519 l
383.978545 168.180519 l
385.847867 168.180519 l
387.717188 168.180519 l
389.586509 168.180519 l
391.45583 168.180519 l
393.325151 168.180519 l
395.194472 168.180519 l
397.063793 168.180519 l
398.933114 168.180519 l
400.802436 168.180519 l
402.671757 168.180519 l
404.541078 168.180519 l
406.410399 168.180519 l
408.27972 168.180519 l
410.149041 168.180519 l
412.018362 168.180519 l
413.887684 168.180519 l
415.757005 168.180519 l
417.626326 168.180519 l
419.495647 168.180519 l
421.364968 168.180519 l
423.234289 168.180519 l
425.10361 168.180519 l
426.972932 168.180519 l
428.842253 193.141558 l
430.711574 193.141558 l
432.580895 193.141558 l
434.450216 193.141558 l
436.319537 193.141558 l
438.188858 193.141558 l
440.05818 218.102597 l
441.927501 218.102597 l
443.796822 218.102597 l
445.666143 218.102597 l
447.535464 243.063636 l
449.404785 243.063636 l
451.274106 243.063636 l
453.143427 243.063636 l
455.012749 243.063636 l
456.88207 243.063636 l
458.751391 243.063636 l
460.620712 243.063636 l
462.490033 243.063636 l
464.359354 243.063636 l
466.228675 243.063636 l
468.097997 243.063636 l
469.967318 243.063636 l
471.836639 243.063636 l
473.70596 243.063636 l
475.575281 243.063636 l
477.444602 243.063636 l
stroke
grestore
1.000 setlinewidth
2 setlinecap
[] 0 setdash
0.000 setgray
gsave
203.569 192.2 283.129 59.6 clipbox
292.196562 187.288195 m
293.225717 190.36385 l
294.254873 191.651689 l
295.284029 191.992706 l
296.313185 192.070962 l
297.342341 192.088307 l
298.371496 192.092122 l
299.400652 192.092959 l
300.429808 192.093143 l
301.458964 192.093183 l
302.488119 192.093192 l
303.517275 192.093194 l
304.546431 192.093195 l
305.575587 192.093195 l
306.604743 192.093195 l
307.633898 192.093195 l
308.663054 192.093195 l
309.69221 192.093197 l
310.721366 192.093206 l
311.750521 192.093246 l
312.779677 192.09343 l
313.808833 192.094268 l
314.837989 192.098082 l
315.867145 192.115428 l
316.8963 192.193683 l
317.925456 192.534701 l
318.954612 193.82254 l
319.983768 196.898195 l
321.012924 193.82254 l
322.042079 192.534701 l
323.071235 192.193683 l
324.100391 192.115428 l
325.129547 192.098082 l
326.158702 192.094268 l
327.187858 192.09343 l
328.217014 192.093246 l
329.24617 192.093206 l
330.275326 192.093197 l
331.304481 192.093195 l
332.333637 192.093195 l
333.362793 192.093195 l
334.391949 192.093195 l
335.421104 192.093195 l
336.45026 192.093194 l
337.479416 192.093192 l
338.508572 192.093183 l
339.537728 192.093143 l
340.566883 192.092959 l
341.596039 192.092122 l
342.625195 192.088307 l
343.654351 192.070962 l
344.683506 191.992706 l
345.712662 191.651689 l
346.741818 190.36385 l
347.770974 187.288195 l
stroke
grestore
gsave
203.569 192.2 283.129 59.6 clipbox
421.87019 87.444039 m
422.899346 90.519694 l
423.928502 91.807533 l
424.957657 92.14855 l
425.986813 92.226806 l
427.015969 92.244151 l
428.045125 92.247966 l
429.074281 92.248803 l
430.103436 92.248987 l
431.132592 92.249028 l
432.161748 92.249036 l
433.190904 92.249038 l
434.220059 92.249039 l
435.249215 92.249039 l
436.278371 92.249039 l
437.307527 92.249039 l
438.336683 92.24904 l
439.365838 92.249041 l
440.394994 92.24905 l
441.42415 92.249091 l
442.453306 92.249274 l
443.482461 92.250112 l
444.511617 92.253927 l
445.540773 92.271272 l
446.569929 92.349527 l
447.599085 92.690545 l
448.62824 93.978384 l
449.657396 97.054039 l
450.686552 93.978384 l
451.715708 92.690545 l
452.744864 92.349527 l
453.774019 92.271272 l
454.803175 92.253927 l
455.832331 92.250112 l
456.861487 92.249274 l
457.890642 92.249091 l
458.919798 92.24905 l
459.948954 92.249041 l
460.97811 92.24904 l
462.007266 92.249039 l
463.036421 92.249039 l
464.065577 92.249039 l
465.094733 92.249039 l
466.123889 92.249038 l
467.153044 92.249036 l
468.1822 92.249028 l
469.211356 92.248987 l
470.240512 92.248803 l
471.269668 92.247966 l
472.298823 92.244151 l
473.327979 92.226806 l
474.357135 92.14855 l
475.386291 91.807533 l
476.415446 90.519694 l
477.444602 87.444039 l
stroke
grestore
0.800 setlinewidth
0 setlinejoin
gsave
283.12867 59.6 m
283.12867 251.8 l
stroke
grestore
gsave
486.697742 59.6 m
486.697742 251.8 l
stroke
grestore
gsave
283.12867 59.6 m
486.697742 59.6 l
stroke
grestore
gsave
283.12867 251.8 m
486.697742 251.8 l
stroke
grestore
gsave

303.608768 200.031070 translate
0.000000 rotate
0.000000 0 m /d glyphshow
4.999985 0 m /e glyphshow
9.439972 0 m /r glyphshow
12.769958 0 m /e glyphshow
17.209946 0 m /f glyphshow
20.539932 0 m /i glyphshow
23.319916 0 m /n glyphshow
28.319901 0 m /e glyphshow
grestore
gsave

438.001146 100.186914 translate
0.000000 rotate
0.000000 0 m /r glyphshow
3.329987 0 m /e glyphshow
7.769974 0 m /f glyphshow
11.099960 0 m /i glyphshow
13.879944 0 m /n glyphshow
18.879929 0 m /e glyphshow
grestore
gsave
332.913206 257.800000 translate
0.000000 rotate
/STIXGeneral-Italic 12.0 selectfont
0.000000 0.796875 moveto
/p glyphshow
/STIXGeneral-Regular 12.0 selectfont
6.047989 0.796875 moveto
/hyphen glyphshow
10.043976 0.796875 moveto
/r glyphshow
14.039963 0.796875 moveto
/e glyphshow
19.367950 0.796875 moveto
/f glyphshow
23.363937 0.796875 moveto
/i glyphshow
26.699936 0.796875 moveto
/n glyphshow
32.699921 0.796875 moveto
/e glyphshow
38.027908 0.796875 moveto
/m glyphshow
47.363892 0.796875 moveto
/e glyphshow
52.691879 0.796875 moveto
/n glyphshow
58.691864 0.796875 moveto
/t glyphshow
62.027863 0.796875 moveto
/space glyphshow
65.027847 0.796875 moveto
/s glyphshow
69.695831 0.796875 moveto
/t glyphshow
73.031830 0.796875 moveto
/r glyphshow
77.027817 0.796875 moveto
/a glyphshow
82.355804 0.796875 moveto
/t glyphshow
85.691803 0.796875 moveto
/e glyphshow
91.019791 0.796875 moveto
/g glyphshow
97.019775 0.796875 moveto
/y glyphshow
grestore
1.000 setlinewidth
0 setlinecap
0.800 setgray
gsave
90.581256 7.2 m
442.581256 7.2 l
443.914589 7.2 444.581256 7.866667 444.581256 9.2 c
444.581256 22.371875 l
444.581256 23.705208 443.914589 24.371875 442.581256 24.371875 c
90.581256 24.371875 l
89.247922 24.371875 88.581256 23.705208 88.581256 22.371875 c
88.581256 9.2 l
88.581256 7.866667 89.247922 7.2 90.581256 7.2 c
cl
gsave
1.000 setgray
fill
grestore
stroke
grestore
1.500 setlinewidth
1 setlinejoin
2 setlinecap
0.122 0.467 0.706 setrgbcolor
gsave
92.581256 16.871875 m
102.581256 16.871875 l
112.581256 16.871875 l
stroke
grestore
0.000 setgray
gsave
120.581256 13.371875 translate
0.000000 rotate
/STIXGeneral-Italic 10.0 selectfont
0.000000 0.218750 moveto
/uni03BB glyphshow
/STIXGeneral-Regular 10.0 selectfont
6.023984 0.218750 moveto
/equal glyphshow
14.317972 0.218750 moveto
/one glyphshow
19.317957 0.218750 moveto
/comma glyphshow
/STIXGeneral-Italic 10.0 selectfont
23.261938 0.218750 moveto
/uni03D1 glyphshow
/STIXGeneral-Regular 10.0 selectfont
30.265918 0.218750 moveto
/equal glyphshow
38.559906 0.218750 moveto
/one glyphshow
grestore
0 setlinecap
[5.55 2.4] 0 setdash
1.000 0.498 0.055 setrgbcolor
gsave
184.581256 16.871875 m
194.581256 16.871875 l
204.581256 16.871875 l
stroke
grestore
0.000 setgray
gsave
212.581256 13.371875 translate
0.000000 rotate
/STIXGeneral-Italic 10.0 selectfont
0.000000 0.218750 moveto
/uni03BB glyphshow
/STIXGeneral-Regular 10.0 selectfont
6.023984 0.218750 moveto
/equal glyphshow
14.317972 0.218750 moveto
/two glyphshow
19.317957 0.218750 moveto
/comma glyphshow
/STIXGeneral-Italic 10.0 selectfont
23.261938 0.218750 moveto
/uni03D1 glyphshow
/STIXGeneral-Regular 10.0 selectfont
30.265918 0.218750 moveto
/equal glyphshow
38.559906 0.218750 moveto
/two glyphshow
grestore
[9.6 2.4 1.5 2.4] 0 setdash
0.173 0.627 0.173 setrgbcolor
gsave
276.581256 16.871875 m
286.581256 16.871875 l
296.581256 16.871875 l
stroke
grestore
0.000 setgray
gsave
304.581256 13.371875 translate
0.000000 rotate
/STIXGeneral-Italic 10.0 selectfont
0.000000 0.218750 moveto
/uni03BB glyphshow
/STIXGeneral-Regular 10.0 selectfont
6.023984 0.218750 moveto
/equal glyphshow
14.317972 0.218750 moveto
/three glyphshow
19.317957 0.218750 moveto
/comma glyphshow
/STIXGeneral-Italic 10.0 selectfont
23.261938 0.218750 moveto
/uni03D1 glyphshow
/STIXGeneral-Regular 10.0 selectfont
30.265918 0.218750 moveto
/equal glyphshow
38.559906 0.218750 moveto
/three glyphshow
grestore
[1.5 2.475] 0 setdash
0.839 0.153 0.157 setrgbcolor
gsave
368.581256 16.871875 m
378.581256 16.871875 l
388.581256 16.871875 l
stroke
grestore
0.000 setgray
gsave
396.581256 13.371875 translate
0.000000 rotate
/STIXGeneral-Italic 10.0 selectfont
0.000000 0.218750 moveto
/uni03BB glyphshow
/STIXGeneral-Regular 10.0 selectfont
6.023984 0.218750 moveto
/equal glyphshow
14.317972 0.218750 moveto
/four glyphshow
19.317957 0.218750 moveto
/comma glyphshow
/STIXGeneral-Italic 10.0 selectfont
23.261938 0.218750 moveto
/uni03D1 glyphshow
/STIXGeneral-Regular 10.0 selectfont
30.265918 0.218750 moveto
/equal glyphshow
38.559906 0.218750 moveto
/four glyphshow
grestore

end
showpage
