%!PS-Adobe-3.0 EPSF-3.0
%%Title: error_indicator_convergence.eps
%%Creator: Matplotlib v3.5.3, https://matplotlib.org/
%%CreationDate: Thu May  4 14:30:31 2023
%%Orientation: portrait
%%BoundingBox: 21 185 591 607
%%HiResBoundingBox: 21.433684 185.086929 590.566316 606.913071
%%EndComments
%%BeginProlog
/mpldict 12 dict def
mpldict begin
/_d { bind def } bind def
/m { moveto } _d
/l { lineto } _d
/r { rlineto } _d
/c { curveto } _d
/cl { closepath } _d
/ce { closepath eofill } _d
/box {
      m
      1 index 0 r
      0 exch r
      neg 0 r
      cl
    } _d
/clipbox {
      box
      clip
      newpath
    } _d
/sc { setcachedevice } _d
%!PS-Adobe-3.0 Resource-Font
%%Creator: Converted from TrueType to Type 3 by Matplotlib.
10 dict begin
/FontName /STIXGeneral-Regular def
/PaintType 0 def
/FontMatrix [0.001 0 0 0.001 0 0] def
/FontBBox [-970 -443 2000 1023] def
/FontType 3 def
/Encoding [/a /e /i /n /o /zero /one /minus /three /two /four /five /six /seven /t /r /uni221E] def
/CharStrings 18 dict dup begin
/.notdef 0 def
/a{444 0 37 -10 442 460 sc
442 66 m
442 38 l
417 6 387 -10 352 -10 c
314 -10 293 14 288 63 c
287 63 l
244 14 196 -10 142 -10 c
111 -10 85 -1 66 17 c
47 36 37 61 37 94 c
37 141 60 180 107 211 c
139 232 199 259 287 292 c
287 346 l
287 376 280 398 265 413 c
251 428 232 436 209 436 c
189 436 172 431 159 421 c
146 412 139 400 139 387 c
139 381 140 374 142 367 c
144 360 145 352 145 345 c
145 335 140 326 131 317 c
122 308 112 304 99 304 c
88 304 78 308 69 317 c
60 326 56 337 56 350 c
56 382 73 409 107 430 c
138 450 177 460 222 460 c
276 460 315 445 340 415 c
352 401 360 387 363 372 c
366 358 368 335 368 304 c
368 113 l
368 69 378 47 399 47 c
412 47 427 53 442 66 c

287 127 m
287 268 l
226 247 183 225 159 202 c
136 181 125 156 125 125 c
125 100 131 80 144 67 c
157 54 173 48 194 48 c
216 48 235 53 252 64 c
266 74 275 83 280 92 c
285 101 287 112 287 127 c

ce} _d
/e{444 0 25 -10 424 460 sc
408 164 m
424 157 l
384 46 314 -10 215 -10 c
156 -10 110 10 76 51 c
42 92 25 148 25 217 c
25 288 44 347 82 392 c
120 437 170 460 232 460 c
292 460 338 437 371 391 c
390 364 402 326 405 277 c
97 277 l
100 235 104 203 109 181 c
115 159 126 137 143 114 c
171 77 208 59 254 59 c
287 59 314 67 336 83 c
359 99 383 126 408 164 c

99 309 m
303 309 l
297 351 287 381 273 398 c
260 415 237 424 205 424 c
177 424 154 414 135 394 c
116 375 104 346 99 309 c

ce} _d
/i{278 0 16 0 253 683 sc
180 632 m
180 617 175 605 165 595 c
155 586 143 581 128 581 c
114 581 102 586 92 595 c
83 605 78 617 78 632 c
78 646 83 658 93 668 c
103 678 115 683 129 683 c
144 683 156 678 165 668 c
175 658 180 646 180 632 c

253 0 m
16 0 l
16 15 l
51 17 72 23 81 33 c
90 43 95 67 95 104 c
95 331 l
95 354 93 371 88 380 c
83 389 75 394 62 394 c
46 394 32 392 20 389 c
20 405 l
175 460 l
179 456 l
179 105 l
179 68 183 44 191 34 c
200 24 220 18 253 15 c
253 0 l

ce} _d
/n{500 0 16 0 485 460 sc
485 0 m
277 0 l
278 15 l
303 17 319 24 327 36 c
336 49 340 72 340 105 c
340 304 l
340 371 316 405 267 405 c
250 405 235 401 220 393 c
205 385 187 370 164 348 c
164 72 l
164 52 168 38 177 30 c
186 22 204 17 229 15 c
229 0 l
18 0 l
18 15 l
43 17 60 23 68 33 c
76 44 80 64 80 94 c
80 337 l
80 362 78 379 73 388 c
68 397 59 402 45 402 c
32 402 22 401 16 398 c
16 415 l
63 428 108 443 153 460 c
161 457 l
161 379 l
162 379 l
209 433 257 460 306 460 c
344 460 373 447 393 420 c
414 393 424 355 424 306 c
424 85 l
424 58 428 41 436 32 c
444 23 460 18 485 15 c
485 0 l

ce} _d
/o{500 0 29 -10 470 460 sc
470 231 m
470 161 449 103 407 58 c
366 13 312 -10 245 -10 c
184 -10 132 12 91 57 c
50 102 29 159 29 228 c
29 297 50 353 91 396 c
132 439 187 460 254 460 c
316 460 367 439 408 396 c
449 354 470 299 470 231 c

380 204 m
380 280 363 339 330 382 c
303 415 272 432 235 432 c
200 432 172 418 151 389 c
130 361 119 322 119 273 c
119 188 137 119 172 68 c
195 35 225 18 262 18 c
299 18 327 34 348 67 c
369 100 380 146 380 204 c

ce} _d
/zero{500 0 24 -14 476 676 sc
476 330 m
476 285 472 243 463 203 c
454 164 441 127 424 94 c
407 61 384 34 354 15 c
324 -4 289 -14 250 -14 c
209 -14 174 -4 143 17 c
112 38 89 65 72 100 c
55 135 43 172 35 211 c
28 250 24 292 24 336 c
24 398 32 454 47 503 c
62 553 88 594 123 627 c
159 660 203 676 254 676 c
319 676 373 644 414 580 c
455 516 476 433 476 330 c

380 325 m
380 430 369 511 346 566 c
324 622 291 650 248 650 c
207 650 175 622 153 566 c
131 510 120 431 120 329 c
120 226 131 148 153 93 c
175 39 207 12 250 12 c
292 12 324 39 346 93 c
369 148 380 225 380 325 c

ce} _d
/one{500 0 111 0 394 676 sc
394 0 m
118 0 l
118 15 l
155 17 180 24 193 35 c
206 47 213 67 213 95 c
213 544 l
213 577 203 593 183 593 c
174 593 159 589 138 581 c
111 571 l
111 585 l
290 676 l
299 673 l
299 76 l
299 54 306 38 319 29 c
332 20 357 15 394 15 c
394 0 l

ce} _d
/minus{685 0 64 220 621 286 sc
621 220 m
64 220 l
64 286 l
621 286 l
621 220 l

ce} _d
/three{500 0 41 -14 431 676 sc
61 510 m
45 514 l
60 564 84 603 117 632 c
150 661 191 676 241 676 c
288 676 325 663 354 638 c
383 613 397 580 397 539 c
397 484 366 438 304 401 c
341 385 368 367 387 348 c
416 315 431 272 431 219 c
431 166 416 119 385 79 c
362 48 330 25 287 9 c
245 -6 200 -14 153 -14 c
78 -14 41 5 41 43 c
41 54 45 62 53 69 c
61 76 71 79 82 79 c
99 79 119 70 143 53 c
172 32 201 22 229 22 c
266 22 296 37 321 66 c
346 96 359 132 359 175 c
359 252 324 300 255 320 c
234 327 200 330 153 330 c
153 344 l
190 357 218 369 237 380 c
291 411 318 455 318 514 c
318 547 308 573 289 590 c
270 607 244 616 210 616 c
150 616 100 581 61 510 c

ce} _d
/two{500 0 29 0 474 676 sc
474 137 m
420 0 l
29 0 l
29 12 l
207 201 l
254 250 287 294 307 335 c
327 376 337 418 337 461 c
337 506 325 540 300 565 c
275 590 241 602 198 602 c
162 602 133 593 112 574 c
91 555 71 521 51 472 c
30 477 l
41 539 64 588 98 623 c
133 658 179 676 238 676 c
293 676 338 659 372 626 c
406 593 423 551 423 500 c
423 425 380 342 295 252 c
130 76 l
364 76 l
386 76 403 80 416 89 c
429 98 444 116 460 143 c
474 137 l

ce} _d
/four{500 0 12 0 473 676 sc
473 167 m
370 167 l
370 0 l
292 0 l
292 167 l
12 167 l
12 231 l
326 676 l
370 676 l
370 231 l
473 231 l
473 167 l

292 231 m
292 574 l
52 231 l
292 231 l

ce} _d
/five{500 0 31 -14 438 688 sc
438 681 m
402 596 l
398 587 389 583 375 583 c
181 583 l
141 498 l
214 484 267 469 300 452 c
333 436 363 409 391 370 c
414 338 426 296 426 243 c
426 195 418 155 402 122 c
387 89 362 60 328 35 c
283 2 226 -14 158 -14 c
120 -14 89 -8 66 3 c
43 14 31 29 31 48 c
31 73 46 86 76 86 c
100 86 125 76 150 55 c
176 34 200 23 221 23 c
256 23 287 40 314 75 c
342 110 356 149 356 192 c
356 256 334 306 289 342 c
231 389 160 412 76 412 c
68 412 64 415 64 420 c
65 425 l
174 662 l
381 662 l
392 662 401 664 407 667 c
414 670 421 677 429 688 c
438 681 l

ce} _d
/six{500 0 34 -14 468 684 sc
446 684 m
448 668 l
369 655 304 623 251 572 c
198 521 165 458 152 383 c
191 413 233 428 279 428 c
338 428 384 409 417 372 c
451 335 468 284 468 219 c
468 154 451 100 417 59 c
378 10 325 -14 258 -14 c
177 -14 118 20 81 87 c
50 144 34 208 34 279 c
34 388 70 480 143 555 c
184 598 227 628 270 645 c
314 663 373 676 446 684 c

378 188 m
378 317 333 382 243 382 c
210 382 182 373 160 355 c
138 338 127 308 127 266 c
127 188 139 126 163 81 c
188 36 223 14 269 14 c
304 14 331 30 350 61 c
369 93 378 135 378 188 c

ce} _d
/seven{500 0 20 -8 449 662 sc
449 646 m
237 -8 l
172 -8 l
370 588 l
155 588 l
126 588 105 583 91 573 c
77 563 59 541 38 506 c
20 515 l
80 662 l
449 662 l
449 646 l

ce} _d
/t{278 0 13 -10 279 579 sc
266 77 m
279 66 l
247 15 207 -10 158 -10 c
99 -10 70 32 70 117 c
70 418 l
17 418 l
14 420 13 422 13 425 c
13 430 19 437 30 444 c
55 459 88 494 127 551 c
128 553 131 557 136 563 c
141 570 145 575 147 579 c
152 579 154 575 154 566 c
154 450 l
255 450 l
255 418 l
154 418 l
154 132 l
154 100 158 77 166 63 c
174 49 187 42 206 42 c
226 42 246 54 266 77 c

ce} _d
/r{333 0 5 0 335 460 sc
160 458 m
160 366 l
185 402 206 427 223 440 c
240 453 259 460 280 460 c
297 460 311 455 320 446 c
330 437 335 424 335 407 c
335 393 331 382 324 374 c
317 366 308 362 296 362 c
283 362 270 369 256 382 c
245 392 237 397 230 397 c
216 397 201 387 184 368 c
168 349 160 331 160 315 c
160 90 l
160 61 166 42 177 32 c
188 22 211 16 245 15 c
245 0 l
5 0 l
5 15 l
37 21 57 28 64 35 c
72 42 76 59 76 84 c
76 334 l
76 356 73 371 68 380 c
63 389 55 394 42 394 c
31 394 20 393 7 390 c
7 406 l
49 419 98 437 155 460 c
160 458 l

ce} _d
/uni221E{926 0 70 0 854 430 sc
854 222 m
854 168 836 117 799 70 c
762 23 715 0 656 0 c
617 0 582 12 551 35 c
520 59 488 96 455 145 c
407 48 337 0 246 0 c
199 0 157 17 122 51 c
87 86 70 135 70 200 c
70 235 75 266 84 294 c
94 322 106 344 120 360 c
135 377 151 390 169 401 c
187 412 203 420 218 424 c
233 428 248 430 261 430 c
301 430 336 420 366 401 c
397 382 434 343 479 283 c
506 332 534 369 561 393 c
589 418 626 430 672 430 c
721 430 763 411 799 373 c
836 336 854 285 854 222 c

499 245 m
499 242 l
538 179 572 132 601 103 c
630 74 661 59 694 59 c
722 59 746 71 765 94 c
784 118 794 146 794 178 c
794 225 781 265 756 297 c
731 330 698 346 655 346 c
634 346 615 343 598 337 c
581 332 566 323 553 310 c
540 297 530 287 524 280 c
518 273 510 261 499 245 c

433 181 m
433 184 l
395 247 360 293 327 324 c
295 355 263 371 230 371 c
202 371 178 359 159 335 c
140 312 130 284 130 252 c
130 207 143 167 168 134 c
193 101 227 84 269 84 c
290 84 309 87 327 93 c
345 99 361 108 375 119 c
389 131 400 141 407 149 c
415 158 424 168 433 181 c

ce} _d
end readonly def

/BuildGlyph {
 exch begin
 CharStrings exch
 2 copy known not {pop /.notdef} if
 true 3 1 roll get exec
 end
} _d

/BuildChar {
 1 index /Encoding get exch get
 1 index /BuildGlyph get exec
} _d

FontName currentdict end definefont pop
%!PS-Adobe-3.0 Resource-Font
%%Creator: Converted from TrueType to Type 3 by Matplotlib.
10 dict begin
/FontName /STIXGeneral-Italic def
/PaintType 0 def
/FontMatrix [0.001 0 0 0.001 0 0] def
/FontBBox [-970 -305 1429 1023] def
/FontType 3 def
/Encoding [/a /e /m /N /uni03B7 /x] def
/CharStrings 7 dict dup begin
/.notdef 0 def
/a{501 0 17 -11 476 441 sc
463 111 m
476 100 l
439 55 411 25 393 11 c
376 -3 357 -10 337 -10 c
310 -10 297 4 297 31 c
297 48 305 86 320 146 c
283 90 248 50 217 25 c
186 1 152 -11 117 -11 c
88 -11 64 -1 45 19 c
26 40 17 68 17 105 c
17 156 31 207 60 260 c
89 313 126 356 171 390 c
216 424 260 441 303 441 c
348 441 374 422 383 383 c
394 431 l
397 434 l
458 441 l
465 438 l
464 435 462 428 459 417 c
400 201 370 80 370 54 c
370 45 375 41 384 41 c
394 41 411 55 436 82 c
463 111 l

365 361 m
365 378 360 392 350 403 c
340 414 326 419 309 419 c
264 419 220 388 178 327 c
156 294 138 258 123 218 c
108 178 101 143 101 112 c
101 63 121 38 161 38 c
200 38 243 71 288 136 c
339 210 365 285 365 361 c

ce} _d
/e{444 0 31 -11 412 441 sc
358 109 m
370 97 l
311 25 243 -11 166 -11 c
125 -11 93 1 68 26 c
43 51 31 85 31 126 c
31 204 62 276 124 342 c
187 408 255 441 330 441 c
356 441 376 435 390 423 c
405 411 412 394 412 373 c
412 329 386 290 335 255 c
284 220 215 197 128 186 c
121 173 118 152 118 125 c
118 98 126 76 143 59 c
160 42 183 34 211 34 c
233 34 254 39 274 49 c
294 60 322 80 358 109 c

152 252 m
135 208 l
210 226 263 251 296 282 c
329 314 346 346 346 379 c
346 405 334 418 311 418 c
283 418 254 402 223 369 c
193 337 169 298 152 252 c

ce} _d
/m{722 0 12 -9 704 441 sc
704 105 m
699 98 l
648 27 600 -9 555 -9 c
528 -9 515 6 515 37 c
515 47 519 69 528 103 c
586 330 l
591 349 593 361 593 368 c
593 374 591 379 587 383 c
583 387 578 389 573 389 c
542 389 498 350 442 272 c
417 237 398 202 384 167 c
370 132 353 77 334 0 c
259 0 l
286 93 l
331 250 354 340 354 364 c
354 381 347 389 332 389 c
315 389 293 376 266 349 c
239 323 211 289 183 246 c
166 220 152 192 140 163 c
129 134 111 79 87 0 c
12 0 l
55 144 l
92 266 110 342 110 372 c
110 387 96 394 69 394 c
44 394 l
44 410 l
206 441 l
209 439 l
151 230 l
238 371 311 441 371 441 c
390 441 405 436 415 425 c
426 414 431 400 431 381 c
431 356 418 305 391 229 c
426 285 456 327 479 355 c
503 384 527 406 551 421 c
572 434 593 441 614 441 c
632 441 646 435 656 423 c
667 412 672 397 672 378 c
672 369 671 360 669 350 c
601 99 l
594 74 591 59 591 54 c
591 43 595 38 603 38 c
618 38 639 56 668 91 c
689 117 l
704 105 l

ce} _d
/N{667 0 -20 -15 727 653 sc
727 653 m
727 637 l
709 633 696 630 689 627 c
682 625 675 618 666 606 c
658 595 652 582 647 568 c
643 554 636 529 625 492 c
479 -15 l
461 -15 l
231 535 l
117 113 l
111 92 108 74 108 59 c
108 45 113 35 123 28 c
134 22 152 18 178 16 c
178 0 l
-20 0 l
-20 16 l
9 20 29 30 41 47 c
53 64 68 105 86 168 c
203 583 l
188 619 159 637 117 637 c
117 653 l
277 653 l
484 154 l
590 542 l
595 561 598 575 598 586 c
598 604 593 616 584 623 c
575 630 557 634 529 637 c
529 653 l
727 653 l

ce} _d
/uni03B7{474 0 14 -205 442 441 sc
148 228 m
150 227 l
239 370 312 441 371 441 c
392 441 409 436 422 426 c
435 417 442 403 442 384 c
442 368 439 347 432 321 c
345 0 l
325 -73 315 -130 315 -171 c
315 -181 318 -192 323 -205 c
250 -205 l
243 -196 239 -182 239 -161 c
239 -128 250 -71 272 9 c
347 283 l
356 314 361 338 361 355 c
361 378 353 390 336 390 c
309 390 272 359 223 296 c
174 234 140 171 121 106 c
89 0 l
14 0 l
96 305 l
105 338 110 359 110 367 c
110 378 105 384 96 384 c
93 384 90 383 87 382 c
84 381 81 378 78 375 c
75 372 71 370 68 367 c
65 364 62 361 58 356 c
55 352 52 348 49 345 c
47 342 44 339 40 334 c
37 330 34 327 33 326 c
21 336 l
30 351 39 364 50 377 c
83 418 115 438 147 438 c
174 438 187 423 187 393 c
187 366 174 311 148 228 c

ce} _d
/x{444 0 -27 -11 447 441 sc
243 355 m
255 298 l
290 352 319 389 340 410 c
362 431 384 441 406 441 c
418 441 428 437 435 430 c
443 423 447 415 447 404 c
447 393 444 385 437 378 c
431 371 423 368 413 368 c
407 368 399 371 389 376 c
379 382 370 385 361 385 c
342 385 309 345 263 264 c
263 255 266 240 271 219 c
303 85 l
310 58 320 44 333 44 c
344 44 359 57 380 84 c
382 87 384 90 387 93 c
390 97 392 100 394 103 c
396 106 398 109 401 112 c
416 103 l
387 58 365 28 348 12 c
331 -3 313 -11 294 -11 c
278 -11 266 -6 257 4 c
248 14 241 32 235 57 c
206 176 l
118 57 l
97 29 80 11 67 2 c
54 -7 40 -11 23 -11 c
8 -11 -4 -7 -13 0 c
-22 7 -27 18 -27 31 c
-27 41 -24 49 -17 56 c
-11 63 -3 67 7 67 c
15 67 26 63 39 56 c
49 50 58 47 65 47 c
76 47 93 63 116 96 c
198 212 l
170 336 l
163 365 157 384 151 392 c
146 400 137 404 124 404 c
116 404 103 402 85 397 c
67 392 l
64 408 l
75 412 l
128 431 167 441 192 441 c
205 441 215 435 222 423 c
229 411 236 388 243 355 c

ce} _d
end readonly def

/BuildGlyph {
 exch begin
 CharStrings exch
 2 copy known not {pop /.notdef} if
 true 3 1 roll get exec
 end
} _d

/BuildChar {
 1 index /Encoding get exch get
 1 index /BuildGlyph get exec
} _d

FontName currentdict end definefont pop
end
%%EndProlog
mpldict begin
21.434 185.087 translate
569.133 421.826 0 0 clipbox
gsave
0 0 m
569.132632 0 l
569.132632 421.826142 l
0 421.826142 l
cl
1.000 setgray
fill
grestore
gsave
53.79375 235.257252 m
515.338882 235.257252 l
515.338882 414.608253 l
53.79375 414.608253 l
cl
1.000 setgray
fill
grestore
0.800 setlinewidth
1 setlinejoin
2 setlinecap
[] 0 setdash
0.690 setgray
gsave
461.545 179.351 53.794 235.257 clipbox
74.773074 235.257252 m
74.773074 414.608253 l
stroke
grestore
0 setlinecap
0.000 setgray
gsave
/o {
gsave
newpath
translate
0.8 setlinewidth
1 setlinejoin

0 setlinecap

0 0 m
0 -3.5 l

gsave
0.000 setgray
fill
grestore
stroke
grestore
} bind def
74.7731 235.257 o
grestore
2 setlinecap
0.690 setgray
gsave
461.545 179.351 53.794 235.257 clipbox
135.582709 235.257252 m
135.582709 414.608253 l
stroke
grestore
0 setlinecap
0.000 setgray
gsave
/o {
gsave
newpath
translate
0.8 setlinewidth
1 setlinejoin

0 setlinecap

0 0 m
0 -3.5 l

gsave
0.000 setgray
fill
grestore
stroke
grestore
} bind def
135.583 235.257 o
grestore
2 setlinecap
0.690 setgray
gsave
461.545 179.351 53.794 235.257 clipbox
196.392345 235.257252 m
196.392345 414.608253 l
stroke
grestore
0 setlinecap
0.000 setgray
gsave
/o {
gsave
newpath
translate
0.8 setlinewidth
1 setlinejoin

0 setlinecap

0 0 m
0 -3.5 l

gsave
0.000 setgray
fill
grestore
stroke
grestore
} bind def
196.392 235.257 o
grestore
2 setlinecap
0.690 setgray
gsave
461.545 179.351 53.794 235.257 clipbox
257.20198 235.257252 m
257.20198 414.608253 l
stroke
grestore
0 setlinecap
0.000 setgray
gsave
/o {
gsave
newpath
translate
0.8 setlinewidth
1 setlinejoin

0 setlinecap

0 0 m
0 -3.5 l

gsave
0.000 setgray
fill
grestore
stroke
grestore
} bind def
257.202 235.257 o
grestore
2 setlinecap
0.690 setgray
gsave
461.545 179.351 53.794 235.257 clipbox
318.011615 235.257252 m
318.011615 414.608253 l
stroke
grestore
0 setlinecap
0.000 setgray
gsave
/o {
gsave
newpath
translate
0.8 setlinewidth
1 setlinejoin

0 setlinecap

0 0 m
0 -3.5 l

gsave
0.000 setgray
fill
grestore
stroke
grestore
} bind def
318.012 235.257 o
grestore
2 setlinecap
0.690 setgray
gsave
461.545 179.351 53.794 235.257 clipbox
378.821251 235.257252 m
378.821251 414.608253 l
stroke
grestore
0 setlinecap
0.000 setgray
gsave
/o {
gsave
newpath
translate
0.8 setlinewidth
1 setlinejoin

0 setlinecap

0 0 m
0 -3.5 l

gsave
0.000 setgray
fill
grestore
stroke
grestore
} bind def
378.821 235.257 o
grestore
2 setlinecap
0.690 setgray
gsave
461.545 179.351 53.794 235.257 clipbox
439.630886 235.257252 m
439.630886 414.608253 l
stroke
grestore
0 setlinecap
0.000 setgray
gsave
/o {
gsave
newpath
translate
0.8 setlinewidth
1 setlinejoin

0 setlinecap

0 0 m
0 -3.5 l

gsave
0.000 setgray
fill
grestore
stroke
grestore
} bind def
439.631 235.257 o
grestore
2 setlinecap
0.690 setgray
gsave
461.545 179.351 53.794 235.257 clipbox
500.440521 235.257252 m
500.440521 414.608253 l
stroke
grestore
0 setlinecap
0.000 setgray
gsave
/o {
gsave
newpath
translate
0.8 setlinewidth
1 setlinejoin

0 setlinecap

0 0 m
0 -3.5 l

gsave
0.000 setgray
fill
grestore
stroke
grestore
} bind def
500.441 235.257 o
grestore
2 setlinecap
0.690 setgray
gsave
461.545 179.351 53.794 235.257 clipbox
53.79375 270.628698 m
515.338882 270.628698 l
stroke
grestore
0 setlinecap
0.122 0.467 0.706 setrgbcolor
gsave
/o {
gsave
newpath
translate
0.8 setlinewidth
1 setlinejoin

0 setlinecap

-0 0 m
-3.5 0 l

gsave
0.122 0.467 0.706 setrgbcolor
fill
grestore
stroke
grestore
} bind def
53.7938 270.629 o
grestore
gsave
23.793750 265.933386 translate
0.000000 rotate
/STIXGeneral-Regular 12.0 selectfont
0.000000 0.998438 moveto
/one glyphshow
5.999985 0.998438 moveto
/zero glyphshow
/STIXGeneral-Regular 8.399999999999999 selectfont
12.189188 5.323438 moveto
/minus glyphshow
17.943178 5.323438 moveto
/three glyphshow
grestore
2 setlinecap
0.690 setgray
gsave
461.545 179.351 53.794 235.257 clipbox
53.79375 317.062742 m
515.338882 317.062742 l
stroke
grestore
0 setlinecap
0.122 0.467 0.706 setrgbcolor
gsave
/o {
gsave
newpath
translate
0.8 setlinewidth
1 setlinejoin

0 setlinecap

-0 0 m
-3.5 0 l

gsave
0.122 0.467 0.706 setrgbcolor
fill
grestore
stroke
grestore
} bind def
53.7938 317.063 o
grestore
gsave
23.793750 312.367430 translate
0.000000 rotate
/STIXGeneral-Regular 12.0 selectfont
0.000000 0.998438 moveto
/one glyphshow
5.999985 0.998438 moveto
/zero glyphshow
/STIXGeneral-Regular 8.399999999999999 selectfont
12.189188 5.323438 moveto
/minus glyphshow
17.943178 5.323438 moveto
/one glyphshow
grestore
2 setlinecap
0.690 setgray
gsave
461.545 179.351 53.794 235.257 clipbox
53.79375 363.496786 m
515.338882 363.496786 l
stroke
grestore
0 setlinecap
0.122 0.467 0.706 setrgbcolor
gsave
/o {
gsave
newpath
translate
0.8 setlinewidth
1 setlinejoin

0 setlinecap

-0 0 m
-3.5 0 l

gsave
0.122 0.467 0.706 setrgbcolor
fill
grestore
stroke
grestore
} bind def
53.7938 363.497 o
grestore
gsave
29.793750 358.801473 translate
0.000000 rotate
/STIXGeneral-Regular 12.0 selectfont
0.000000 0.998438 moveto
/one glyphshow
5.999985 0.998438 moveto
/zero glyphshow
/STIXGeneral-Regular 8.399999999999999 selectfont
12.189188 5.323438 moveto
/one glyphshow
grestore
2 setlinecap
0.690 setgray
gsave
461.545 179.351 53.794 235.257 clipbox
53.79375 409.93083 m
515.338882 409.93083 l
stroke
grestore
0 setlinecap
0.122 0.467 0.706 setrgbcolor
gsave
/o {
gsave
newpath
translate
0.8 setlinewidth
1 setlinejoin

0 setlinecap

-0 0 m
-3.5 0 l

gsave
0.122 0.467 0.706 setrgbcolor
fill
grestore
stroke
grestore
} bind def
53.7938 409.931 o
grestore
gsave
29.793750 405.235517 translate
0.000000 rotate
/STIXGeneral-Regular 12.0 selectfont
0.000000 0.998438 moveto
/one glyphshow
5.999985 0.998438 moveto
/zero glyphshow
/STIXGeneral-Regular 8.399999999999999 selectfont
12.189188 5.323438 moveto
/three glyphshow
grestore
gsave
16.762500 312.932752 translate
90.000000 rotate
/STIXGeneral-Italic 14.0 selectfont
0.000000 0.828125 moveto
/uni03B7 glyphshow
/STIXGeneral-Italic 9.799999999999999 selectfont
6.635986 -1.023438 moveto
/m glyphshow
13.711577 -1.023438 moveto
/a glyphshow
18.621371 -1.023438 moveto
/x glyphshow
grestore
1.500 setlinewidth
2 setlinecap
gsave
461.545 179.351 53.794 235.257 clipbox
74.773074 406.455935 m
80.854038 402.599714 l
86.935001 401.850476 l
93.015965 397.876347 l
99.096928 398.542583 l
105.177892 392.634862 l
111.258855 390.910908 l
117.339819 385.889991 l
123.420782 380.446469 l
129.501746 378.698096 l
135.582709 374.103551 l
141.663673 367.351889 l
147.744637 365.105066 l
153.8256 356.225448 l
159.906564 352.436302 l
165.987527 350.957341 l
172.068491 342.33017 l
178.149454 336.721753 l
184.230418 330.24291 l
190.311381 326.662436 l
196.392345 321.236136 l
202.473308 316.928188 l
208.554272 313.590916 l
214.635235 310.919593 l
220.716199 330.275951 l
226.797162 305.313481 l
232.878126 301.413202 l
238.959089 299.953784 l
245.040053 292.907954 l
251.121016 295.436511 l
257.20198 293.146614 l
263.282944 287.700378 l
269.363907 286.398527 l
275.444871 281.659491 l
281.525834 283.044806 l
287.606798 286.266314 l
293.687761 275.414939 l
299.768725 278.30684 l
305.849688 272.95058 l
311.930652 269.335789 l
318.011615 271.471973 l
324.092579 276.260883 l
330.173542 266.899927 l
336.254506 264.343719 l
342.335469 263.90916 l
348.416433 269.8387 l
354.497396 260.422662 l
360.57836 283.369112 l
366.659324 285.655366 l
372.740287 284.324811 l
378.821251 267.805546 l
384.902214 257.75852 l
390.983178 256.802389 l
397.064141 255.395154 l
403.145105 253.913501 l
409.226068 251.588118 l
415.307032 259.686742 l
421.387995 249.717441 l
427.468959 245.926327 l
433.549922 251.861098 l
439.630886 246.240752 l
445.711849 243.40957 l
451.792813 271.41082 l
457.873776 270.469581 l
463.95474 267.799963 l
470.035704 279.545413 l
476.116667 272.614436 l
482.197631 275.382213 l
488.278594 276.684744 l
494.359558 271.005214 l
stroke
grestore
1.000 setlinewidth
0 setlinecap
gsave
461.545 179.351 53.794 235.257 clipbox
/o {
gsave
newpath
translate
1.0 setlinewidth
1 setlinejoin

0 setlinecap

0 -1.5 m
0.397805 -1.5 0.77937 -1.341951 1.06066 -1.06066 c
1.341951 -0.77937 1.5 -0.397805 1.5 0 c
1.5 0.397805 1.341951 0.77937 1.06066 1.06066 c
0.77937 1.341951 0.397805 1.5 0 1.5 c
-0.397805 1.5 -0.77937 1.341951 -1.06066 1.06066 c
-1.341951 0.77937 -1.5 0.397805 -1.5 0 c
-1.5 -0.397805 -1.341951 -0.77937 -1.06066 -1.06066 c
-0.77937 -1.341951 -0.397805 -1.5 0 -1.5 c
cl

gsave
0.122 0.467 0.706 setrgbcolor
fill
grestore
stroke
grestore
} bind def
74.7731 406.456 o
80.854 402.6 o
86.935 401.85 o
93.016 397.876 o
99.0969 398.543 o
105.178 392.635 o
111.259 390.911 o
117.34 385.89 o
123.421 380.446 o
129.502 378.698 o
135.583 374.104 o
141.664 367.352 o
147.745 365.105 o
153.826 356.225 o
159.907 352.436 o
165.988 350.957 o
172.068 342.33 o
178.149 336.722 o
184.23 330.243 o
190.311 326.662 o
196.392 321.236 o
202.473 316.928 o
208.554 313.591 o
214.635 310.92 o
220.716 330.276 o
226.797 305.313 o
232.878 301.413 o
238.959 299.954 o
245.04 292.908 o
251.121 295.437 o
257.202 293.147 o
263.283 287.7 o
269.364 286.399 o
275.445 281.659 o
281.526 283.045 o
287.607 286.266 o
293.688 275.415 o
299.769 278.307 o
305.85 272.951 o
311.931 269.336 o
318.012 271.472 o
324.093 276.261 o
330.174 266.9 o
336.255 264.344 o
342.335 263.909 o
348.416 269.839 o
354.497 260.423 o
360.578 283.369 o
366.659 285.655 o
372.74 284.325 o
378.821 267.806 o
384.902 257.759 o
390.983 256.802 o
397.064 255.395 o
403.145 253.914 o
409.226 251.588 o
415.307 259.687 o
421.388 249.717 o
427.469 245.926 o
433.55 251.861 o
439.631 246.241 o
445.712 243.41 o
451.793 271.411 o
457.874 270.47 o
463.955 267.8 o
470.036 279.545 o
476.117 272.614 o
482.198 275.382 o
488.279 276.685 o
494.36 271.005 o
grestore
0.800 setlinewidth
0 setlinejoin
2 setlinecap
0.000 setgray
gsave
53.79375 235.257252 m
53.79375 414.608253 l
stroke
grestore
gsave
515.338882 235.257252 m
515.338882 414.608253 l
stroke
grestore
gsave
53.79375 235.257252 m
515.338882 235.257252 l
stroke
grestore
gsave
53.79375 414.608253 m
515.338882 414.608253 l
stroke
grestore
gsave
53.79375 41.60625 m
515.338882 41.60625 l
515.338882 220.957252 l
53.79375 220.957252 l
cl
1.000 setgray
fill
grestore
1 setlinejoin
0.690 setgray
gsave
461.545 179.351 53.794 41.606 clipbox
74.773074 41.60625 m
74.773074 220.957252 l
stroke
grestore
0 setlinecap
0.000 setgray
gsave
/o {
gsave
newpath
translate
0.8 setlinewidth
1 setlinejoin

0 setlinecap

0 0 m
0 -3.5 l

gsave
0.000 setgray
fill
grestore
stroke
grestore
} bind def
74.7731 41.6063 o
grestore
gsave
71.773074 26.403125 translate
0.000000 rotate
/STIXGeneral-Regular 12.0 selectfont
0.000000 0.890625 moveto
/zero glyphshow
grestore
2 setlinecap
0.690 setgray
gsave
461.545 179.351 53.794 41.606 clipbox
135.582709 41.60625 m
135.582709 220.957252 l
stroke
grestore
0 setlinecap
0.000 setgray
gsave
/o {
gsave
newpath
translate
0.8 setlinewidth
1 setlinejoin

0 setlinecap

0 0 m
0 -3.5 l

gsave
0.000 setgray
fill
grestore
stroke
grestore
} bind def
135.583 41.6063 o
grestore
gsave
129.582709 26.403125 translate
0.000000 rotate
/STIXGeneral-Regular 12.0 selectfont
0.000000 0.890625 moveto
/one glyphshow
5.999985 0.890625 moveto
/zero glyphshow
grestore
2 setlinecap
0.690 setgray
gsave
461.545 179.351 53.794 41.606 clipbox
196.392345 41.60625 m
196.392345 220.957252 l
stroke
grestore
0 setlinecap
0.000 setgray
gsave
/o {
gsave
newpath
translate
0.8 setlinewidth
1 setlinejoin

0 setlinecap

0 0 m
0 -3.5 l

gsave
0.000 setgray
fill
grestore
stroke
grestore
} bind def
196.392 41.6063 o
grestore
gsave
190.392345 26.403125 translate
0.000000 rotate
/STIXGeneral-Regular 12.0 selectfont
0.000000 0.890625 moveto
/two glyphshow
5.999985 0.890625 moveto
/zero glyphshow
grestore
2 setlinecap
0.690 setgray
gsave
461.545 179.351 53.794 41.606 clipbox
257.20198 41.60625 m
257.20198 220.957252 l
stroke
grestore
0 setlinecap
0.000 setgray
gsave
/o {
gsave
newpath
translate
0.8 setlinewidth
1 setlinejoin

0 setlinecap

0 0 m
0 -3.5 l

gsave
0.000 setgray
fill
grestore
stroke
grestore
} bind def
257.202 41.6063 o
grestore
gsave
251.201980 26.403125 translate
0.000000 rotate
/STIXGeneral-Regular 12.0 selectfont
0.000000 0.890625 moveto
/three glyphshow
5.999985 0.890625 moveto
/zero glyphshow
grestore
2 setlinecap
0.690 setgray
gsave
461.545 179.351 53.794 41.606 clipbox
318.011615 41.60625 m
318.011615 220.957252 l
stroke
grestore
0 setlinecap
0.000 setgray
gsave
/o {
gsave
newpath
translate
0.8 setlinewidth
1 setlinejoin

0 setlinecap

0 0 m
0 -3.5 l

gsave
0.000 setgray
fill
grestore
stroke
grestore
} bind def
318.012 41.6063 o
grestore
gsave
312.011615 26.403125 translate
0.000000 rotate
/STIXGeneral-Regular 12.0 selectfont
0.000000 0.890625 moveto
/four glyphshow
5.999985 0.890625 moveto
/zero glyphshow
grestore
2 setlinecap
0.690 setgray
gsave
461.545 179.351 53.794 41.606 clipbox
378.821251 41.60625 m
378.821251 220.957252 l
stroke
grestore
0 setlinecap
0.000 setgray
gsave
/o {
gsave
newpath
translate
0.8 setlinewidth
1 setlinejoin

0 setlinecap

0 0 m
0 -3.5 l

gsave
0.000 setgray
fill
grestore
stroke
grestore
} bind def
378.821 41.6063 o
grestore
gsave
372.821251 26.403125 translate
0.000000 rotate
/STIXGeneral-Regular 12.0 selectfont
0.000000 0.750000 moveto
/five glyphshow
5.999985 0.750000 moveto
/zero glyphshow
grestore
2 setlinecap
0.690 setgray
gsave
461.545 179.351 53.794 41.606 clipbox
439.630886 41.60625 m
439.630886 220.957252 l
stroke
grestore
0 setlinecap
0.000 setgray
gsave
/o {
gsave
newpath
translate
0.8 setlinewidth
1 setlinejoin

0 setlinecap

0 0 m
0 -3.5 l

gsave
0.000 setgray
fill
grestore
stroke
grestore
} bind def
439.631 41.6063 o
grestore
gsave
433.630886 26.403125 translate
0.000000 rotate
/STIXGeneral-Regular 12.0 selectfont
0.000000 0.796875 moveto
/six glyphshow
5.999985 0.796875 moveto
/zero glyphshow
grestore
2 setlinecap
0.690 setgray
gsave
461.545 179.351 53.794 41.606 clipbox
500.440521 41.60625 m
500.440521 220.957252 l
stroke
grestore
0 setlinecap
0.000 setgray
gsave
/o {
gsave
newpath
translate
0.8 setlinewidth
1 setlinejoin

0 setlinecap

0 0 m
0 -3.5 l

gsave
0.000 setgray
fill
grestore
stroke
grestore
} bind def
500.441 41.6063 o
grestore
gsave
494.440521 26.403125 translate
0.000000 rotate
/STIXGeneral-Regular 12.0 selectfont
0.000000 0.890625 moveto
/seven glyphshow
5.999985 0.890625 moveto
/zero glyphshow
grestore
/STIXGeneral-Regular 14.000 selectfont
gsave

261.238191 10.231250 translate
0.000000 rotate
0.000000 0 m /i glyphshow
3.891998 0 m /t glyphshow
7.783997 0 m /e glyphshow
13.999985 0 m /r glyphshow
18.661972 0 m /a glyphshow
24.877960 0 m /t glyphshow
28.769958 0 m /i glyphshow
32.661957 0 m /o glyphshow
39.661957 0 m /n glyphshow
grestore
2 setlinecap
0.690 setgray
gsave
461.545 179.351 53.794 41.606 clipbox
53.79375 61.83927 m
515.338882 61.83927 l
stroke
grestore
0 setlinecap
0.000 setgray
gsave
/o {
gsave
newpath
translate
0.8 setlinewidth
1 setlinejoin

0 setlinecap

-0 0 m
-3.5 0 l

gsave
0.000 setgray
fill
grestore
stroke
grestore
} bind def
53.7938 61.8393 o
grestore
gsave
29.793750 57.143958 translate
0.000000 rotate
/STIXGeneral-Regular 12.0 selectfont
0.000000 0.998438 moveto
/one glyphshow
5.999985 0.998438 moveto
/zero glyphshow
/STIXGeneral-Regular 8.399999999999999 selectfont
12.189188 5.323438 moveto
/three glyphshow
grestore
2 setlinecap
0.690 setgray
gsave
461.545 179.351 53.794 41.606 clipbox
53.79375 178.590602 m
515.338882 178.590602 l
stroke
grestore
0 setlinecap
0.000 setgray
gsave
/o {
gsave
newpath
translate
0.8 setlinewidth
1 setlinejoin

0 setlinecap

-0 0 m
-3.5 0 l

gsave
0.000 setgray
fill
grestore
stroke
grestore
} bind def
53.7938 178.591 o
grestore
gsave
29.793750 173.895290 translate
0.000000 rotate
/STIXGeneral-Regular 12.0 selectfont
0.000000 0.998438 moveto
/one glyphshow
5.999985 0.998438 moveto
/zero glyphshow
/STIXGeneral-Regular 8.399999999999999 selectfont
12.189188 5.323438 moveto
/four glyphshow
grestore
0.600 setlinewidth
gsave
/o {
gsave
newpath
translate
0.6 setlinewidth
1 setlinejoin

0 setlinecap

-0 0 m
-2 0 l

gsave
0.000 setgray
fill
grestore
stroke
grestore
} bind def
53.7938 43.7543 o
grestore
gsave
/o {
gsave
newpath
translate
0.6 setlinewidth
1 setlinejoin

0 setlinecap

-0 0 m
-2 0 l

gsave
0.000 setgray
fill
grestore
stroke
grestore
} bind def
53.7938 50.5249 o
grestore
gsave
/o {
gsave
newpath
translate
0.6 setlinewidth
1 setlinejoin

0 setlinecap

-0 0 m
-2 0 l

gsave
0.000 setgray
fill
grestore
stroke
grestore
} bind def
53.7938 56.497 o
grestore
gsave
/o {
gsave
newpath
translate
0.6 setlinewidth
1 setlinejoin

0 setlinecap

-0 0 m
-2 0 l

gsave
0.000 setgray
fill
grestore
stroke
grestore
} bind def
53.7938 96.9849 o
grestore
gsave
/o {
gsave
newpath
translate
0.6 setlinewidth
1 setlinejoin

0 setlinecap

-0 0 m
-2 0 l

gsave
0.000 setgray
fill
grestore
stroke
grestore
} bind def
53.7938 117.544 o
grestore
gsave
/o {
gsave
newpath
translate
0.6 setlinewidth
1 setlinejoin

0 setlinecap

-0 0 m
-2 0 l

gsave
0.000 setgray
fill
grestore
stroke
grestore
} bind def
53.7938 132.131 o
grestore
gsave
/o {
gsave
newpath
translate
0.6 setlinewidth
1 setlinejoin

0 setlinecap

-0 0 m
-2 0 l

gsave
0.000 setgray
fill
grestore
stroke
grestore
} bind def
53.7938 143.445 o
grestore
gsave
/o {
gsave
newpath
translate
0.6 setlinewidth
1 setlinejoin

0 setlinecap

-0 0 m
-2 0 l

gsave
0.000 setgray
fill
grestore
stroke
grestore
} bind def
53.7938 152.689 o
grestore
gsave
/o {
gsave
newpath
translate
0.6 setlinewidth
1 setlinejoin

0 setlinecap

-0 0 m
-2 0 l

gsave
0.000 setgray
fill
grestore
stroke
grestore
} bind def
53.7938 160.506 o
grestore
gsave
/o {
gsave
newpath
translate
0.6 setlinewidth
1 setlinejoin

0 setlinecap

-0 0 m
-2 0 l

gsave
0.000 setgray
fill
grestore
stroke
grestore
} bind def
53.7938 167.276 o
grestore
gsave
/o {
gsave
newpath
translate
0.6 setlinewidth
1 setlinejoin

0 setlinecap

-0 0 m
-2 0 l

gsave
0.000 setgray
fill
grestore
stroke
grestore
} bind def
53.7938 173.248 o
grestore
gsave
/o {
gsave
newpath
translate
0.6 setlinewidth
1 setlinejoin

0 setlinecap

-0 0 m
-2 0 l

gsave
0.000 setgray
fill
grestore
stroke
grestore
} bind def
53.7938 213.736 o
grestore
gsave
22.762500 126.281751 translate
90.000000 rotate
/STIXGeneral-Italic 14.0 selectfont
0.000000 0.859375 moveto
/N glyphshow
grestore
1.500 setlinewidth
2 setlinecap
gsave
461.545 179.351 53.794 41.606 clipbox
74.773074 50.14318 m
80.854038 49.758568 l
86.935001 51.279816 l
93.015965 53.359663 l
99.096928 55.873483 l
105.177892 58.755824 l
111.258855 61.124392 l
117.339819 63.681461 l
123.420782 65.975739 l
129.501746 70.360336 l
135.582709 72.909676 l
141.663673 75.298083 l
147.744637 78.791144 l
153.8256 81.027685 l
159.906564 86.953484 l
165.987527 91.473378 l
172.068491 94.756367 l
178.149454 99.699679 l
184.230418 105.053941 l
190.311381 110.346433 l
196.392345 114.352484 l
202.473308 120.082037 l
208.554272 124.409431 l
214.635235 128.478172 l
220.716199 131.26119 l
226.797162 132.459089 l
232.878126 136.418698 l
238.959089 141.332821 l
245.040053 144.953557 l
251.121016 150.637211 l
257.20198 153.135388 l
263.282944 154.872774 l
269.363907 157.275679 l
275.444871 159.407258 l
281.525834 163.487412 l
287.606798 165.659886 l
293.687761 166.503466 l
299.768725 171.35425 l
305.849688 173.315915 l
311.930652 175.845491 l
318.011615 179.440348 l
324.092579 181.030667 l
330.173542 181.674085 l
336.254506 183.469328 l
342.335469 185.84003 l
348.416433 187.873133 l
354.497396 188.402359 l
360.57836 190.445635 l
366.659324 190.649903 l
372.740287 190.669885 l
378.821251 190.220388 l
384.902214 190.171991 l
390.983178 192.809697 l
397.064141 195.196494 l
403.145105 197.858831 l
409.226068 199.881093 l
415.307032 202.078467 l
421.387995 202.52319 l
427.468959 204.187617 l
433.549922 207.952654 l
439.630886 209.1406 l
445.711849 210.374546 l
451.792813 212.540861 l
457.873776 212.804933 l
463.95474 212.709301 l
470.035704 212.397896 l
476.116667 211.824603 l
482.197631 211.385692 l
488.278594 210.913473 l
494.359558 210.415165 l
stroke
grestore
1.000 setlinewidth
0 setlinecap
gsave
461.545 179.351 53.794 41.606 clipbox
/o {
gsave
newpath
translate
1.0 setlinewidth
1 setlinejoin

0 setlinecap

0 -1.75 m
0.464105 -1.75 0.909265 -1.565609 1.237437 -1.237437 c
1.565609 -0.909265 1.75 -0.464105 1.75 0 c
1.75 0.464105 1.565609 0.909265 1.237437 1.237437 c
0.909265 1.565609 0.464105 1.75 0 1.75 c
-0.464105 1.75 -0.909265 1.565609 -1.237437 1.237437 c
-1.565609 0.909265 -1.75 0.464105 -1.75 0 c
-1.75 -0.464105 -1.565609 -0.909265 -1.237437 -1.237437 c
-0.909265 -1.565609 -0.464105 -1.75 0 -1.75 c
cl

gsave
0.000 setgray
fill
grestore
stroke
grestore
} bind def
74.7731 50.1432 o
80.854 49.7586 o
86.935 51.2798 o
93.016 53.3597 o
99.0969 55.8735 o
105.178 58.7558 o
111.259 61.1244 o
117.34 63.6815 o
123.421 65.9757 o
129.502 70.3603 o
135.583 72.9097 o
141.664 75.2981 o
147.745 78.7911 o
153.826 81.0277 o
159.907 86.9535 o
165.988 91.4734 o
172.068 94.7564 o
178.149 99.6997 o
184.23 105.054 o
190.311 110.346 o
196.392 114.352 o
202.473 120.082 o
208.554 124.409 o
214.635 128.478 o
220.716 131.261 o
226.797 132.459 o
232.878 136.419 o
238.959 141.333 o
245.04 144.954 o
251.121 150.637 o
257.202 153.135 o
263.283 154.873 o
269.364 157.276 o
275.445 159.407 o
281.526 163.487 o
287.607 165.66 o
293.688 166.503 o
299.769 171.354 o
305.85 173.316 o
311.931 175.845 o
318.012 179.44 o
324.093 181.031 o
330.174 181.674 o
336.255 183.469 o
342.335 185.84 o
348.416 187.873 o
354.497 188.402 o
360.578 190.446 o
366.659 190.65 o
372.74 190.67 o
378.821 190.22 o
384.902 190.172 o
390.983 192.81 o
397.064 195.196 o
403.145 197.859 o
409.226 199.881 o
415.307 202.078 o
421.388 202.523 o
427.469 204.188 o
433.55 207.953 o
439.631 209.141 o
445.712 210.375 o
451.793 212.541 o
457.874 212.805 o
463.955 212.709 o
470.036 212.398 o
476.117 211.825 o
482.198 211.386 o
488.279 210.913 o
494.36 210.415 o
grestore
0.800 setlinewidth
0 setlinejoin
2 setlinecap
gsave
53.79375 41.60625 m
53.79375 220.957252 l
stroke
grestore
gsave
515.338882 41.60625 m
515.338882 220.957252 l
stroke
grestore
gsave
53.79375 41.60625 m
515.338882 41.60625 l
stroke
grestore
gsave
53.79375 220.957252 m
515.338882 220.957252 l
stroke
grestore
1 setlinejoin
0.690 setgray
gsave
461.545 179.351 53.794 235.257 clipbox
53.79375 272.353666 m
515.338882 272.353666 l
stroke
grestore
0 setlinecap
1.000 0.000 0.000 setrgbcolor
gsave
/o {
gsave
newpath
translate
0.8 setlinewidth
1 setlinejoin

0 setlinecap

0 0 m
3.5 0 l

gsave
1.000 0.000 0.000 setrgbcolor
fill
grestore
stroke
grestore
} bind def
515.339 272.354 o
grestore
gsave
522.338882 268.158354 translate
0.000000 rotate
/STIXGeneral-Regular 12.0 selectfont
0.000000 0.118750 moveto
/one glyphshow
5.999985 0.118750 moveto
/zero glyphshow
/STIXGeneral-Regular 8.399999999999999 selectfont
12.189188 4.443750 moveto
/minus glyphshow
17.943178 4.443750 moveto
/seven glyphshow
grestore
2 setlinecap
0.690 setgray
gsave
461.545 179.351 53.794 235.257 clipbox
53.79375 309.819119 m
515.338882 309.819119 l
stroke
grestore
0 setlinecap
1.000 0.000 0.000 setrgbcolor
gsave
/o {
gsave
newpath
translate
0.8 setlinewidth
1 setlinejoin

0 setlinecap

0 0 m
3.5 0 l

gsave
1.000 0.000 0.000 setrgbcolor
fill
grestore
stroke
grestore
} bind def
515.339 309.819 o
grestore
gsave
522.338882 305.123806 translate
0.000000 rotate
/STIXGeneral-Regular 12.0 selectfont
0.000000 0.900000 moveto
/one glyphshow
5.999985 0.900000 moveto
/zero glyphshow
/STIXGeneral-Regular 8.399999999999999 selectfont
12.189188 5.225000 moveto
/minus glyphshow
17.943178 5.225000 moveto
/five glyphshow
grestore
2 setlinecap
0.690 setgray
gsave
461.545 179.351 53.794 235.257 clipbox
53.79375 347.284571 m
515.338882 347.284571 l
stroke
grestore
0 setlinecap
1.000 0.000 0.000 setrgbcolor
gsave
/o {
gsave
newpath
translate
0.8 setlinewidth
1 setlinejoin

0 setlinecap

0 0 m
3.5 0 l

gsave
1.000 0.000 0.000 setrgbcolor
fill
grestore
stroke
grestore
} bind def
515.339 347.285 o
grestore
gsave
522.338882 342.589258 translate
0.000000 rotate
/STIXGeneral-Regular 12.0 selectfont
0.000000 0.998438 moveto
/one glyphshow
5.999985 0.998438 moveto
/zero glyphshow
/STIXGeneral-Regular 8.399999999999999 selectfont
12.189188 5.323438 moveto
/minus glyphshow
17.943178 5.323438 moveto
/three glyphshow
grestore
2 setlinecap
0.690 setgray
gsave
461.545 179.351 53.794 235.257 clipbox
53.79375 384.750023 m
515.338882 384.750023 l
stroke
grestore
0 setlinecap
1.000 0.000 0.000 setrgbcolor
gsave
/o {
gsave
newpath
translate
0.8 setlinewidth
1 setlinejoin

0 setlinecap

0 0 m
3.5 0 l

gsave
1.000 0.000 0.000 setrgbcolor
fill
grestore
stroke
grestore
} bind def
515.339 384.75 o
grestore
gsave
522.338882 380.054711 translate
0.000000 rotate
/STIXGeneral-Regular 12.0 selectfont
0.000000 0.998438 moveto
/one glyphshow
5.999985 0.998438 moveto
/zero glyphshow
/STIXGeneral-Regular 8.399999999999999 selectfont
12.189188 5.323438 moveto
/minus glyphshow
17.943178 5.323438 moveto
/one glyphshow
grestore
gsave
558.901382 316.932752 translate
90.000000 rotate
/STIXGeneral-Italic 14.0 selectfont
0.000000 0.828125 moveto
/e glyphshow
/STIXGeneral-Regular 9.799999999999999 selectfont
6.215988 -1.023438 moveto
/uni221E glyphshow
grestore
1.500 setlinewidth
[5.55 2.4] 0 setdash
gsave
461.545 179.351 53.794 235.257 clipbox
74.773074 406.455935 m
80.854038 404.717687 l
86.935001 403.135016 l
93.015965 396.637287 l
99.096928 395.599806 l
105.177892 387.457504 l
111.258855 385.35948 l
117.339819 374.409062 l
123.420782 366.012961 l
129.501746 368.297595 l
135.582709 354.67034 l
141.663673 355.757686 l
147.744637 350.171978 l
153.8256 349.99051 l
159.906564 350.630961 l
165.987527 341.8715 l
172.068491 346.898626 l
178.149454 337.709079 l
184.230418 325.769897 l
190.311381 325.945949 l
196.392345 326.364812 l
202.473308 313.486939 l
208.554272 318.650755 l
214.635235 308.428748 l
220.716199 342.953853 l
226.797162 311.985875 l
232.878126 308.715672 l
238.959089 312.870672 l
245.040053 299.862639 l
251.121016 295.344817 l
257.20198 288.658341 l
263.282944 293.477244 l
269.363907 286.657871 l
275.444871 306.989197 l
281.525834 300.447687 l
287.606798 296.667908 l
293.687761 279.085477 l
299.768725 281.102312 l
305.849688 277.934555 l
311.930652 279.98937 l
318.011615 271.987109 l
324.092579 271.303599 l
330.173542 274.006285 l
336.254506 269.253198 l
342.335469 262.48689 l
348.416433 262.906257 l
354.497396 263.009699 l
360.57836 260.856002 l
366.659324 271.67019 l
372.740287 256.570215 l
378.821251 264.99678 l
384.902214 270.957403 l
390.983178 262.12907 l
397.064141 258.293495 l
403.145105 263.043282 l
409.226068 259.897358 l
415.307032 256.792218 l
421.387995 253.282728 l
427.468959 255.590997 l
433.549922 251.065304 l
439.630886 249.276945 l
445.711849 245.526267 l
451.792813 247.726083 l
457.873776 247.489228 l
463.95474 243.40957 l
470.035704 249.654483 l
476.116667 255.385034 l
482.197631 254.683569 l
488.278594 248.218702 l
494.359558 253.975256 l
stroke
grestore
1.000 setlinewidth
[] 0 setdash
gsave
461.545 179.351 53.794 235.257 clipbox
/o {
gsave
newpath
translate
1.0 setlinewidth
1 setlinejoin

0 setlinecap

0 -1.5 m
0.397805 -1.5 0.77937 -1.341951 1.06066 -1.06066 c
1.341951 -0.77937 1.5 -0.397805 1.5 0 c
1.5 0.397805 1.341951 0.77937 1.06066 1.06066 c
0.77937 1.341951 0.397805 1.5 0 1.5 c
-0.397805 1.5 -0.77937 1.341951 -1.06066 1.06066 c
-1.341951 0.77937 -1.5 0.397805 -1.5 0 c
-1.5 -0.397805 -1.341951 -0.77937 -1.06066 -1.06066 c
-0.77937 -1.341951 -0.397805 -1.5 0 -1.5 c
cl

gsave
1.000 0.000 0.000 setrgbcolor
fill
grestore
stroke
grestore
} bind def
74.7731 406.456 o
80.854 404.718 o
86.935 403.135 o
93.016 396.637 o
99.0969 395.6 o
105.178 387.458 o
111.259 385.359 o
117.34 374.409 o
123.421 366.013 o
129.502 368.298 o
135.583 354.67 o
141.664 355.758 o
147.745 350.172 o
153.826 349.991 o
159.907 350.631 o
165.988 341.872 o
172.068 346.899 o
178.149 337.709 o
184.23 325.77 o
190.311 325.946 o
196.392 326.365 o
202.473 313.487 o
208.554 318.651 o
214.635 308.429 o
220.716 342.954 o
226.797 311.986 o
232.878 308.716 o
238.959 312.871 o
245.04 299.863 o
251.121 295.345 o
257.202 288.658 o
263.283 293.477 o
269.364 286.658 o
275.445 306.989 o
281.526 300.448 o
287.607 296.668 o
293.688 279.085 o
299.769 281.102 o
305.85 277.935 o
311.931 279.989 o
318.012 271.987 o
324.093 271.304 o
330.174 274.006 o
336.255 269.253 o
342.335 262.487 o
348.416 262.906 o
354.497 263.01 o
360.578 260.856 o
366.659 271.67 o
372.74 256.57 o
378.821 264.997 o
384.902 270.957 o
390.983 262.129 o
397.064 258.293 o
403.145 263.043 o
409.226 259.897 o
415.307 256.792 o
421.388 253.283 o
427.469 255.591 o
433.55 251.065 o
439.631 249.277 o
445.712 245.526 o
451.793 247.726 o
457.874 247.489 o
463.955 243.41 o
470.036 249.654 o
476.117 255.385 o
482.198 254.684 o
488.279 248.219 o
494.36 253.975 o
grestore
0.800 setlinewidth
0 setlinejoin
2 setlinecap
0.000 setgray
gsave
53.79375 235.257252 m
53.79375 414.608253 l
stroke
grestore
gsave
515.338882 235.257252 m
515.338882 414.608253 l
stroke
grestore
gsave
53.79375 235.257252 m
515.338882 235.257252 l
stroke
grestore
gsave
53.79375 414.608253 m
515.338882 414.608253 l
stroke
grestore

end
showpage
