%!PS-Adobe-3.0 EPSF-3.0
%%Title: mean_diff_fwo.eps
%%Creator: Matplotlib v3.5.3, https://matplotlib.org/
%%CreationDate: Thu May  4 14:44:46 2023
%%Orientation: portrait
%%BoundingBox: 24 273 588 519
%%HiResBoundingBox: 24.219392 273.833125 587.780608 518.166875
%%EndComments
%%BeginProlog
/mpldict 12 dict def
mpldict begin
/_d { bind def } bind def
/m { moveto } _d
/l { lineto } _d
/r { rlineto } _d
/c { curveto } _d
/cl { closepath } _d
/ce { closepath eofill } _d
/box {
      m
      1 index 0 r
      0 exch r
      neg 0 r
      cl
    } _d
/clipbox {
      box
      clip
      newpath
    } _d
/sc { setcachedevice } _d
%!PS-Adobe-3.0 Resource-Font
%%Creator: Converted from TrueType to Type 3 by Matplotlib.
10 dict begin
/FontName /STIXGeneral-Regular def
/PaintType 0 def
/FontMatrix [0.001 0 0 0.001 0 0] def
/FontBBox [-970 -443 2000 1023] def
/FontType 3 def
/Encoding [/minus /space /parenleft /parenright /zero /one /two /three /four /five /six /seven /eight /nine /E /F /M /P /bracketleft /bracketright /a /e /f /h /i /m /n /o /r /s /t /bar] def
/CharStrings 33 dict dup begin
/.notdef 0 def
/minus{685 0 64 220 621 286 sc
621 220 m
64 220 l
64 286 l
621 286 l
621 220 l

ce} _d
/space{250 0 0 0 0 0 sc
ce} _d
/parenleft{333 0 48 -177 304 676 sc
304 -161 m
292 -177 l
215 -133 155 -72 112 5 c
69 82 48 165 48 252 c
48 437 130 578 295 676 c
304 660 l
236 602 191 545 168 488 c
145 432 134 354 134 255 c
134 156 146 76 169 15 c
192 -46 237 -105 304 -161 c

ce} _d
/parenright{333 0 29 -177 285 676 sc
29 660 m
41 676 l
117 631 177 569 220 492 c
263 415 285 333 285 247 c
285 65 203 -76 38 -177 c
29 -161 l
98 -104 143 -48 165 8 c
188 65 199 143 199 244 c
199 345 188 426 165 487 c
143 548 98 606 29 660 c

ce} _d
/zero{500 0 24 -14 476 676 sc
476 330 m
476 285 472 243 463 203 c
454 164 441 127 424 94 c
407 61 384 34 354 15 c
324 -4 289 -14 250 -14 c
209 -14 174 -4 143 17 c
112 38 89 65 72 100 c
55 135 43 172 35 211 c
28 250 24 292 24 336 c
24 398 32 454 47 503 c
62 553 88 594 123 627 c
159 660 203 676 254 676 c
319 676 373 644 414 580 c
455 516 476 433 476 330 c

380 325 m
380 430 369 511 346 566 c
324 622 291 650 248 650 c
207 650 175 622 153 566 c
131 510 120 431 120 329 c
120 226 131 148 153 93 c
175 39 207 12 250 12 c
292 12 324 39 346 93 c
369 148 380 225 380 325 c

ce} _d
/one{500 0 111 0 394 676 sc
394 0 m
118 0 l
118 15 l
155 17 180 24 193 35 c
206 47 213 67 213 95 c
213 544 l
213 577 203 593 183 593 c
174 593 159 589 138 581 c
111 571 l
111 585 l
290 676 l
299 673 l
299 76 l
299 54 306 38 319 29 c
332 20 357 15 394 15 c
394 0 l

ce} _d
/two{500 0 29 0 474 676 sc
474 137 m
420 0 l
29 0 l
29 12 l
207 201 l
254 250 287 294 307 335 c
327 376 337 418 337 461 c
337 506 325 540 300 565 c
275 590 241 602 198 602 c
162 602 133 593 112 574 c
91 555 71 521 51 472 c
30 477 l
41 539 64 588 98 623 c
133 658 179 676 238 676 c
293 676 338 659 372 626 c
406 593 423 551 423 500 c
423 425 380 342 295 252 c
130 76 l
364 76 l
386 76 403 80 416 89 c
429 98 444 116 460 143 c
474 137 l

ce} _d
/three{500 0 41 -14 431 676 sc
61 510 m
45 514 l
60 564 84 603 117 632 c
150 661 191 676 241 676 c
288 676 325 663 354 638 c
383 613 397 580 397 539 c
397 484 366 438 304 401 c
341 385 368 367 387 348 c
416 315 431 272 431 219 c
431 166 416 119 385 79 c
362 48 330 25 287 9 c
245 -6 200 -14 153 -14 c
78 -14 41 5 41 43 c
41 54 45 62 53 69 c
61 76 71 79 82 79 c
99 79 119 70 143 53 c
172 32 201 22 229 22 c
266 22 296 37 321 66 c
346 96 359 132 359 175 c
359 252 324 300 255 320 c
234 327 200 330 153 330 c
153 344 l
190 357 218 369 237 380 c
291 411 318 455 318 514 c
318 547 308 573 289 590 c
270 607 244 616 210 616 c
150 616 100 581 61 510 c

ce} _d
/four{500 0 12 0 473 676 sc
473 167 m
370 167 l
370 0 l
292 0 l
292 167 l
12 167 l
12 231 l
326 676 l
370 676 l
370 231 l
473 231 l
473 167 l

292 231 m
292 574 l
52 231 l
292 231 l

ce} _d
/five{500 0 31 -14 438 688 sc
438 681 m
402 596 l
398 587 389 583 375 583 c
181 583 l
141 498 l
214 484 267 469 300 452 c
333 436 363 409 391 370 c
414 338 426 296 426 243 c
426 195 418 155 402 122 c
387 89 362 60 328 35 c
283 2 226 -14 158 -14 c
120 -14 89 -8 66 3 c
43 14 31 29 31 48 c
31 73 46 86 76 86 c
100 86 125 76 150 55 c
176 34 200 23 221 23 c
256 23 287 40 314 75 c
342 110 356 149 356 192 c
356 256 334 306 289 342 c
231 389 160 412 76 412 c
68 412 64 415 64 420 c
65 425 l
174 662 l
381 662 l
392 662 401 664 407 667 c
414 670 421 677 429 688 c
438 681 l

ce} _d
/six{500 0 34 -14 468 684 sc
446 684 m
448 668 l
369 655 304 623 251 572 c
198 521 165 458 152 383 c
191 413 233 428 279 428 c
338 428 384 409 417 372 c
451 335 468 284 468 219 c
468 154 451 100 417 59 c
378 10 325 -14 258 -14 c
177 -14 118 20 81 87 c
50 144 34 208 34 279 c
34 388 70 480 143 555 c
184 598 227 628 270 645 c
314 663 373 676 446 684 c

378 188 m
378 317 333 382 243 382 c
210 382 182 373 160 355 c
138 338 127 308 127 266 c
127 188 139 126 163 81 c
188 36 223 14 269 14 c
304 14 331 30 350 61 c
369 93 378 135 378 188 c

ce} _d
/seven{500 0 20 -8 449 662 sc
449 646 m
237 -8 l
172 -8 l
370 588 l
155 588 l
126 588 105 583 91 573 c
77 563 59 541 38 506 c
20 515 l
80 662 l
449 662 l
449 646 l

ce} _d
/eight{500 0 56 -14 445 676 sc
445 155 m
445 104 427 63 391 32 c
356 1 308 -14 248 -14 c
192 -14 146 1 110 32 c
74 63 56 102 56 149 c
56 184 65 214 82 239 c
99 264 134 295 186 332 c
136 373 103 407 86 432 c
70 457 62 487 62 520 c
62 567 80 605 116 633 c
153 662 199 676 256 676 c
305 676 345 662 376 634 c
408 607 424 573 424 533 c
424 496 414 467 395 445 c
376 423 341 398 290 371 c
350 331 391 295 412 264 c
434 233 445 196 445 155 c

355 533 m
355 568 345 595 326 616 c
307 637 280 648 246 648 c
212 648 185 639 165 621 c
146 604 136 580 136 549 c
136 518 146 490 165 465 c
185 440 217 415 261 389 c
295 409 319 430 333 452 c
348 475 355 502 355 533 c

271 272 m
212 312 l
183 288 162 264 150 241 c
138 218 132 191 132 158 c
132 113 143 77 166 52 c
189 27 220 14 259 14 c
292 14 318 24 338 44 c
359 65 369 91 369 124 c
369 154 361 180 346 203 c
331 226 306 249 271 272 c

ce} _d
/nine{500 0 30 -22 459 676 sc
59 -22 m
56 -2 l
133 11 197 44 250 95 c
303 146 340 213 360 294 c
321 256 271 237 210 237 c
156 237 112 256 79 293 c
46 330 30 379 30 440 c
30 507 50 563 89 608 c
129 653 179 676 238 676 c
301 676 354 651 395 600 c
438 547 459 478 459 394 c
459 335 449 280 428 228 c
408 177 378 133 339 97 c
298 60 257 33 218 16 c
179 0 126 -13 59 -22 c

362 355 m
362 394 l
362 563 318 648 230 648 c
199 648 174 637 157 614 c
147 601 139 581 132 554 c
125 527 122 501 122 474 c
122 415 133 367 155 332 c
178 297 208 280 245 280 c
272 280 298 286 323 299 c
349 312 362 331 362 355 c

ce} _d
/E{611 0 12 0 597 662 sc
597 169 m
551 0 l
12 0 l
12 19 l
50 22 74 28 84 39 c
94 50 99 75 99 114 c
99 550 l
99 587 94 612 83 623 c
73 634 49 641 12 643 c
12 662 l
542 662 l
546 519 l
521 519 l
514 564 501 592 482 605 c
463 618 425 624 367 624 c
236 624 l
221 624 212 622 207 617 c
203 613 201 603 201 588 c
201 368 l
352 368 l
394 368 422 374 435 386 c
449 398 459 424 465 464 c
488 464 l
488 230 l
465 230 l
459 272 449 299 436 310 c
423 321 395 327 352 327 c
201 327 l
201 84 l
201 64 208 51 222 45 c
236 40 263 37 302 37 c
338 37 l
409 37 460 46 490 63 c
520 80 546 116 569 169 c
597 169 l

ce} _d
/F{556 0 11 0 546 662 sc
546 519 m
521 519 l
514 564 501 593 483 605 c
466 618 427 624 367 624 c
235 624 l
221 624 212 621 207 616 c
203 611 201 601 201 585 c
201 368 l
343 368 l
385 368 413 374 427 386 c
442 398 451 424 456 463 c
479 463 l
479 230 l
456 230 l
452 271 443 297 429 309 c
415 321 386 327 343 327 c
201 327 l
201 112 l
201 74 206 49 217 38 c
228 27 253 21 292 19 c
292 0 l
11 0 l
11 19 l
49 22 73 29 83 40 c
94 52 99 80 99 123 c
99 551 l
99 588 94 611 84 622 c
74 633 50 640 12 643 c
12 662 l
541 662 l
546 519 l

ce} _d
/M{889 0 12 0 864 662 sc
864 0 m
584 0 l
584 19 l
623 22 648 29 658 41 c
669 54 674 81 674 123 c
674 572 l
419 0 l
405 0 l
153 549 l
153 151 l
153 97 159 62 170 46 c
181 30 207 21 246 19 c
246 0 l
12 0 l
12 19 l
41 21 62 25 75 32 c
88 39 96 50 101 67 c
106 84 109 112 109 151 c
109 549 l
109 587 103 611 92 622 c
81 633 55 640 14 643 c
14 662 l
212 662 l
443 160 l
664 662 l
863 662 l
863 643 l
827 642 803 636 792 624 c
781 612 776 587 776 550 c
776 112 l
776 77 781 53 792 41 c
803 29 827 22 864 19 c
864 0 l

ce} _d
/P{557 0 16 0 542 662 sc
16 662 m
275 662 l
370 662 442 641 492 599 c
525 571 542 531 542 480 c
542 427 523 383 485 349 c
457 324 428 307 399 299 c
370 292 327 288 271 288 c
252 288 229 289 202 291 c
202 112 l
202 74 207 49 218 38 c
229 27 255 21 296 19 c
296 0 l
16 0 l
16 19 l
55 22 78 29 87 40 c
96 51 100 79 100 122 c
100 551 l
100 588 95 612 85 623 c
76 634 53 640 16 643 c
16 662 l

202 589 m
202 331 l
225 329 245 328 263 328 c
317 328 359 341 388 367 c
418 394 433 430 433 475 c
433 529 418 567 387 590 c
356 613 306 625 237 625 c
223 625 214 622 209 617 c
204 612 202 603 202 589 c

ce} _d
/bracketleft{333 0 88 -156 299 662 sc
299 -156 m
88 -156 l
88 662 l
299 662 l
299 637 l
216 637 l
199 637 186 633 177 626 c
168 619 164 606 164 589 c
164 -77 l
164 -113 181 -131 216 -131 c
299 -131 l
299 -156 l

ce} _d
/bracketright{333 0 34 -156 245 662 sc
245 -156 m
34 -156 l
34 -131 l
122 -131 l
139 -131 151 -127 158 -120 c
165 -113 169 -101 169 -85 c
169 583 l
169 619 152 637 118 637 c
34 637 l
34 662 l
245 662 l
245 -156 l

ce} _d
/a{444 0 37 -10 442 460 sc
442 66 m
442 38 l
417 6 387 -10 352 -10 c
314 -10 293 14 288 63 c
287 63 l
244 14 196 -10 142 -10 c
111 -10 85 -1 66 17 c
47 36 37 61 37 94 c
37 141 60 180 107 211 c
139 232 199 259 287 292 c
287 346 l
287 376 280 398 265 413 c
251 428 232 436 209 436 c
189 436 172 431 159 421 c
146 412 139 400 139 387 c
139 381 140 374 142 367 c
144 360 145 352 145 345 c
145 335 140 326 131 317 c
122 308 112 304 99 304 c
88 304 78 308 69 317 c
60 326 56 337 56 350 c
56 382 73 409 107 430 c
138 450 177 460 222 460 c
276 460 315 445 340 415 c
352 401 360 387 363 372 c
366 358 368 335 368 304 c
368 113 l
368 69 378 47 399 47 c
412 47 427 53 442 66 c

287 127 m
287 268 l
226 247 183 225 159 202 c
136 181 125 156 125 125 c
125 100 131 80 144 67 c
157 54 173 48 194 48 c
216 48 235 53 252 64 c
266 74 275 83 280 92 c
285 101 287 112 287 127 c

ce} _d
/e{444 0 25 -10 424 460 sc
408 164 m
424 157 l
384 46 314 -10 215 -10 c
156 -10 110 10 76 51 c
42 92 25 148 25 217 c
25 288 44 347 82 392 c
120 437 170 460 232 460 c
292 460 338 437 371 391 c
390 364 402 326 405 277 c
97 277 l
100 235 104 203 109 181 c
115 159 126 137 143 114 c
171 77 208 59 254 59 c
287 59 314 67 336 83 c
359 99 383 126 408 164 c

99 309 m
303 309 l
297 351 287 381 273 398 c
260 415 237 424 205 424 c
177 424 154 414 135 394 c
116 375 104 346 99 309 c

ce} _d
/f{333 0 20 0 383 683 sc
21 450 m
103 450 l
104 490 106 521 111 543 c
116 566 125 588 138 611 c
166 659 213 683 279 683 c
309 683 334 677 353 665 c
373 654 383 639 383 621 c
383 610 379 600 371 592 c
363 584 353 580 341 580 c
325 580 310 592 296 616 c
280 642 262 655 243 655 c
206 655 187 625 187 566 c
187 450 l
309 450 l
309 418 l
187 418 l
187 104 l
187 67 192 43 203 32 c
214 22 239 16 280 15 c
280 0 l
20 0 l
20 15 l
56 17 79 23 88 33 c
98 44 103 67 103 104 c
103 418 l
21 418 l
21 450 l

ce} _d
/h{500 0 9 0 487 683 sc
487 0 m
275 0 l
275 15 l
304 18 323 25 331 35 c
339 45 343 67 343 102 c
343 300 l
343 371 318 406 269 406 c
249 406 231 401 214 392 c
197 383 178 366 157 343 c
157 102 l
157 67 161 45 169 35 c
177 25 196 18 225 15 c
225 0 l
9 0 l
9 15 l
38 19 55 26 62 35 c
69 44 73 67 73 102 c
73 573 l
73 594 70 608 63 614 c
57 621 43 624 22 624 c
16 624 12 624 10 623 c
10 639 l
37 647 l
88 662 127 674 152 683 c
157 680 l
157 376 l
180 406 203 427 226 440 c
249 453 275 460 304 460 c
386 460 427 407 427 301 c
427 102 l
427 67 430 45 436 36 c
443 27 460 20 487 15 c
487 0 l

ce} _d
/i{278 0 16 0 253 683 sc
180 632 m
180 617 175 605 165 595 c
155 586 143 581 128 581 c
114 581 102 586 92 595 c
83 605 78 617 78 632 c
78 646 83 658 93 668 c
103 678 115 683 129 683 c
144 683 156 678 165 668 c
175 658 180 646 180 632 c

253 0 m
16 0 l
16 15 l
51 17 72 23 81 33 c
90 43 95 67 95 104 c
95 331 l
95 354 93 371 88 380 c
83 389 75 394 62 394 c
46 394 32 392 20 389 c
20 405 l
175 460 l
179 456 l
179 105 l
179 68 183 44 191 34 c
200 24 220 18 253 15 c
253 0 l

ce} _d
/m{778 0 16 0 775 460 sc
775 0 m
557 0 l
557 15 l
585 18 603 23 610 32 c
618 41 622 61 622 90 c
622 296 l
622 336 616 365 604 382 c
593 399 573 408 545 408 c
522 408 502 403 485 394 c
469 385 453 369 438 347 c
438 95 l
438 63 443 42 452 31 c
462 21 481 16 510 15 c
510 0 l
286 0 l
286 15 l
315 17 334 22 342 29 c
350 37 354 56 354 86 c
354 297 l
354 371 332 408 289 408 c
270 408 250 404 229 395 c
208 387 193 377 183 365 c
174 355 170 349 170 348 c
170 70 l
170 49 175 34 184 27 c
193 20 211 16 238 15 c
238 0 l
16 0 l
16 15 l
44 16 63 21 72 30 c
81 40 86 59 86 88 c
86 336 l
86 361 83 378 78 387 c
73 397 64 402 51 402 c
41 402 30 401 19 398 c
19 415 l
64 428 111 443 158 460 c
166 457 l
166 383 l
168 383 l
198 414 224 435 247 445 c
270 455 295 460 321 460 c
374 460 409 432 427 376 c
479 432 533 460 590 460 c
667 460 706 400 706 280 c
706 77 l
706 55 709 40 716 31 c
723 23 734 18 749 17 c
775 15 l
775 0 l

ce} _d
/n{500 0 16 0 485 460 sc
485 0 m
277 0 l
278 15 l
303 17 319 24 327 36 c
336 49 340 72 340 105 c
340 304 l
340 371 316 405 267 405 c
250 405 235 401 220 393 c
205 385 187 370 164 348 c
164 72 l
164 52 168 38 177 30 c
186 22 204 17 229 15 c
229 0 l
18 0 l
18 15 l
43 17 60 23 68 33 c
76 44 80 64 80 94 c
80 337 l
80 362 78 379 73 388 c
68 397 59 402 45 402 c
32 402 22 401 16 398 c
16 415 l
63 428 108 443 153 460 c
161 457 l
161 379 l
162 379 l
209 433 257 460 306 460 c
344 460 373 447 393 420 c
414 393 424 355 424 306 c
424 85 l
424 58 428 41 436 32 c
444 23 460 18 485 15 c
485 0 l

ce} _d
/o{500 0 29 -10 470 460 sc
470 231 m
470 161 449 103 407 58 c
366 13 312 -10 245 -10 c
184 -10 132 12 91 57 c
50 102 29 159 29 228 c
29 297 50 353 91 396 c
132 439 187 460 254 460 c
316 460 367 439 408 396 c
449 354 470 299 470 231 c

380 204 m
380 280 363 339 330 382 c
303 415 272 432 235 432 c
200 432 172 418 151 389 c
130 361 119 322 119 273 c
119 188 137 119 172 68 c
195 35 225 18 262 18 c
299 18 327 34 348 67 c
369 100 380 146 380 204 c

ce} _d
/r{333 0 5 0 335 460 sc
160 458 m
160 366 l
185 402 206 427 223 440 c
240 453 259 460 280 460 c
297 460 311 455 320 446 c
330 437 335 424 335 407 c
335 393 331 382 324 374 c
317 366 308 362 296 362 c
283 362 270 369 256 382 c
245 392 237 397 230 397 c
216 397 201 387 184 368 c
168 349 160 331 160 315 c
160 90 l
160 61 166 42 177 32 c
188 22 211 16 245 15 c
245 0 l
5 0 l
5 15 l
37 21 57 28 64 35 c
72 42 76 59 76 84 c
76 334 l
76 356 73 371 68 380 c
63 389 55 394 42 394 c
31 394 20 393 7 390 c
7 406 l
49 419 98 437 155 460 c
160 458 l

ce} _d
/s{389 0 51 -10 348 459 sc
156 301 m
260 238 l
293 218 316 199 329 182 c
342 165 348 142 348 115 c
348 82 334 52 306 27 c
279 2 246 -10 208 -10 c
177 -10 152 -7 135 -1 c
117 5 102 8 89 8 c
78 8 70 4 65 -4 c
52 -4 l
52 153 l
68 153 l
79 104 94 69 114 46 c
134 23 161 12 195 12 c
220 12 240 19 255 33 c
270 47 278 65 278 86 c
278 117 260 142 225 161 c
171 191 l
91 236 51 284 51 336 c
51 375 63 405 88 426 c
113 448 147 459 189 459 c
218 459 241 455 256 448 c
268 443 277 440 284 440 c
289 440 294 443 300 450 c
311 450 l
316 314 l
301 314 l
290 359 275 391 258 409 c
241 428 218 437 188 437 c
165 437 147 431 133 420 c
120 409 113 392 113 369 c
113 358 117 345 124 332 c
132 319 143 309 156 301 c

ce} _d
/t{278 0 13 -10 279 579 sc
266 77 m
279 66 l
247 15 207 -10 158 -10 c
99 -10 70 32 70 117 c
70 418 l
17 418 l
14 420 13 422 13 425 c
13 430 19 437 30 444 c
55 459 88 494 127 551 c
128 553 131 557 136 563 c
141 570 145 575 147 579 c
152 579 154 575 154 566 c
154 450 l
255 450 l
255 418 l
154 418 l
154 132 l
154 100 158 77 166 63 c
174 49 187 42 206 42 c
226 42 246 54 266 77 c

ce} _d
/bar{200 0 67 -14 133 676 sc
133 -14 m
67 -14 l
67 676 l
133 676 l
133 -14 l

ce} _d
end readonly def

/BuildGlyph {
 exch begin
 CharStrings exch
 2 copy known not {pop /.notdef} if
 true 3 1 roll get exec
 end
} _d

/BuildChar {
 1 index /Encoding get exch get
 1 index /BuildGlyph get exec
} _d

FontName currentdict end definefont pop
%!PS-Adobe-3.0 Resource-Font
%%Creator: Converted from TrueType to Type 3 by Matplotlib.
10 dict begin
/FontName /STIXGeneral-Italic def
/PaintType 0 def
/FontMatrix [0.001 0 0 0.001 0 0] def
/FontBBox [-970 -305 1429 1023] def
/FontType 3 def
/Encoding [/x /uni03C3 /N] def
/CharStrings 4 dict dup begin
/.notdef 0 def
/x{444 0 -27 -11 447 441 sc
243 355 m
255 298 l
290 352 319 389 340 410 c
362 431 384 441 406 441 c
418 441 428 437 435 430 c
443 423 447 415 447 404 c
447 393 444 385 437 378 c
431 371 423 368 413 368 c
407 368 399 371 389 376 c
379 382 370 385 361 385 c
342 385 309 345 263 264 c
263 255 266 240 271 219 c
303 85 l
310 58 320 44 333 44 c
344 44 359 57 380 84 c
382 87 384 90 387 93 c
390 97 392 100 394 103 c
396 106 398 109 401 112 c
416 103 l
387 58 365 28 348 12 c
331 -3 313 -11 294 -11 c
278 -11 266 -6 257 4 c
248 14 241 32 235 57 c
206 176 l
118 57 l
97 29 80 11 67 2 c
54 -7 40 -11 23 -11 c
8 -11 -4 -7 -13 0 c
-22 7 -27 18 -27 31 c
-27 41 -24 49 -17 56 c
-11 63 -3 67 7 67 c
15 67 26 63 39 56 c
49 50 58 47 65 47 c
76 47 93 63 116 96 c
198 212 l
170 336 l
163 365 157 384 151 392 c
146 400 137 404 124 404 c
116 404 103 402 85 397 c
67 392 l
64 408 l
75 412 l
128 431 167 441 192 441 c
205 441 215 435 222 423 c
229 411 236 388 243 355 c

ce} _d
/uni03C3{498 0 27 -11 531 428 sc
531 428 m
513 354 l
343 354 l
353 338 367 323 384 309 c
401 296 415 282 424 269 c
434 256 439 239 439 217 c
439 161 412 109 357 61 c
303 13 242 -11 173 -11 c
126 -11 90 1 65 26 c
40 51 27 86 27 130 c
27 176 39 221 64 266 c
89 311 125 350 174 381 c
223 412 277 428 337 428 c
531 428 l

355 221 m
355 252 349 279 338 303 c
327 327 314 344 297 354 c
258 354 218 328 175 276 c
132 225 111 166 111 100 c
111 71 118 48 132 33 c
146 18 165 10 189 10 c
234 10 272 34 305 82 c
338 130 355 176 355 221 c

ce} _d
/N{667 0 -20 -15 727 653 sc
727 653 m
727 637 l
709 633 696 630 689 627 c
682 625 675 618 666 606 c
658 595 652 582 647 568 c
643 554 636 529 625 492 c
479 -15 l
461 -15 l
231 535 l
117 113 l
111 92 108 74 108 59 c
108 45 113 35 123 28 c
134 22 152 18 178 16 c
178 0 l
-20 0 l
-20 16 l
9 20 29 30 41 47 c
53 64 68 105 86 168 c
203 583 l
188 619 159 637 117 637 c
117 653 l
277 653 l
484 154 l
590 542 l
595 561 598 575 598 586 c
598 604 593 616 584 623 c
575 630 557 634 529 637 c
529 653 l
727 653 l

ce} _d
end readonly def

/BuildGlyph {
 exch begin
 CharStrings exch
 2 copy known not {pop /.notdef} if
 true 3 1 roll get exec
 end
} _d

/BuildChar {
 1 index /Encoding get exch get
 1 index /BuildGlyph get exec
} _d

FontName currentdict end definefont pop
end
%%EndProlog
mpldict begin
24.219 273.833 translate
563.561 244.334 0 0 clipbox
gsave
0 0 m
563.561216 0 l
563.561216 244.33375 l
0 244.33375 l
cl
1.000 setgray
fill
grestore
gsave
51.2 41.60625 m
502.767466 41.60625 l
502.767466 237.13375 l
51.2 237.13375 l
cl
1.000 setgray
fill
grestore
0.800 setlinewidth
1 setlinejoin
2 setlinecap
[] 0 setdash
0.690 setgray
gsave
451.567 195.528 51.2 41.606 clipbox
71.725794 41.60625 m
71.725794 237.13375 l
stroke
grestore
0 setlinecap
0.000 setgray
gsave
/o {
gsave
newpath
translate
0.8 setlinewidth
1 setlinejoin

0 setlinecap

0 0 m
0 -3.5 l

gsave
0.000 setgray
fill
grestore
stroke
grestore
} bind def
71.7258 41.6063 o
grestore
/STIXGeneral-Regular 12.000 selectfont
gsave

68.725794 26.403125 translate
0.000000 rotate
0.000000 0 m /zero glyphshow
grestore
2 setlinecap
0.690 setgray
gsave
451.567 195.528 51.2 41.606 clipbox
94.532232 41.60625 m
94.532232 237.13375 l
stroke
grestore
0 setlinecap
0.000 setgray
gsave
/o {
gsave
newpath
translate
0.8 setlinewidth
1 setlinejoin

0 setlinecap

0 0 m
0 -3.5 l

gsave
0.000 setgray
fill
grestore
stroke
grestore
} bind def
94.5322 41.6063 o
grestore
gsave

91.532232 26.403125 translate
0.000000 rotate
0.000000 0 m /one glyphshow
grestore
2 setlinecap
0.690 setgray
gsave
451.567 195.528 51.2 41.606 clipbox
117.338669 41.60625 m
117.338669 237.13375 l
stroke
grestore
0 setlinecap
0.000 setgray
gsave
/o {
gsave
newpath
translate
0.8 setlinewidth
1 setlinejoin

0 setlinecap

0 0 m
0 -3.5 l

gsave
0.000 setgray
fill
grestore
stroke
grestore
} bind def
117.339 41.6063 o
grestore
gsave

114.338669 26.403125 translate
0.000000 rotate
0.000000 0 m /two glyphshow
grestore
2 setlinecap
0.690 setgray
gsave
451.567 195.528 51.2 41.606 clipbox
140.145107 41.60625 m
140.145107 237.13375 l
stroke
grestore
0 setlinecap
0.000 setgray
gsave
/o {
gsave
newpath
translate
0.8 setlinewidth
1 setlinejoin

0 setlinecap

0 0 m
0 -3.5 l

gsave
0.000 setgray
fill
grestore
stroke
grestore
} bind def
140.145 41.6063 o
grestore
gsave

137.145107 26.403125 translate
0.000000 rotate
0.000000 0 m /three glyphshow
grestore
2 setlinecap
0.690 setgray
gsave
451.567 195.528 51.2 41.606 clipbox
162.951545 41.60625 m
162.951545 237.13375 l
stroke
grestore
0 setlinecap
0.000 setgray
gsave
/o {
gsave
newpath
translate
0.8 setlinewidth
1 setlinejoin

0 setlinecap

0 0 m
0 -3.5 l

gsave
0.000 setgray
fill
grestore
stroke
grestore
} bind def
162.952 41.6063 o
grestore
gsave

159.951545 26.403125 translate
0.000000 rotate
0.000000 0 m /four glyphshow
grestore
2 setlinecap
0.690 setgray
gsave
451.567 195.528 51.2 41.606 clipbox
185.757982 41.60625 m
185.757982 237.13375 l
stroke
grestore
0 setlinecap
0.000 setgray
gsave
/o {
gsave
newpath
translate
0.8 setlinewidth
1 setlinejoin

0 setlinecap

0 0 m
0 -3.5 l

gsave
0.000 setgray
fill
grestore
stroke
grestore
} bind def
185.758 41.6063 o
grestore
gsave

182.757982 26.403125 translate
0.000000 rotate
0.000000 0 m /five glyphshow
grestore
2 setlinecap
0.690 setgray
gsave
451.567 195.528 51.2 41.606 clipbox
208.56442 41.60625 m
208.56442 237.13375 l
stroke
grestore
0 setlinecap
0.000 setgray
gsave
/o {
gsave
newpath
translate
0.8 setlinewidth
1 setlinejoin

0 setlinecap

0 0 m
0 -3.5 l

gsave
0.000 setgray
fill
grestore
stroke
grestore
} bind def
208.564 41.6063 o
grestore
gsave

205.564420 26.403125 translate
0.000000 rotate
0.000000 0 m /six glyphshow
grestore
2 setlinecap
0.690 setgray
gsave
451.567 195.528 51.2 41.606 clipbox
231.370858 41.60625 m
231.370858 237.13375 l
stroke
grestore
0 setlinecap
0.000 setgray
gsave
/o {
gsave
newpath
translate
0.8 setlinewidth
1 setlinejoin

0 setlinecap

0 0 m
0 -3.5 l

gsave
0.000 setgray
fill
grestore
stroke
grestore
} bind def
231.371 41.6063 o
grestore
gsave

228.370858 26.403125 translate
0.000000 rotate
0.000000 0 m /seven glyphshow
grestore
2 setlinecap
0.690 setgray
gsave
451.567 195.528 51.2 41.606 clipbox
254.177295 41.60625 m
254.177295 237.13375 l
stroke
grestore
0 setlinecap
0.000 setgray
gsave
/o {
gsave
newpath
translate
0.8 setlinewidth
1 setlinejoin

0 setlinecap

0 0 m
0 -3.5 l

gsave
0.000 setgray
fill
grestore
stroke
grestore
} bind def
254.177 41.6063 o
grestore
gsave

251.177295 26.403125 translate
0.000000 rotate
0.000000 0 m /eight glyphshow
grestore
2 setlinecap
0.690 setgray
gsave
451.567 195.528 51.2 41.606 clipbox
276.983733 41.60625 m
276.983733 237.13375 l
stroke
grestore
0 setlinecap
0.000 setgray
gsave
/o {
gsave
newpath
translate
0.8 setlinewidth
1 setlinejoin

0 setlinecap

0 0 m
0 -3.5 l

gsave
0.000 setgray
fill
grestore
stroke
grestore
} bind def
276.984 41.6063 o
grestore
gsave

273.983733 26.403125 translate
0.000000 rotate
0.000000 0 m /nine glyphshow
grestore
2 setlinecap
0.690 setgray
gsave
451.567 195.528 51.2 41.606 clipbox
299.790171 41.60625 m
299.790171 237.13375 l
stroke
grestore
0 setlinecap
0.000 setgray
gsave
/o {
gsave
newpath
translate
0.8 setlinewidth
1 setlinejoin

0 setlinecap

0 0 m
0 -3.5 l

gsave
0.000 setgray
fill
grestore
stroke
grestore
} bind def
299.79 41.6063 o
grestore
gsave

293.790171 26.403125 translate
0.000000 rotate
0.000000 0 m /one glyphshow
5.999985 0 m /zero glyphshow
grestore
2 setlinecap
0.690 setgray
gsave
451.567 195.528 51.2 41.606 clipbox
322.596608 41.60625 m
322.596608 237.13375 l
stroke
grestore
0 setlinecap
0.000 setgray
gsave
/o {
gsave
newpath
translate
0.8 setlinewidth
1 setlinejoin

0 setlinecap

0 0 m
0 -3.5 l

gsave
0.000 setgray
fill
grestore
stroke
grestore
} bind def
322.597 41.6063 o
grestore
gsave

316.596608 26.403125 translate
0.000000 rotate
0.000000 0 m /one glyphshow
5.999985 0 m /one glyphshow
grestore
2 setlinecap
0.690 setgray
gsave
451.567 195.528 51.2 41.606 clipbox
345.403046 41.60625 m
345.403046 237.13375 l
stroke
grestore
0 setlinecap
0.000 setgray
gsave
/o {
gsave
newpath
translate
0.8 setlinewidth
1 setlinejoin

0 setlinecap

0 0 m
0 -3.5 l

gsave
0.000 setgray
fill
grestore
stroke
grestore
} bind def
345.403 41.6063 o
grestore
gsave

339.403046 26.403125 translate
0.000000 rotate
0.000000 0 m /one glyphshow
5.999985 0 m /two glyphshow
grestore
2 setlinecap
0.690 setgray
gsave
451.567 195.528 51.2 41.606 clipbox
368.209484 41.60625 m
368.209484 237.13375 l
stroke
grestore
0 setlinecap
0.000 setgray
gsave
/o {
gsave
newpath
translate
0.8 setlinewidth
1 setlinejoin

0 setlinecap

0 0 m
0 -3.5 l

gsave
0.000 setgray
fill
grestore
stroke
grestore
} bind def
368.209 41.6063 o
grestore
gsave

362.209484 26.403125 translate
0.000000 rotate
0.000000 0 m /one glyphshow
5.999985 0 m /three glyphshow
grestore
2 setlinecap
0.690 setgray
gsave
451.567 195.528 51.2 41.606 clipbox
391.015921 41.60625 m
391.015921 237.13375 l
stroke
grestore
0 setlinecap
0.000 setgray
gsave
/o {
gsave
newpath
translate
0.8 setlinewidth
1 setlinejoin

0 setlinecap

0 0 m
0 -3.5 l

gsave
0.000 setgray
fill
grestore
stroke
grestore
} bind def
391.016 41.6063 o
grestore
gsave

385.015921 26.403125 translate
0.000000 rotate
0.000000 0 m /one glyphshow
5.999985 0 m /four glyphshow
grestore
2 setlinecap
0.690 setgray
gsave
451.567 195.528 51.2 41.606 clipbox
413.822359 41.60625 m
413.822359 237.13375 l
stroke
grestore
0 setlinecap
0.000 setgray
gsave
/o {
gsave
newpath
translate
0.8 setlinewidth
1 setlinejoin

0 setlinecap

0 0 m
0 -3.5 l

gsave
0.000 setgray
fill
grestore
stroke
grestore
} bind def
413.822 41.6063 o
grestore
gsave

407.822359 26.403125 translate
0.000000 rotate
0.000000 0 m /one glyphshow
5.999985 0 m /five glyphshow
grestore
2 setlinecap
0.690 setgray
gsave
451.567 195.528 51.2 41.606 clipbox
436.628797 41.60625 m
436.628797 237.13375 l
stroke
grestore
0 setlinecap
0.000 setgray
gsave
/o {
gsave
newpath
translate
0.8 setlinewidth
1 setlinejoin

0 setlinecap

0 0 m
0 -3.5 l

gsave
0.000 setgray
fill
grestore
stroke
grestore
} bind def
436.629 41.6063 o
grestore
gsave

430.628797 26.403125 translate
0.000000 rotate
0.000000 0 m /one glyphshow
5.999985 0 m /six glyphshow
grestore
2 setlinecap
0.690 setgray
gsave
451.567 195.528 51.2 41.606 clipbox
459.435234 41.60625 m
459.435234 237.13375 l
stroke
grestore
0 setlinecap
0.000 setgray
gsave
/o {
gsave
newpath
translate
0.8 setlinewidth
1 setlinejoin

0 setlinecap

0 0 m
0 -3.5 l

gsave
0.000 setgray
fill
grestore
stroke
grestore
} bind def
459.435 41.6063 o
grestore
gsave

453.435234 26.403125 translate
0.000000 rotate
0.000000 0 m /one glyphshow
5.999985 0 m /seven glyphshow
grestore
2 setlinecap
0.690 setgray
gsave
451.567 195.528 51.2 41.606 clipbox
482.241672 41.60625 m
482.241672 237.13375 l
stroke
grestore
0 setlinecap
0.000 setgray
gsave
/o {
gsave
newpath
translate
0.8 setlinewidth
1 setlinejoin

0 setlinecap

0 0 m
0 -3.5 l

gsave
0.000 setgray
fill
grestore
stroke
grestore
} bind def
482.242 41.6063 o
grestore
gsave

476.241672 26.403125 translate
0.000000 rotate
0.000000 0 m /one glyphshow
5.999985 0 m /eight glyphshow
grestore
/STIXGeneral-Regular 14.000 selectfont
gsave

253.655608 10.231250 translate
0.000000 rotate
0.000000 0 m /i glyphshow
3.891998 0 m /t glyphshow
7.783997 0 m /e glyphshow
13.999985 0 m /r glyphshow
18.661972 0 m /a glyphshow
24.877960 0 m /t glyphshow
28.769958 0 m /i glyphshow
32.661957 0 m /o glyphshow
39.661957 0 m /n glyphshow
grestore
2 setlinecap
0.690 setgray
gsave
451.567 195.528 51.2 41.606 clipbox
51.2 100.995103 m
502.767466 100.995103 l
stroke
grestore
0 setlinecap
0.000 setgray
gsave
/o {
gsave
newpath
translate
0.8 setlinewidth
1 setlinejoin

0 setlinecap

-0 0 m
-3.5 0 l

gsave
0.000 setgray
fill
grestore
stroke
grestore
} bind def
51.2 100.995 o
grestore
gsave
27.200000 96.299791 translate
0.000000 rotate
/STIXGeneral-Regular 12.0 selectfont
0.000000 0.998438 moveto
/one glyphshow
5.999985 0.998438 moveto
/zero glyphshow
/STIXGeneral-Regular 8.399999999999999 selectfont
12.189188 5.323438 moveto
/one glyphshow
grestore
2 setlinecap
0.690 setgray
gsave
451.567 195.528 51.2 41.606 clipbox
51.2 178.497701 m
502.767466 178.497701 l
stroke
grestore
0 setlinecap
0.000 setgray
gsave
/o {
gsave
newpath
translate
0.8 setlinewidth
1 setlinejoin

0 setlinecap

-0 0 m
-3.5 0 l

gsave
0.000 setgray
fill
grestore
stroke
grestore
} bind def
51.2 178.498 o
grestore
gsave
27.200000 173.802388 translate
0.000000 rotate
/STIXGeneral-Regular 12.0 selectfont
0.000000 0.998438 moveto
/one glyphshow
5.999985 0.998438 moveto
/zero glyphshow
/STIXGeneral-Regular 8.399999999999999 selectfont
12.189188 5.323438 moveto
/two glyphshow
grestore
0.600 setlinewidth
gsave
/o {
gsave
newpath
translate
0.6 setlinewidth
1 setlinejoin

0 setlinecap

-0 0 m
-2 0 l

gsave
0.000 setgray
fill
grestore
stroke
grestore
} bind def
51.2 46.8231 o
grestore
gsave
/o {
gsave
newpath
translate
0.6 setlinewidth
1 setlinejoin

0 setlinecap

-0 0 m
-2 0 l

gsave
0.000 setgray
fill
grestore
stroke
grestore
} bind def
51.2 60.4706 o
grestore
gsave
/o {
gsave
newpath
translate
0.6 setlinewidth
1 setlinejoin

0 setlinecap

-0 0 m
-2 0 l

gsave
0.000 setgray
fill
grestore
stroke
grestore
} bind def
51.2 70.1537 o
grestore
gsave
/o {
gsave
newpath
translate
0.6 setlinewidth
1 setlinejoin

0 setlinecap

-0 0 m
-2 0 l

gsave
0.000 setgray
fill
grestore
stroke
grestore
} bind def
51.2 77.6645 o
grestore
gsave
/o {
gsave
newpath
translate
0.6 setlinewidth
1 setlinejoin

0 setlinecap

-0 0 m
-2 0 l

gsave
0.000 setgray
fill
grestore
stroke
grestore
} bind def
51.2 83.8012 o
grestore
gsave
/o {
gsave
newpath
translate
0.6 setlinewidth
1 setlinejoin

0 setlinecap

-0 0 m
-2 0 l

gsave
0.000 setgray
fill
grestore
stroke
grestore
} bind def
51.2 88.9898 o
grestore
gsave
/o {
gsave
newpath
translate
0.6 setlinewidth
1 setlinejoin

0 setlinecap

-0 0 m
-2 0 l

gsave
0.000 setgray
fill
grestore
stroke
grestore
} bind def
51.2 93.4843 o
grestore
gsave
/o {
gsave
newpath
translate
0.6 setlinewidth
1 setlinejoin

0 setlinecap

-0 0 m
-2 0 l

gsave
0.000 setgray
fill
grestore
stroke
grestore
} bind def
51.2 97.4488 o
grestore
gsave
/o {
gsave
newpath
translate
0.6 setlinewidth
1 setlinejoin

0 setlinecap

-0 0 m
-2 0 l

gsave
0.000 setgray
fill
grestore
stroke
grestore
} bind def
51.2 124.326 o
grestore
gsave
/o {
gsave
newpath
translate
0.6 setlinewidth
1 setlinejoin

0 setlinecap

-0 0 m
-2 0 l

gsave
0.000 setgray
fill
grestore
stroke
grestore
} bind def
51.2 137.973 o
grestore
gsave
/o {
gsave
newpath
translate
0.6 setlinewidth
1 setlinejoin

0 setlinecap

-0 0 m
-2 0 l

gsave
0.000 setgray
fill
grestore
stroke
grestore
} bind def
51.2 147.656 o
grestore
gsave
/o {
gsave
newpath
translate
0.6 setlinewidth
1 setlinejoin

0 setlinecap

-0 0 m
-2 0 l

gsave
0.000 setgray
fill
grestore
stroke
grestore
} bind def
51.2 155.167 o
grestore
gsave
/o {
gsave
newpath
translate
0.6 setlinewidth
1 setlinejoin

0 setlinecap

-0 0 m
-2 0 l

gsave
0.000 setgray
fill
grestore
stroke
grestore
} bind def
51.2 161.304 o
grestore
gsave
/o {
gsave
newpath
translate
0.6 setlinewidth
1 setlinejoin

0 setlinecap

-0 0 m
-2 0 l

gsave
0.000 setgray
fill
grestore
stroke
grestore
} bind def
51.2 166.492 o
grestore
gsave
/o {
gsave
newpath
translate
0.6 setlinewidth
1 setlinejoin

0 setlinecap

-0 0 m
-2 0 l

gsave
0.000 setgray
fill
grestore
stroke
grestore
} bind def
51.2 170.987 o
grestore
gsave
/o {
gsave
newpath
translate
0.6 setlinewidth
1 setlinejoin

0 setlinecap

-0 0 m
-2 0 l

gsave
0.000 setgray
fill
grestore
stroke
grestore
} bind def
51.2 174.951 o
grestore
gsave
/o {
gsave
newpath
translate
0.6 setlinewidth
1 setlinejoin

0 setlinecap

-0 0 m
-2 0 l

gsave
0.000 setgray
fill
grestore
stroke
grestore
} bind def
51.2 201.828 o
grestore
gsave
/o {
gsave
newpath
translate
0.6 setlinewidth
1 setlinejoin

0 setlinecap

-0 0 m
-2 0 l

gsave
0.000 setgray
fill
grestore
stroke
grestore
} bind def
51.2 215.476 o
grestore
gsave
/o {
gsave
newpath
translate
0.6 setlinewidth
1 setlinejoin

0 setlinecap

-0 0 m
-2 0 l

gsave
0.000 setgray
fill
grestore
stroke
grestore
} bind def
51.2 225.159 o
grestore
gsave
/o {
gsave
newpath
translate
0.6 setlinewidth
1 setlinejoin

0 setlinecap

-0 0 m
-2 0 l

gsave
0.000 setgray
fill
grestore
stroke
grestore
} bind def
51.2 232.67 o
grestore
gsave
19.200000 48.870000 translate
90.000000 rotate
/STIXGeneral-Regular 14.0 selectfont
0.000000 0.368750 moveto
/m glyphshow
10.891998 0.368750 moveto
/e glyphshow
17.107986 0.368750 moveto
/a glyphshow
23.323975 0.368750 moveto
/n glyphshow
30.323975 0.368750 moveto
/parenleft glyphshow
34.985962 0.368750 moveto
/bar glyphshow
/STIXGeneral-Italic 14.0 selectfont
37.785950 0.368750 moveto
/uni03C3 glyphshow
/STIXGeneral-Regular 9.799999999999999 selectfont
45.582637 5.306250 moveto
/F glyphshow
51.031435 5.306250 moveto
/E glyphshow
57.019225 5.306250 moveto
/M glyphshow
/STIXGeneral-Italic 9.799999999999999 selectfont
44.757950 -3.334375 moveto
/x glyphshow
49.109142 -3.334375 moveto
/x glyphshow
/STIXGeneral-Regular 14.0 selectfont
68.370209 0.368750 moveto
/minus glyphshow
/STIXGeneral-Italic 14.0 selectfont
79.981803 0.368750 moveto
/uni03C3 glyphshow
/STIXGeneral-Regular 9.799999999999999 selectfont
87.778490 5.306250 moveto
/m glyphshow
95.402889 5.306250 moveto
/e glyphshow
99.754081 5.306250 moveto
/s glyphshow
103.566280 5.306250 moveto
/h glyphshow
109.991160 5.306250 moveto
/minus glyphshow
118.229037 5.306250 moveto
/f glyphshow
121.492428 5.306250 moveto
/r glyphshow
124.755819 5.306250 moveto
/e glyphshow
129.107011 5.306250 moveto
/e glyphshow
/STIXGeneral-Italic 9.799999999999999 selectfont
86.953803 -3.334375 moveto
/x glyphshow
91.304995 -3.334375 moveto
/x glyphshow
/STIXGeneral-Regular 14.0 selectfont
134.075390 0.368750 moveto
/bar glyphshow
136.875378 0.368750 moveto
/parenright glyphshow
141.537365 0.368750 moveto
/space glyphshow
145.037365 0.368750 moveto
/bracketleft glyphshow
149.699353 0.368750 moveto
/M glyphshow
162.145352 0.368750 moveto
/P glyphshow
169.943341 0.368750 moveto
/a glyphshow
176.159329 0.368750 moveto
/bracketright glyphshow
grestore
1.500 setlinewidth
2 setlinecap
gsave
451.567 195.528 51.2 41.606 clipbox
71.725794 228.246136 m
94.532232 173.065824 l
117.338669 172.369299 l
140.145107 170.199185 l
162.951545 119.764944 l
185.757982 182.726097 l
208.56442 148.621316 l
231.370858 107.421815 l
254.177295 110.488629 l
276.983733 139.520111 l
299.790171 117.094603 l
322.596608 136.729295 l
345.403046 78.322921 l
368.209484 104.628868 l
391.015921 103.298145 l
413.822359 134.71955 l
436.628797 87.513022 l
459.435234 52.904916 l
482.241672 50.493864 l
stroke
grestore
1.000 setlinewidth
0 setlinecap
gsave
451.567 195.528 51.2 41.606 clipbox
/o {
gsave
newpath
translate
1.0 setlinewidth
1 setlinejoin

0 setlinecap

0 -2.5 m
0.663008 -2.5 1.29895 -2.236584 1.767767 -1.767767 c
2.236584 -1.29895 2.5 -0.663008 2.5 0 c
2.5 0.663008 2.236584 1.29895 1.767767 1.767767 c
1.29895 2.236584 0.663008 2.5 0 2.5 c
-0.663008 2.5 -1.29895 2.236584 -1.767767 1.767767 c
-2.236584 1.29895 -2.5 0.663008 -2.5 0 c
-2.5 -0.663008 -2.236584 -1.29895 -1.767767 -1.767767 c
-1.29895 -2.236584 -0.663008 -2.5 0 -2.5 c
cl

gsave
0.000 setgray
fill
grestore
stroke
grestore
} bind def
71.7258 228.246 o
94.5322 173.066 o
117.339 172.369 o
140.145 170.199 o
162.952 119.765 o
185.758 182.726 o
208.564 148.621 o
231.371 107.422 o
254.177 110.489 o
276.984 139.52 o
299.79 117.095 o
322.597 136.729 o
345.403 78.3229 o
368.209 104.629 o
391.016 103.298 o
413.822 134.72 o
436.629 87.513 o
459.435 52.9049 o
482.242 50.4939 o
grestore
0.800 setlinewidth
0 setlinejoin
2 setlinecap
gsave
51.2 41.60625 m
51.2 237.13375 l
stroke
grestore
gsave
502.767466 41.60625 m
502.767466 237.13375 l
stroke
grestore
gsave
51.2 41.60625 m
502.767466 41.60625 l
stroke
grestore
gsave
51.2 237.13375 m
502.767466 237.13375 l
stroke
grestore
1 setlinejoin
0 setlinecap
0.122 0.467 0.706 setrgbcolor
gsave
/o {
gsave
newpath
translate
0.8 setlinewidth
1 setlinejoin

0 setlinecap

0 0 m
3.5 0 l

gsave
0.122 0.467 0.706 setrgbcolor
fill
grestore
stroke
grestore
} bind def
502.767 59.7543 o
grestore
gsave
509.767466 55.652772 translate
0.000000 rotate
/STIXGeneral-Regular 12.0 selectfont
0.000000 0.890625 moveto
/one glyphshow
5.999985 0.890625 moveto
/zero glyphshow
11.999969 0.890625 moveto
/zero glyphshow
17.999954 0.890625 moveto
/zero glyphshow
23.999939 0.890625 moveto
/zero glyphshow
grestore
gsave
/o {
gsave
newpath
translate
0.8 setlinewidth
1 setlinejoin

0 setlinecap

0 0 m
3.5 0 l

gsave
0.122 0.467 0.706 setrgbcolor
fill
grestore
stroke
grestore
} bind def
502.767 105.758 o
grestore
gsave
509.767466 101.656103 translate
0.000000 rotate
/STIXGeneral-Regular 12.0 selectfont
0.000000 0.890625 moveto
/two glyphshow
5.999985 0.890625 moveto
/zero glyphshow
11.999969 0.890625 moveto
/zero glyphshow
17.999954 0.890625 moveto
/zero glyphshow
23.999939 0.890625 moveto
/zero glyphshow
grestore
gsave
/o {
gsave
newpath
translate
0.8 setlinewidth
1 setlinejoin

0 setlinecap

0 0 m
3.5 0 l

gsave
0.122 0.467 0.706 setrgbcolor
fill
grestore
stroke
grestore
} bind def
502.767 151.761 o
grestore
gsave
509.767466 147.659435 translate
0.000000 rotate
/STIXGeneral-Regular 12.0 selectfont
0.000000 0.890625 moveto
/three glyphshow
5.999985 0.890625 moveto
/zero glyphshow
11.999969 0.890625 moveto
/zero glyphshow
17.999954 0.890625 moveto
/zero glyphshow
23.999939 0.890625 moveto
/zero glyphshow
grestore
gsave
/o {
gsave
newpath
translate
0.8 setlinewidth
1 setlinejoin

0 setlinecap

0 0 m
3.5 0 l

gsave
0.122 0.467 0.706 setrgbcolor
fill
grestore
stroke
grestore
} bind def
502.767 197.764 o
grestore
gsave
509.767466 193.662766 translate
0.000000 rotate
/STIXGeneral-Regular 12.0 selectfont
0.000000 0.890625 moveto
/four glyphshow
5.999985 0.890625 moveto
/zero glyphshow
11.999969 0.890625 moveto
/zero glyphshow
17.999954 0.890625 moveto
/zero glyphshow
23.999939 0.890625 moveto
/zero glyphshow
grestore
gsave
553.329966 134.370000 translate
90.000000 rotate
/STIXGeneral-Italic 14.0 selectfont
0.000000 0.859375 moveto
/N glyphshow
grestore
1.500 setlinewidth
[5.55 2.4] 0 setdash
gsave
451.567 195.528 51.2 41.606 clipbox
71.725794 50.493864 m
94.532232 52.840034 l
117.338669 56.865325 l
140.145107 62.008498 l
162.951545 67.818718 l
185.757982 74.176379 l
208.56442 83.427649 l
231.370858 90.498361 l
254.177295 101.769177 l
276.983733 110.744427 l
299.790171 121.035372 l
322.596608 127.061809 l
345.403046 136.547696 l
368.209484 151.747196 l
391.015921 168.874237 l
413.822359 184.055336 l
436.628797 192.690161 l
459.435234 212.039163 l
482.241672 228.246136 l
stroke
grestore
1.000 setlinewidth
[] 0 setdash
gsave
451.567 195.528 51.2 41.606 clipbox
/o {
gsave
newpath
translate
1.0 setlinewidth
1 setlinejoin

0 setlinecap

-3.5 -3.5 m
3.5 3.5 l
-3.5 3.5 m
3.5 -3.5 l

gsave
0.122 0.467 0.706 setrgbcolor
fill
grestore
stroke
grestore
} bind def
71.7258 50.4939 o
94.5322 52.84 o
117.339 56.8653 o
140.145 62.0085 o
162.952 67.8187 o
185.758 74.1764 o
208.564 83.4276 o
231.371 90.4984 o
254.177 101.769 o
276.984 110.744 o
299.79 121.035 o
322.597 127.062 o
345.403 136.548 o
368.209 151.747 o
391.016 168.874 o
413.822 184.055 o
436.629 192.69 o
459.435 212.039 o
482.242 228.246 o
grestore
0.800 setlinewidth
0 setlinejoin
2 setlinecap
0.000 setgray
gsave
51.2 41.60625 m
51.2 237.13375 l
stroke
grestore
gsave
502.767466 41.60625 m
502.767466 237.13375 l
stroke
grestore
gsave
51.2 41.60625 m
502.767466 41.60625 l
stroke
grestore
gsave
51.2 237.13375 m
502.767466 237.13375 l
stroke
grestore

end
showpage
